cloudstack-dev mailing list archives

Site index · List index
Message view « Date » · « Thread »
Top « Date » · « Thread »
From jenk...@cloudstack.org
Subject Build failed in Jenkins: build-master-noredist #4653
Date Tue, 15 Sep 2015 11:51:56 GMT
See <http://jenkins.buildacloud.org/job/build-master-noredist/4653/changes>

Changes:

[Boris Schrijver] Replaced all occurences of Charset.forName(UTF-8) with StringUtils.getPreferredCharset().

------------------------------------------
[...truncated 6099 lines...]
[debug] execute contextualize
[INFO] Using 'UTF-8' encoding to copy filtered resources.
[INFO] skip non existing resourceDirectory <http://jenkins.buildacloud.org/job/build-master-noredist/ws/plugins/user-authenticators/saml2/test/resources>
[INFO] Copying 3 resources
[INFO] 
[INFO] --- maven-compiler-plugin:3.2:testCompile (default-testCompile) @ cloud-plugin-user-authenticator-saml2
---
[INFO] Using 'UTF-8' encoding to copy filtered resources.
[INFO] skip non existing resourceDirectory <http://jenkins.buildacloud.org/job/build-master-noredist/ws/plugins/file-systems/netapp/test/resources>
[INFO] Copying 3 resources
[INFO] 
[INFO] --- maven-compiler-plugin:3.2:testCompile (default-testCompile) @ cloud-plugin-netapp
---
[INFO] Building jar: <http://jenkins.buildacloud.org/job/build-master-noredist/ws/plugins/network-elements/stratosphere-ssp/target/cloud-plugin-network-ssp-4.6.0-SNAPSHOT.jar>
[INFO] 
[INFO] No sources to compile
[INFO] 
[INFO] --- maven-surefire-plugin:2.18.1:test (default-test) @ cloud-plugin-netapp ---
[ERROR] Failed to execute goal org.apache.maven.plugins:maven-compiler-plugin:3.2:compile
(default-compile) on project cloud-plugin-network-vcs: Compilation failure: Compilation failure:
[ERROR] <http://jenkins.buildacloud.org/job/build-master-noredist/ws/plugins/network-elements/brocade-vcs/src/com/cloud/network/brocade/BrocadeVcsApi.java>:[95,11]
error: cannot find symbol
[ERROR] symbol:   class Output
[ERROR] location: class BrocadeVcsApi
[ERROR] <http://jenkins.buildacloud.org/job/build-master-noredist/ws/plugins/network-elements/brocade-vcs/src/com/cloud/network/brocade/BrocadeVcsApi.java>:[366,14]
error: cannot find symbol
[ERROR] symbol:   class Output
[ERROR] location: class BrocadeVcsApi
[ERROR] <http://jenkins.buildacloud.org/job/build-master-noredist/ws/plugins/network-elements/brocade-vcs/src/com/cloud/network/brocade/BrocadeVcsApi.java>:[423,14]
error: cannot find symbol
[ERROR] symbol:   class Output
[ERROR] location: class BrocadeVcsApi
[ERROR] <http://jenkins.buildacloud.org/job/build-master-noredist/ws/plugins/network-elements/brocade-vcs/src/com/cloud/network/brocade/BrocadeVcsApi.java>:[120,8]
error: cannot find symbol
[ERROR] symbol:   class PortProfileGlobal
[ERROR] location: class BrocadeVcsApi
[ERROR] <http://jenkins.buildacloud.org/job/build-master-noredist/ws/plugins/network-elements/brocade-vcs/src/com/cloud/network/brocade/BrocadeVcsApi.java>:[120,50]
error: cannot find symbol
[ERROR] symbol:   class PortProfileGlobal
[ERROR] location: class BrocadeVcsApi
[ERROR] <http://jenkins.buildacloud.org/job/build-master-noredist/ws/plugins/network-elements/brocade-vcs/src/com/cloud/network/brocade/BrocadeVcsApi.java>:[121,19]
error: cannot find symbol
[ERROR] symbol:   method setVlanProfile(<null>)
[ERROR] location: variable portProfile of type PortProfile
[ERROR] <http://jenkins.buildacloud.org/job/build-master-noredist/ws/plugins/network-elements/brocade-vcs/src/com/cloud/network/brocade/BrocadeVcsApi.java>:[122,8]
error: cannot find symbol
[ERROR] symbol:   class Activate
[ERROR] location: class BrocadeVcsApi
[ERROR] <http://jenkins.buildacloud.org/job/build-master-noredist/ws/plugins/network-elements/brocade-vcs/src/com/cloud/network/brocade/BrocadeVcsApi.java>:[122,32]
error: cannot find symbol
[ERROR] symbol:   class Activate
[ERROR] location: class BrocadeVcsApi
[ERROR] <http://jenkins.buildacloud.org/job/build-master-noredist/ws/plugins/network-elements/brocade-vcs/src/com/cloud/network/brocade/BrocadeVcsApi.java>:[135,34]
error: PortProfile() is not public in PortProfile; cannot be accessed from outside package
[ERROR] <http://jenkins.buildacloud.org/job/build-master-noredist/ws/plugins/network-elements/brocade-vcs/src/com/cloud/network/brocade/BrocadeVcsApi.java>:[136,19]
error: cannot find symbol
[ERROR] symbol:   method setName(String)
[ERROR] location: variable portProfile of type PortProfile
[ERROR] <http://jenkins.buildacloud.org/job/build-master-noredist/ws/plugins/network-elements/brocade-vcs/src/com/cloud/network/brocade/BrocadeVcsApi.java>:[149,8]
error: cannot find symbol
[ERROR] symbol:   class VlanProfile
[ERROR] location: class BrocadeVcsApi
[ERROR] <http://jenkins.buildacloud.org/job/build-master-noredist/ws/plugins/network-elements/brocade-vcs/src/com/cloud/network/brocade/BrocadeVcsApi.java>:[149,38]
error: cannot find symbol
[ERROR] symbol:   class VlanProfile
[ERROR] location: class BrocadeVcsApi
[ERROR] <http://jenkins.buildacloud.org/job/build-master-noredist/ws/plugins/network-elements/brocade-vcs/src/com/cloud/network/brocade/BrocadeVcsApi.java>:[164,8]
error: cannot find symbol
[ERROR] symbol:   class SwitchportBasic
[ERROR] location: class BrocadeVcsApi
[ERROR] <http://jenkins.buildacloud.org/job/build-master-noredist/ws/plugins/network-elements/brocade-vcs/src/com/cloud/network/brocade/BrocadeVcsApi.java>:[164,46]
error: cannot find symbol
[ERROR] symbol:   class SwitchportBasic
[ERROR] location: class BrocadeVcsApi
[ERROR] <http://jenkins.buildacloud.org/job/build-master-noredist/ws/plugins/network-elements/brocade-vcs/src/com/cloud/network/brocade/BrocadeVcsApi.java>:[165,22]
error: Basic is abstract; cannot be instantiated
[ERROR] <http://jenkins.buildacloud.org/job/build-master-noredist/ws/plugins/network-elements/brocade-vcs/src/com/cloud/network/brocade/BrocadeVcsApi.java>:[167,19]
error: cannot find symbol
[ERROR] symbol:   method getVlanProfile()
[ERROR] location: variable portProfile of type PortProfile
[ERROR] <http://jenkins.buildacloud.org/job/build-master-noredist/ws/plugins/network-elements/brocade-vcs/src/com/cloud/network/brocade/BrocadeVcsApi.java>:[170,12]
error: cannot find symbol
[ERROR] symbol:   class VlanProfile
[ERROR] location: class BrocadeVcsApi
[ERROR] <http://jenkins.buildacloud.org/job/build-master-noredist/ws/plugins/network-elements/brocade-vcs/src/com/cloud/network/brocade/BrocadeVcsApi.java>:[170,42]
error: cannot find symbol
[ERROR] symbol:   class VlanProfile
[ERROR] location: class BrocadeVcsApi
[ERROR] <http://jenkins.buildacloud.org/job/build-master-noredist/ws/plugins/network-elements/brocade-vcs/src/com/cloud/network/brocade/BrocadeVcsApi.java>:[171,12]
error: cannot find symbol
[ERROR] symbol:   class Switchport
[ERROR] location: class BrocadeVcsApi
[ERROR] <http://jenkins.buildacloud.org/job/build-master-noredist/ws/plugins/network-elements/brocade-vcs/src/com/cloud/network/brocade/BrocadeVcsApi.java>:[171,40]
error: cannot find symbol
[ERROR] symbol:   class Switchport
[ERROR] location: class BrocadeVcsApi
[ERROR] <http://jenkins.buildacloud.org/job/build-master-noredist/ws/plugins/network-elements/brocade-vcs/src/com/cloud/network/brocade/BrocadeVcsApi.java>:[172,12]
error: cannot find symbol
[ERROR] symbol:   class Mode
[ERROR] location: class BrocadeVcsApi
[ERROR] <http://jenkins.buildacloud.org/job/build-master-noredist/ws/plugins/network-elements/brocade-vcs/src/com/cloud/network/brocade/BrocadeVcsApi.java>:[172,28]
error: cannot find symbol
[ERROR] symbol:   class Mode
[ERROR] location: class BrocadeVcsApi
[ERROR] <http://jenkins.buildacloud.org/job/build-master-noredist/ws/plugins/network-elements/brocade-vcs/src/com/cloud/network/brocade/BrocadeVcsApi.java>:[180,34]
error: cannot find symbol
[ERROR] symbol:   class VlanProfile
[ERROR] location: class BrocadeVcsApi
[ERROR] <http://jenkins.buildacloud.org/job/build-master-noredist/ws/plugins/network-elements/brocade-vcs/src/com/cloud/network/brocade/BrocadeVcsApi.java>:[181,33]
error: cannot find symbol
[ERROR] symbol:   class Switchport
[ERROR] location: class BrocadeVcsApi
[ERROR] <http://jenkins.buildacloud.org/job/build-master-noredist/ws/plugins/network-elements/brocade-vcs/src/com/cloud/network/brocade/BrocadeVcsApi.java>:[182,16]
error: cannot find symbol
[ERROR] symbol:   class Trunk
[ERROR] location: class BrocadeVcsApi
[ERROR] <http://jenkins.buildacloud.org/job/build-master-noredist/ws/plugins/network-elements/brocade-vcs/src/com/cloud/network/brocade/BrocadeVcsApi.java>:[182,34]
error: cannot find symbol
[ERROR] symbol:   class Trunk
[ERROR] location: class BrocadeVcsApi
[ERROR] <http://jenkins.buildacloud.org/job/build-master-noredist/ws/plugins/network-elements/brocade-vcs/src/com/cloud/network/brocade/BrocadeVcsApi.java>:[183,16]
error: cannot find symbol
[ERROR] symbol:   class Allowed
[ERROR] location: class BrocadeVcsApi
[ERROR] <http://jenkins.buildacloud.org/job/build-master-noredist/ws/plugins/network-elements/brocade-vcs/src/com/cloud/network/brocade/BrocadeVcsApi.java>:[183,38]
error: cannot find symbol
[ERROR] symbol:   class Allowed
[ERROR] location: class BrocadeVcsApi
[INFO] 
[INFO] --- maven-site-plugin:3.1:attach-descriptor (attach-descriptor) @ cloud-plugin-network-ssp
---
[INFO] 
[INFO] --- maven-install-plugin:2.3.1:install (default-install) @ cloud-plugin-network-ssp
---
[INFO] Installing <http://jenkins.buildacloud.org/job/build-master-noredist/ws/plugins/network-elements/stratosphere-ssp/target/cloud-plugin-network-ssp-4.6.0-SNAPSHOT.jar>
to /home/jenkins/.m2/repository/org/apache/cloudstack/cloud-plugin-network-ssp/4.6.0-SNAPSHOT/cloud-plugin-network-ssp-4.6.0-SNAPSHOT.jar
[INFO] Installing <http://jenkins.buildacloud.org/job/build-master-noredist/ws/plugins/network-elements/stratosphere-ssp/pom.xml>
to /home/jenkins/.m2/repository/org/apache/cloudstack/cloud-plugin-network-ssp/4.6.0-SNAPSHOT/cloud-plugin-network-ssp-4.6.0-SNAPSHOT.pom
[ERROR] <http://jenkins.buildacloud.org/job/build-master-noredist/ws/plugins/network-elements/brocade-vcs/src/com/cloud/network/brocade/BrocadeVcsApi.java>:[184,23]
error: package Allowed does not exist
[ERROR] <http://jenkins.buildacloud.org/job/build-master-noredist/ws/plugins/network-elements/brocade-vcs/src/com/cloud/network/brocade/BrocadeVcsApi.java>:[184,54]
error: package Allowed does not exist
[ERROR] <http://jenkins.buildacloud.org/job/build-master-noredist/ws/plugins/network-elements/brocade-vcs/src/com/cloud/network/brocade/BrocadeVcsApi.java>:[205,8]
error: cannot find symbol
[ERROR] symbol:   class InterfaceVlan
[ERROR] location: class BrocadeVcsApi
[ERROR] <http://jenkins.buildacloud.org/job/build-master-noredist/ws/plugins/network-elements/brocade-vcs/src/com/cloud/network/brocade/BrocadeVcsApi.java>:[205,42]
error: cannot find symbol
[ERROR] symbol:   class InterfaceVlan
[ERROR] location: class BrocadeVcsApi
[ERROR] <http://jenkins.buildacloud.org/job/build-master-noredist/ws/plugins/network-elements/brocade-vcs/src/com/cloud/network/brocade/BrocadeVcsApi.java>:[206,8]
error: cannot find symbol
[ERROR] symbol:   class Interface
[ERROR] location: class BrocadeVcsApi
[ERROR] <http://jenkins.buildacloud.org/job/build-master-noredist/ws/plugins/network-elements/brocade-vcs/src/com/cloud/network/brocade/BrocadeVcsApi.java>:[206,37]
error: cannot find symbol
[ERROR] symbol:   class Interface
[ERROR] location: class BrocadeVcsApi
[ERROR] <http://jenkins.buildacloud.org/job/build-master-noredist/ws/plugins/network-elements/brocade-vcs/src/com/cloud/network/brocade/BrocadeVcsApi.java>:[207,20]
error: Vlan is abstract; cannot be instantiated
[ERROR] <http://jenkins.buildacloud.org/job/build-master-noredist/ws/plugins/network-elements/brocade-vcs/src/com/cloud/network/brocade/BrocadeVcsApi.java>:[208,12]
error: cannot find symbol
[ERROR] symbol:   method setName(int)
[ERROR] location: variable vlan of type Vlan
[ERROR] <http://jenkins.buildacloud.org/job/build-master-noredist/ws/plugins/network-elements/brocade-vcs/src/com/cloud/network/brocade/BrocadeVcsApi.java>:[221,8]
error: cannot find symbol
[ERROR] symbol:   class PortProfileGlobal
[ERROR] location: class BrocadeVcsApi
[ERROR] <http://jenkins.buildacloud.org/job/build-master-noredist/ws/plugins/network-elements/brocade-vcs/src/com/cloud/network/brocade/BrocadeVcsApi.java>:[221,50]
error: cannot find symbol
[INFO] Building jar: <http://jenkins.buildacloud.org/job/build-master-noredist/ws/plugins/database/mysql-ha/target/cloud-plugin-database-mysqlha-4.6.0-SNAPSHOT.jar>
[INFO] Building jar: <http://jenkins.buildacloud.org/job/build-master-noredist/ws/plugins/user-authenticators/sha256salted/target/cloud-plugin-user-authenticator-sha256salted-4.6.0-SNAPSHOT.jar>
[INFO] Changes detected - recompiling the module!
[INFO] Compiling 8 source files to <http://jenkins.buildacloud.org/job/build-master-noredist/ws/plugins/user-authenticators/saml2/target/test-classes>
[ERROR] symbol:   class PortProfileGlobal
[ERROR] location: class BrocadeVcsApi
[ERROR] <http://jenkins.buildacloud.org/job/build-master-noredist/ws/plugins/network-elements/brocade-vcs/src/com/cloud/network/brocade/BrocadeVcsApi.java>:[222,34]
error: PortProfile() is not public in PortProfile; cannot be accessed from outside package
[ERROR] <http://jenkins.buildacloud.org/job/build-master-noredist/ws/plugins/network-elements/brocade-vcs/src/com/cloud/network/brocade/BrocadeVcsApi.java>:[223,19]
error: cannot find symbol
[ERROR] symbol:   method setName(String)
[ERROR] location: variable portProfile of type PortProfile
[ERROR] <http://jenkins.buildacloud.org/job/build-master-noredist/ws/plugins/network-elements/brocade-vcs/src/com/cloud/network/brocade/BrocadeVcsApi.java>:[224,8]
error: cannot find symbol
[ERROR] symbol:   class Static
[ERROR] location: class BrocadeVcsApi
[ERROR] <http://jenkins.buildacloud.org/job/build-master-noredist/ws/plugins/network-elements/brocade-vcs/src/com/cloud/network/brocade/BrocadeVcsApi.java>:[224,31]
error: cannot find symbol
[ERROR] symbol:   class Static
[ERROR] location: class BrocadeVcsApi
[ERROR] <http://jenkins.buildacloud.org/job/build-master-noredist/ws/plugins/network-elements/brocade-vcs/src/com/cloud/network/brocade/BrocadeVcsApi.java>:[238,8]
error: cannot find symbol
[ERROR] symbol:   class PortProfileGlobal
[ERROR] location: class BrocadeVcsApi
[ERROR] <http://jenkins.buildacloud.org/job/build-master-noredist/ws/plugins/network-elements/brocade-vcs/src/com/cloud/network/brocade/BrocadeVcsApi.java>:[238,50]
error: cannot find symbol
[ERROR] symbol:   class PortProfileGlobal
[ERROR] location: class BrocadeVcsApi
[ERROR] <http://jenkins.buildacloud.org/job/build-master-noredist/ws/plugins/network-elements/brocade-vcs/src/com/cloud/network/brocade/BrocadeVcsApi.java>:[239,34]
error: PortProfile() is not public in PortProfile; cannot be accessed from outside package
[ERROR] <http://jenkins.buildacloud.org/job/build-master-noredist/ws/plugins/network-elements/brocade-vcs/src/com/cloud/network/brocade/BrocadeVcsApi.java>:[240,19]
error: cannot find symbol
[ERROR] symbol:   method setName(String)
[ERROR] location: variable portProfile of type PortProfile
[ERROR] <http://jenkins.buildacloud.org/job/build-master-noredist/ws/plugins/network-elements/brocade-vcs/src/com/cloud/network/brocade/BrocadeVcsApi.java>:[241,8]
error: cannot find symbol
[ERROR] symbol:   class Static
[ERROR] location: class BrocadeVcsApi
[ERROR] <http://jenkins.buildacloud.org/job/build-master-noredist/ws/plugins/network-elements/brocade-vcs/src/com/cloud/network/brocade/BrocadeVcsApi.java>:[241,31]
error: cannot find symbol
[ERROR] symbol:   class Static
[ERROR] location: class BrocadeVcsApi
[ERROR] <http://jenkins.buildacloud.org/job/build-master-noredist/ws/plugins/network-elements/brocade-vcs/src/com/cloud/network/brocade/BrocadeVcsApi.java>:[269,8]
error: cannot find symbol
[ERROR] symbol:   class InterfaceVlan
[ERROR] location: class BrocadeVcsApi
[ERROR] <http://jenkins.buildacloud.org/job/build-master-noredist/ws/plugins/network-elements/brocade-vcs/src/com/cloud/network/brocade/BrocadeVcsApi.java>:[269,42]
error: cannot find symbol
[ERROR] symbol:   class InterfaceVlan
[ERROR] location: class BrocadeVcsApi
[ERROR] <http://jenkins.buildacloud.org/job/build-master-noredist/ws/plugins/network-elements/brocade-vcs/src/com/cloud/network/brocade/BrocadeVcsApi.java>:[270,8]
error: cannot find symbol
[ERROR] symbol:   class Interface
[ERROR] location: class BrocadeVcsApi
[ERROR] <http://jenkins.buildacloud.org/job/build-master-noredist/ws/plugins/network-elements/brocade-vcs/src/com/cloud/network/brocade/BrocadeVcsApi.java>:[270,37]
error: cannot find symbol
[ERROR] symbol:   class Interface
[ERROR] location: class BrocadeVcsApi
[ERROR] <http://jenkins.buildacloud.org/job/build-master-noredist/ws/plugins/network-elements/brocade-vcs/src/com/cloud/network/brocade/BrocadeVcsApi.java>:[271,20]
error: Vlan is abstract; cannot be instantiated
[ERROR] <http://jenkins.buildacloud.org/job/build-master-noredist/ws/plugins/network-elements/brocade-vcs/src/com/cloud/network/brocade/BrocadeVcsApi.java>:[272,12]
error: cannot find symbol
[ERROR] symbol:   method setOperation(String)
[ERROR] location: variable vlan of type Vlan
[ERROR] <http://jenkins.buildacloud.org/job/build-master-noredist/ws/plugins/network-elements/brocade-vcs/src/com/cloud/network/brocade/BrocadeVcsApi.java>:[273,12]
error: cannot find symbol
[ERROR] symbol:   method setName(int)
[ERROR] location: variable vlan of type Vlan
[ERROR] <http://jenkins.buildacloud.org/job/build-master-noredist/ws/plugins/network-elements/brocade-vcs/src/com/cloud/network/brocade/BrocadeVcsApi.java>:[285,8]
error: cannot find symbol
[ERROR] symbol:   class PortProfileGlobal
[ERROR] location: class BrocadeVcsApi
[ERROR] <http://jenkins.buildacloud.org/job/build-master-noredist/ws/plugins/network-elements/brocade-vcs/src/com/cloud/network/brocade/BrocadeVcsApi.java>:[285,50]
error: cannot find symbol
[ERROR] symbol:   class PortProfileGlobal
[ERROR] location: class BrocadeVcsApi
[ERROR] <http://jenkins.buildacloud.org/job/build-master-noredist/ws/plugins/network-elements/brocade-vcs/src/com/cloud/network/brocade/BrocadeVcsApi.java>:[286,34]
error: PortProfile() is not public in PortProfile; cannot be accessed from outside package
[ERROR] <http://jenkins.buildacloud.org/job/build-master-noredist/ws/plugins/network-elements/brocade-vcs/src/com/cloud/network/brocade/BrocadeVcsApi.java>:[287,19]
error: cannot find symbol
[ERROR] symbol:   method setName(String)
[ERROR] location: variable portProfile of type PortProfile
[ERROR] <http://jenkins.buildacloud.org/job/build-master-noredist/ws/plugins/network-elements/brocade-vcs/src/com/cloud/network/brocade/BrocadeVcsApi.java>:[288,8]
error: cannot find symbol
[ERROR] symbol:   class Activate
[ERROR] location: class BrocadeVcsApi
[ERROR] <http://jenkins.buildacloud.org/job/build-master-noredist/ws/plugins/network-elements/brocade-vcs/src/com/cloud/network/brocade/BrocadeVcsApi.java>:[288,32]
error: cannot find symbol
[ERROR] symbol:   class Activate
[ERROR] location: class BrocadeVcsApi
[ERROR] <http://jenkins.buildacloud.org/job/build-master-noredist/ws/plugins/network-elements/brocade-vcs/src/com/cloud/network/brocade/BrocadeVcsApi.java>:[302,34]
error: PortProfile() is not public in PortProfile; cannot be accessed from outside package
[ERROR] <http://jenkins.buildacloud.org/job/build-master-noredist/ws/plugins/network-elements/brocade-vcs/src/com/cloud/network/brocade/BrocadeVcsApi.java>:[303,19]
error: cannot find symbol
[ERROR] symbol:   method setName(String)
[ERROR] location: variable portProfile of type PortProfile
[ERROR] <http://jenkins.buildacloud.org/job/build-master-noredist/ws/plugins/network-elements/brocade-vcs/src/com/cloud/network/brocade/BrocadeVcsApi.java>:[304,19]
error: cannot find symbol
[ERROR] symbol:   method setOperation(String)
[ERROR] location: variable portProfile of type PortProfile
[ERROR] <http://jenkins.buildacloud.org/job/build-master-noredist/ws/plugins/network-elements/brocade-vcs/src/com/cloud/network/brocade/BrocadeVcsApi.java>:[368,8]
error: cannot find symbol
[ERROR] symbol:   class Output
[ERROR] location: class BrocadeVcsApi
[ERROR] <http://jenkins.buildacloud.org/job/build-master-noredist/ws/plugins/network-elements/brocade-vcs/src/com/cloud/network/brocade/BrocadeVcsApi.java>:[370,58]
error: cannot find symbol
[ERROR] symbol:   class Output
[ERROR] location: class BrocadeVcsApi
[ERROR] <http://jenkins.buildacloud.org/job/build-master-noredist/ws/plugins/network-elements/brocade-vcs/src/com/cloud/network/brocade/BrocadeVcsApi.java>:[377,34]
error: cannot find symbol
[ERROR] symbol:   class Output
[ERROR] location: class BrocadeVcsApi
[ERROR] <http://jenkins.buildacloud.org/job/build-master-noredist/ws/plugins/network-elements/brocade-vcs/src/com/cloud/network/brocade/BrocadeVcsApi.java>:[378,26]
error: cannot find symbol
[ERROR] -> [Help 1]
[ERROR] 
[ERROR] To see the full stack trace of the errors, re-run Maven with the -e switch.
[ERROR] Re-run Maven using the -X switch to enable full debug logging.
[ERROR] 
[ERROR] For more information about the errors and possible solutions, please read the following
articles:
[ERROR] [Help 1] http://cwiki.apache.org/confluence/display/MAVEN/MojoFailureException
[ERROR] 
[ERROR] After correcting the problems, you can resume the build with the command
[ERROR]   mvn <goals> -rf :cloud-plugin-network-vcs
[INFO] 
[INFO] --- maven-site-plugin:3.1:attach-descriptor (attach-descriptor) @ cloud-plugin-user-authenticator-sha256salted
---
[INFO] 
[INFO] --- maven-jar-plugin:2.5:jar (default-jar) @ cloud-plugin-netapp ---
[INFO] --- maven-site-plugin:3.1:attach-descriptor (attach-descriptor) @ cloud-plugin-hypervisor-hyperv
---
[INFO] Building jar: <http://jenkins.buildacloud.org/job/build-master-noredist/ws/plugins/network-elements/palo-alto/target/cloud-plugin-network-palo-alto-4.6.0-SNAPSHOT.jar>
[INFO] Building jar: <http://jenkins.buildacloud.org/job/build-master-noredist/ws/plugins/network-elements/opendaylight/target/cloud-plugin-network-opendaylight-4.6.0-SNAPSHOT.jar>
[INFO] 
[INFO] --- maven-site-plugin:3.1:attach-descriptor (attach-descriptor) @ cloud-plugin-database-mysqlha
---
[INFO] 
[INFO] --- maven-site-plugin:3.1:attach-descriptor (attach-descriptor) @ cloud-plugin-network-palo-alto
---
[INFO] 
[INFO] --- maven-site-plugin:3.1:attach-descriptor (attach-descriptor) @ cloud-plugin-network-opendaylight
---
Destroying 13 processes
Destroying process..
Destroying process..
Destroying process..
Destroying process..
Destroying process..
Destroying process..
Destroying process..
Destroying process..
Destroying process..
Destroying process..
Destroying process..
Destroying process..
Destroying process..
Destroyed 13 processes
Build step 'Invoke top-level Maven targets' marked build as failure
Archiving artifacts

Mime
View raw message