cloudstack-dev mailing list archives

Site index · List index
Message view « Date » · « Thread »
Top « Date » · « Thread »
From Tomasz Zięba <t.a.zi...@gmail.com>
Subject acs github branch 4.5 - compiling error
Date Mon, 10 Aug 2015 11:32:40 GMT
Hello,

We have problems with compiling 4.5 branch.
We think that this problem occurs for last week.

Cound someone confirm this  ?

Step to reproduce:
1. Download source
https://github.com/apache/cloudstack/archive/4.5.zip

2. mvn install
3. errror

Running rdpclient.MockServerTest
Error in mock server: Received fatal alert: unexpected_message
javax.net.ssl.SSLException: Received fatal alert: unexpected_message
        at sun.security.ssl.Alerts.getSSLException(Alerts.java:208)
        at sun.security.ssl.Alerts.getSSLException(Alerts.java:154)
        at sun.security.ssl.SSLSocketImpl.recvAlert(SSLSocketImpl.java:1991)
        at
sun.security.ssl.SSLSocketImpl.readRecord(SSLSocketImpl.java:1098)
        at
sun.security.ssl.SSLSocketImpl.performInitialHandshake(SSLSocketImpl.java:1344)
        at
sun.security.ssl.SSLSocketImpl.startHandshake(SSLSocketImpl.java:1371)
        at
sun.security.ssl.SSLSocketImpl.startHandshake(SSLSocketImpl.java:1355)
        at streamer.debug.MockServer.run(MockServer.java:120)
        at java.lang.Thread.run(Thread.java:745)
Tests run: 2, Failures: 0, Errors: 1, Skipped: 0, Time elapsed: 1.143 sec
<<< FAILURE!

Results :

Tests in error:
  testIsMockServerCanUpgradeConnectionToSsl(rdpclient.MockServerTest):
Failed to find any kerberos service ticket for host/test02@EXAMPLE.COM

Tests run: 404, Failures: 0, Errors: 1, Skipped: 0


[INFO] Apache CloudStack Client UI ....................... SUCCESS [14.814s]
[INFO] Apache CloudStack Console Proxy - RDP Client ...... FAILURE [20.100s]
[INFO] Apache CloudStack Console Proxy ................... SKIPPED
[INFO] Apache CloudStack Console Proxy - Server .......... SKIPPED
[INFO] Apache CloudStack Framework - QuickCloud .......... SKIPPED
[INFO]
------------------------------------------------------------------------
[INFO] BUILD FAILURE
[INFO]
------------------------------------------------------------------------
[INFO] Total time: 19:49.102s
[INFO] Finished at: Mon Aug 10 13:22:21 CEST 2015
[INFO] Final Memory: 76M/290M
[INFO]
------------------------------------------------------------------------
[ERROR] Failed to execute goal
org.apache.maven.plugins:maven-surefire-plugin:2.12:test (default-test) on
project cloudstack-service-console-proxy-rdpclient: There are test failures.
[ERROR]
[ERROR] Please refer to
/root/cs452/cloudstack-4.5/services/console-proxy-rdp/rdpconsole/target/surefire-reports
for the individual test results.
[ERROR] -> [Help 1]
[ERROR]
[ERROR] To see the full stack trace of the errors, re-run Maven with the -e
switch.
[ERROR] Re-run Maven using the -X switch to enable full debug logging.
[ERROR]
[ERROR] For more information about the errors and possible solutions,
please read the following articles:
[ERROR] [Help 1]
http://cwiki.apache.org/confluence/display/MAVEN/MojoFailureException
[ERROR]
[ERROR] After correcting the problems, you can resume the build with the
command
[ERROR]   mvn <goals> -rf :cloudstack-service-console-proxy-rdpclient


-- 
Regards,
Tomasz Zięba
Twitter: @TZieba
LinkedIn: pl.linkedin.com/pub/tomasz-zięba-ph-d/3b/7a8/ab6/
<http://pl.linkedin.com/pub/tomasz-zi%C4%99ba-ph-d/3b/7a8/ab6/>

Mime
  • Unnamed multipart/alternative (inline, None, 0 bytes)
View raw message