cloudstack-dev mailing list archives

Site index · List index
Message view « Date » · « Thread »
Top « Date » · « Thread »
From jenk...@cloudstack.org
Subject Build failed in Jenkins: build-master-slowbuild #2092
Date Tue, 18 Aug 2015 23:07:13 GMT
See <http://jenkins.buildacloud.org/job/build-master-slowbuild/2092/>

------------------------------------------
[...truncated 25929 lines...]
[INFO] Nothing to compile - all classes are up to date
[INFO] 
[INFO] >>> findbugs-maven-plugin:3.0.1:check (cloudstack-findbugs) @ cloud-plugin-network-srx
>>>
[INFO] 
[INFO] --- findbugs-maven-plugin:3.0.1:findbugs (findbugs) @ cloud-plugin-network-srx ---
[INFO] Fork Value is true
[INFO] Done FindBugs Analysis....
[INFO] 
[INFO] <<< findbugs-maven-plugin:3.0.1:check (cloudstack-findbugs) @ cloud-plugin-network-srx
<<<
[INFO] 
[INFO] --- findbugs-maven-plugin:3.0.1:check (cloudstack-findbugs) @ cloud-plugin-network-srx
---
[INFO] BugInstance size is 0
[INFO] Error size is 0
[INFO] No errors/warnings found
[INFO] 
[INFO] --- cobertura-maven-plugin:2.6:instrument (default-cli) @ cloud-plugin-network-srx
---
[INFO] Cobertura 2.0.3 - GNU GPL License (NO WARRANTY) - See COPYRIGHT file

[ERROR] Aug 18, 2015 11:10:57 PM net.sourceforge.cobertura.coveragedata.CoverageDataFileHandler
saveCoverageData
INFO: Cobertura: Saved information on 21 classes.

[INFO] Instrumentation was successful.
[INFO] NOT adding cobertura ser file to attached artifacts list.
[INFO] 
[INFO] --- maven-resources-plugin:2.5:testResources (default-testResources) @ cloud-plugin-network-srx
---
[debug] execute contextualize
[INFO] Using 'UTF-8' encoding to copy filtered resources.
[INFO] skip non existing resourceDirectory <http://jenkins.buildacloud.org/job/build-master-slowbuild/ws/plugins/network-elements/juniper-srx/test/resources>
[INFO] Copying 3 resources
[INFO] Copying 3 resources
[INFO] 
[INFO] --- maven-compiler-plugin:3.2:testCompile (default-testCompile) @ cloud-plugin-network-srx
---
[INFO] No sources to compile
[INFO] 
[INFO] --- maven-surefire-plugin:2.18.1:test (default-test) @ cloud-plugin-network-srx ---
[INFO] 
[INFO] <<< cobertura-maven-plugin:2.6:cobertura (default-cli) @ cloud-plugin-network-srx
<<<
[INFO] 
[INFO] --- cobertura-maven-plugin:2.6:cobertura (default-cli) @ cloud-plugin-network-srx ---
[INFO] Cobertura 2.0.3 - GNU GPL License (NO WARRANTY) - See COPYRIGHT file
[cobertura] INFO  [main] net.sourceforge.cobertura.reporting.html.HTMLReport - Data file does
not contain instrumentation information for the file com/cloud/network/element/JuniperSRXFirewallElementService.java.
 Ensure this class was instrumented, and this data file contains the instrumentation information.
Report time: 1590ms

[ERROR] Aug 18, 2015 11:10:57 PM net.sourceforge.cobertura.coveragedata.CoverageDataFileHandler
loadCoverageData
INFO: Cobertura: Loaded information on 21 classes.

[INFO] Cobertura Report generation was successful.
[INFO] Cobertura 2.0.3 - GNU GPL License (NO WARRANTY) - See COPYRIGHT file
Report time: 1190ms

[ERROR] Aug 18, 2015 11:10:59 PM net.sourceforge.cobertura.coveragedata.CoverageDataFileHandler
loadCoverageData
INFO: Cobertura: Loaded information on 21 classes.

[INFO] Cobertura Report generation was successful.
[INFO]                                                                         
[INFO] ------------------------------------------------------------------------
[INFO] Building Apache CloudStack Plugin - Nuage VSP 4.6.0-SNAPSHOT
[INFO] ------------------------------------------------------------------------
[WARNING] The POM for org.eclipse.m2e:lifecycle-mapping:jar:1.0.0 is missing, no dependency
information available
[WARNING] Failed to retrieve plugin descriptor for org.eclipse.m2e:lifecycle-mapping:1.0.0:
Plugin org.eclipse.m2e:lifecycle-mapping:1.0.0 or one of its dependencies could not be resolved:
Failed to read artifact descriptor for org.eclipse.m2e:lifecycle-mapping:jar:1.0.0
[INFO] 
[INFO] --- maven-clean-plugin:2.5:clean (default-clean) @ cloud-plugin-network-vsp ---
[INFO] Deleting <http://jenkins.buildacloud.org/job/build-master-slowbuild/ws/plugins/network-elements/nuage-vsp/target>
(includes = [**/*], excludes = [])
[INFO] Deleting <http://jenkins.buildacloud.org/job/build-master-slowbuild/ws/plugins/network-elements/nuage-vsp>
(includes = [target, dist], excludes = [])
[INFO] 
[INFO] --- maven-checkstyle-plugin:2.11:check (cloudstack-checkstyle) @ cloud-plugin-network-vsp
---
[INFO] Starting audit...
Audit done.

[INFO] 
[INFO] --- maven-remote-resources-plugin:1.3:process (default) @ cloud-plugin-network-vsp
---
[INFO] 
[INFO] --- maven-resources-plugin:2.5:resources (default-resources) @ cloud-plugin-network-vsp
---
[debug] execute contextualize
[INFO] Using 'UTF-8' encoding to copy filtered resources.
[INFO] Copying 2 resources
[INFO] Copying 3 resources
[INFO] 
[INFO] --- maven-compiler-plugin:3.2:compile (default-compile) @ cloud-plugin-network-vsp
---
[INFO] Changes detected - recompiling the module!
[INFO] Compiling 43 source files to <http://jenkins.buildacloud.org/job/build-master-slowbuild/ws/plugins/network-elements/nuage-vsp/target/classes>
[INFO] -------------------------------------------------------------
[ERROR] COMPILATION ERROR : 
[INFO] -------------------------------------------------------------
[ERROR] <http://jenkins.buildacloud.org/job/build-master-slowbuild/ws/plugins/network-elements/nuage-vsp/src/com/cloud/network/guru/NuageVspGuestNetworkGuru.java>:[291,25]
error: cannot find symbol
[ERROR]   symbol:   method getIp4Address()
  location: variable nic of type NicProfile
<http://jenkins.buildacloud.org/job/build-master-slowbuild/ws/plugins/network-elements/nuage-vsp/src/com/cloud/network/guru/NuageVspGuestNetworkGuru.java>:[302,131]
error: cannot find symbol
[ERROR]   symbol:   method getIp4Address()
  location: variable nic of type NicProfile
<http://jenkins.buildacloud.org/job/build-master-slowbuild/ws/plugins/network-elements/nuage-vsp/src/com/cloud/network/guru/NuageVspGuestNetworkGuru.java>:[312,102]
error: cannot find symbol
[ERROR]   symbol:   method getIp4Address()
  location: variable nic of type NicProfile
<http://jenkins.buildacloud.org/job/build-master-slowbuild/ws/plugins/network-elements/nuage-vsp/src/com/cloud/network/guru/NuageVspGuestNetworkGuru.java>:[386,23]
error: cannot find symbol
[ERROR]   symbol:   method setIp4Address(String)
  location: variable nic of type NicProfile
<http://jenkins.buildacloud.org/job/build-master-slowbuild/ws/plugins/network-elements/nuage-vsp/src/com/cloud/network/guru/NuageVspGuestNetworkGuru.java>:[387,23]
error: cannot find symbol
[ERROR]   symbol:   method setGateway(String)
  location: variable nic of type NicProfile
<http://jenkins.buildacloud.org/job/build-master-slowbuild/ws/plugins/network-elements/nuage-vsp/src/com/cloud/network/guru/NuageVspGuestNetworkGuru.java>:[388,23]
error: cannot find symbol
[INFO] 6 errors 
[INFO] -------------------------------------------------------------
[INFO] ------------------------------------------------------------------------
[INFO] Reactor Summary:
[INFO] 
[INFO] Apache CloudStack Developer Tools - Checkstyle Configuration  SUCCESS [1.719s]
[INFO] Apache CloudStack ................................. SUCCESS [2.161s]
[INFO] Apache CloudStack Maven Conventions Parent ........ SUCCESS [0.769s]
[INFO] Apache CloudStack Framework - Managed Context ..... SUCCESS [22.792s]
[INFO] Apache CloudStack Utils ........................... SUCCESS [1:26.795s]
[INFO] Apache CloudStack Framework ....................... SUCCESS [0.107s]
[INFO] Apache CloudStack Framework - Event Notification .. SUCCESS [52.865s]
[INFO] Apache CloudStack Framework - Configuration ....... SUCCESS [26.687s]
[INFO] Apache CloudStack API ............................. SUCCESS [1:57.958s]
[INFO] Apache CloudStack Framework - REST ................ SUCCESS [15.914s]
[INFO] Apache CloudStack Framework - IPC ................. SUCCESS [43.957s]
[INFO] Apache CloudStack Cloud Engine .................... SUCCESS [1.133s]
[INFO] Apache CloudStack Cloud Engine API ................ SUCCESS [29.253s]
[INFO] Apache CloudStack Framework - Security ............ SUCCESS [24.419s]
[INFO] Apache CloudStack Core ............................ SUCCESS [1:16.147s]
[INFO] Apache CloudStack Agents .......................... SUCCESS [48.077s]
[INFO] Apache CloudStack Framework - Clustering .......... SUCCESS [32.850s]
[INFO] Apache CloudStack Framework - Event Notification .. SUCCESS [13.582s]
[INFO] Apache CloudStack Cloud Engine Schema Component ... SUCCESS [2:07.715s]
[INFO] Apache CloudStack Framework - Jobs ................ SUCCESS [40.884s]
[INFO] Apache CloudStack Cloud Engine Internal Components API  SUCCESS [24.650s]
[INFO] Apache CloudStack Server .......................... SUCCESS [4:01.297s]
[INFO] Apache CloudStack Usage Server .................... SUCCESS [45.849s]
[INFO] Apache CloudStack Cloud Engine Orchestration Component  SUCCESS [1:26.631s]
[INFO] Apache CloudStack Cloud Services .................. SUCCESS [0.074s]
[INFO] Apache CloudStack Secondary Storage ............... SUCCESS [0.425s]
[INFO] Apache CloudStack Secondary Storage Service ....... SUCCESS [55.452s]
[INFO] Apache CloudStack Engine Storage Component ........ SUCCESS [48.611s]
[INFO] Apache CloudStack Engine Storage Volume Component . SUCCESS [31.382s]
[INFO] Apache CloudStack Engine Storage Image Component .. SUCCESS [26.034s]
[INFO] Apache CloudStack Engine Storage Data Motion Component  SUCCESS [22.643s]
[INFO] Apache CloudStack Engine Storage Cache Component .. SUCCESS [23.165s]
[INFO] Apache CloudStack Engine Storage Snapshot Component  SUCCESS [35.255s]
[INFO] Apache CloudStack Cloud Engine API ................ SUCCESS [11.795s]
[INFO] Apache CloudStack Cloud Engine Service ............ SUCCESS [6.579s]
[INFO] Apache CloudStack Plugin POM ...................... SUCCESS [0.787s]
[INFO] Apache CloudStack Plugin - API Rate Limit ......... SUCCESS [26.817s]
[INFO] Apache CloudStack Plugin - Storage Volume default provider  SUCCESS [23.748s]
[INFO] Apache CloudStack Plugin - Storage Volume SolidFire Provider  SUCCESS [36.598s]
[INFO] Apache CloudStack Plugin - API SolidFire .......... SUCCESS [16.741s]
[INFO] Apache CloudStack Plugin - API Discovery .......... SUCCESS [23.242s]
[INFO] Apache CloudStack Plugin - ACL Static Role Based .. SUCCESS [16.534s]
[INFO] Apache CloudStack Plugin - Host Anti-Affinity Processor  SUCCESS [17.126s]
[INFO] Apache CloudStack Plugin - Explicit Dedication Processor  SUCCESS [21.371s]
[INFO] Apache CloudStack Plugin - User Concentrated Pod Deployment Planner  SUCCESS [16.123s]
[INFO] Apache CloudStack Plugin - User Dispersing Deployment Planner  SUCCESS [17.504s]
[INFO] Apache CloudStack Plugin - Implicit Dedication Planner  SUCCESS [27.883s]
[INFO] Apache CloudStack Plugin - Skip Heurestics Planner  SUCCESS [14.894s]
[INFO] Apache CloudStack Plugin - Host Allocator Random .. SUCCESS [17.488s]
[INFO] Apache CloudStack Plugin - Dedicated Resources .... SUCCESS [33.410s]
[INFO] Apache CloudStack Plugin - Hypervisor OracleVM .... SUCCESS [33.301s]
[INFO] Apache CloudStack Plugin - Open vSwitch ........... SUCCESS [34.582s]
[INFO] Apache CloudStack Plugin - Hypervisor XenServer ... SUCCESS [1:19.701s]
[INFO] Apache CloudStack Plugin - Hypervisor KVM ......... SUCCESS [1:16.798s]
[INFO] Apache CloudStack Plugin - RabbitMQ Event Bus ..... SUCCESS [22.196s]
[INFO] Apache CloudStack Plugin - In Memory Event Bus .... SUCCESS [27.218s]
[INFO] Apache CloudStack Plugin - Kafka Event Bus ........ SUCCESS [15.828s]
[INFO] Apache CloudStack Plugin - Hypervisor Baremetal ... SUCCESS [48.081s]
[INFO] Apache CloudStack Plugin - Hypervisor UCS ......... SUCCESS [33.037s]
[INFO] Apache CloudStack Plugin - Hypervisor Hyper-V ..... SUCCESS [40.449s]
[INFO] Apache CloudStack Plugin - Hypervisor OracleVM3 ... SUCCESS [1:21.518s]
[INFO] Apache CloudStack Plugin - Network Elastic Load Balancer  SUCCESS [36.376s]
[INFO] Apache CloudStack Plugin - Network Internal Load Balancer  SUCCESS [45.218s]
[INFO] Apache CloudStack Framework - Spring Life Cycle ... SUCCESS [22.070s]
[INFO] Apache CloudStack Plugin - Network Juniper Contrail  SUCCESS [1:07.833s]
[INFO] Apache CloudStack Plugin - Palo Alto .............. SUCCESS [40.387s]
[INFO] Apache CloudStack Plugin - Network Netscaler ...... SUCCESS [57.305s]
[INFO] Apache CloudStack Plugin - Network Nicira NVP ..... SUCCESS [56.054s]
[INFO] Apache CloudStack Plugin - BigSwitch Virtual Network Segment  SUCCESS [48.534s]
[INFO] Apache CloudStack Plugin - Network Brocade VCS .... SUCCESS [40.439s]
[INFO] Apache CloudStack Plugin - Midokura Midonet ....... SUCCESS [35.684s]
[INFO] Apache CloudStack Plugin - Stratosphere SSP ....... SUCCESS [33.385s]
[INFO] Apache CloudStack Plugin - Network Opendaylight ... SUCCESS [2:41.542s]
[INFO] Apache CloudStack Plugin - Storage Allocator Random  SUCCESS [2:10.429s]
[INFO] Apache CloudStack Plugin - User Authenticator LDAP  SUCCESS [1:23.140s]
[INFO] Apache CloudStack Plugin - User Authenticator MD5 . SUCCESS [24.315s]
[INFO] Apache CloudStack Plugin - User Authenticator PBKDF2-SHA-256  SUCCESS [37.019s]
[INFO] Apache CloudStack Plugin - User Authenticator Plain Text  SUCCESS [32.000s]
[INFO] Apache CloudStack Plugin - User Authenticator SAML2  SUCCESS [2:19.288s]
[INFO] Apache CloudStack Plugin - User Authenticator SHA256 Salted  SUCCESS [20.942s]
[INFO] Apache CloudStack Plugin - Dns Notifier Example ... SUCCESS [13.540s]
[INFO] Apache CloudStack Plugin - Storage Image S3 ....... SUCCESS [18.441s]
[INFO] Apache CloudStack Plugin - Storage Image Swift provider  SUCCESS [18.025s]
[INFO] Apache CloudStack Plugin - Storage Image default provider  SUCCESS [18.659s]
[INFO] Apache CloudStack Plugin - Storage Image sample provider  SUCCESS [16.811s]
[INFO] Apache CloudStack Plugin - Storage Volume Nexenta Provider  SUCCESS [26.854s]
[INFO] Apache CloudStack Plugin - Storage Volume CloudByte Provider  SUCCESS [35.464s]
[INFO] Apache CloudStack Plugin - Storage Volume sample provider  SUCCESS [16.929s]
[INFO] Apache CloudStack Plugin - SNMP Alerts ............ SUCCESS [22.683s]
[INFO] Apache CloudStack Plugin - Syslog Alerts .......... SUCCESS [23.649s]
[INFO] Apache CloudStack Plugin - Network VXLAN .......... SUCCESS [22.397s]
[INFO] Apache CloudStack Plugin - GloboDNS ............... SUCCESS [31.978s]
[INFO] Apache CloudStack Plugin - NetApp File System ..... SUCCESS [27.962s]
[INFO] Apache CloudStack Plugin - F5 ..................... SUCCESS [30.467s]
[INFO] Apache CloudStack Plugin - Juniper SRX ............ SUCCESS [40.140s]
[INFO] Apache CloudStack Plugin - Nuage VSP .............. FAILURE [2.730s]
[INFO] Apache CloudStack VMware Base ..................... SKIPPED
[INFO] Apache CloudStack Plugin - Hypervisor VMware ...... SKIPPED
[INFO] Apache CloudStack Plugin - Cisco VNMC ............. SKIPPED
[INFO] Apache CloudStack Plugin - MySQL HA Strategy ...... SKIPPED
[INFO] Apache CloudStack Framework - Spring Module ....... SKIPPED
[INFO] Apache CloudStack Secondary Storage Controller .... SKIPPED
[INFO] Apache CloudStack Client UI ....................... SKIPPED
[INFO] Apache CloudStack Console Proxy - RDP Client ...... SKIPPED
[INFO] Apache CloudStack Console Proxy ................... SKIPPED
[INFO] Apache CloudStack Console Proxy - Server .......... SKIPPED
[INFO] Apache CloudStack Framework - QuickCloud .......... SKIPPED
[INFO] ------------------------------------------------------------------------
[INFO] BUILD FAILURE
[INFO] ------------------------------------------------------------------------
[INFO] Total time: 1:01:49.847s
[INFO] Finished at: Tue Aug 18 23:11:03 UTC 2015
[INFO] Final Memory: 183M/551M
[INFO] ------------------------------------------------------------------------
[ERROR] Failed to execute goal org.apache.maven.plugins:maven-compiler-plugin:3.2:compile
(default-compile) on project cloud-plugin-network-vsp: Compilation failure: Compilation failure:
[ERROR] <http://jenkins.buildacloud.org/job/build-master-slowbuild/ws/plugins/network-elements/nuage-vsp/src/com/cloud/network/guru/NuageVspGuestNetworkGuru.java>:[291,25]
error: cannot find symbol
[ERROR] symbol:   method getIp4Address()
[ERROR] location: variable nic of type NicProfile
[ERROR] <http://jenkins.buildacloud.org/job/build-master-slowbuild/ws/plugins/network-elements/nuage-vsp/src/com/cloud/network/guru/NuageVspGuestNetworkGuru.java>:[302,131]
error: cannot find symbol
[ERROR] symbol:   method getIp4Address()
[ERROR] location: variable nic of type NicProfile
[ERROR] <http://jenkins.buildacloud.org/job/build-master-slowbuild/ws/plugins/network-elements/nuage-vsp/src/com/cloud/network/guru/NuageVspGuestNetworkGuru.java>:[312,102]
error: cannot find symbol
[ERROR] symbol:   method getIp4Address()
[ERROR] location: variable nic of type NicProfile
[ERROR] <http://jenkins.buildacloud.org/job/build-master-slowbuild/ws/plugins/network-elements/nuage-vsp/src/com/cloud/network/guru/NuageVspGuestNetworkGuru.java>:[386,23]
error: cannot find symbol
[ERROR] symbol:   method setIp4Address(String)
[ERROR] location: variable nic of type NicProfile
[ERROR] <http://jenkins.buildacloud.org/job/build-master-slowbuild/ws/plugins/network-elements/nuage-vsp/src/com/cloud/network/guru/NuageVspGuestNetworkGuru.java>:[387,23]
error: cannot find symbol
[ERROR] symbol:   method setGateway(String)
[ERROR] location: variable nic of type NicProfile
[ERROR] <http://jenkins.buildacloud.org/job/build-master-slowbuild/ws/plugins/network-elements/nuage-vsp/src/com/cloud/network/guru/NuageVspGuestNetworkGuru.java>:[388,23]
error: cannot find symbol
[ERROR] -> [Help 1]
[ERROR] 
[ERROR] To see the full stack trace of the errors, re-run Maven with the -e switch.
[ERROR] Re-run Maven using the -X switch to enable full debug logging.
[ERROR] 
[ERROR] For more information about the errors and possible solutions, please read the following
articles:
[ERROR] [Help 1] http://cwiki.apache.org/confluence/display/MAVEN/MojoFailureException
[ERROR] 
[ERROR] After correcting the problems, you can resume the build with the command
[ERROR]   mvn <goals> -rf :cloud-plugin-network-vsp
Build step 'Invoke top-level Maven targets' marked build as failure
[FINDBUGS] Skipping publisher since build result is FAILURE
Skipping Cobertura coverage report as build was not UNSTABLE or better ...

Mime
View raw message