cloudstack-dev mailing list archives

Site index · List index
Message view « Date » · « Thread »
Top « Date » · « Thread »
From jenk...@cloudstack.org
Subject Build failed in Jenkins: build-master-slowbuild #2085
Date Tue, 18 Aug 2015 02:07:03 GMT
See <http://jenkins.buildacloud.org/job/build-master-slowbuild/2085/>

------------------------------------------
[...truncated 25932 lines...]
[INFO] Nothing to compile - all classes are up to date
[INFO] 
[INFO] >>> findbugs-maven-plugin:3.0.1:check (cloudstack-findbugs) @ cloud-plugin-network-srx
>>>
[INFO] 
[INFO] --- findbugs-maven-plugin:3.0.1:findbugs (findbugs) @ cloud-plugin-network-srx ---
[INFO] Fork Value is true
[INFO] Done FindBugs Analysis....
[INFO] 
[INFO] <<< findbugs-maven-plugin:3.0.1:check (cloudstack-findbugs) @ cloud-plugin-network-srx
<<<
[INFO] 
[INFO] --- findbugs-maven-plugin:3.0.1:check (cloudstack-findbugs) @ cloud-plugin-network-srx
---
[INFO] BugInstance size is 0
[INFO] Error size is 0
[INFO] No errors/warnings found
[INFO] 
[INFO] --- cobertura-maven-plugin:2.6:instrument (default-cli) @ cloud-plugin-network-srx
---
[INFO] Cobertura 2.0.3 - GNU GPL License (NO WARRANTY) - See COPYRIGHT file

[ERROR] Aug 18, 2015 2:10:47 AM net.sourceforge.cobertura.coveragedata.CoverageDataFileHandler
saveCoverageData
INFO: Cobertura: Saved information on 21 classes.

[INFO] Instrumentation was successful.
[INFO] NOT adding cobertura ser file to attached artifacts list.
[INFO] 
[INFO] --- maven-resources-plugin:2.5:testResources (default-testResources) @ cloud-plugin-network-srx
---
[debug] execute contextualize
[INFO] Using 'UTF-8' encoding to copy filtered resources.
[INFO] skip non existing resourceDirectory <http://jenkins.buildacloud.org/job/build-master-slowbuild/ws/plugins/network-elements/juniper-srx/test/resources>
[INFO] Copying 3 resources
[INFO] Copying 3 resources
[INFO] 
[INFO] --- maven-compiler-plugin:3.2:testCompile (default-testCompile) @ cloud-plugin-network-srx
---
[INFO] No sources to compile
[INFO] 
[INFO] --- maven-surefire-plugin:2.18.1:test (default-test) @ cloud-plugin-network-srx ---
[INFO] 
[INFO] <<< cobertura-maven-plugin:2.6:cobertura (default-cli) @ cloud-plugin-network-srx
<<<
[INFO] 
[INFO] --- cobertura-maven-plugin:2.6:cobertura (default-cli) @ cloud-plugin-network-srx ---
[INFO] Cobertura 2.0.3 - GNU GPL License (NO WARRANTY) - See COPYRIGHT file
[cobertura] INFO  [main] net.sourceforge.cobertura.reporting.html.HTMLReport - Data file does
not contain instrumentation information for the file com/cloud/network/element/JuniperSRXFirewallElementService.java.
 Ensure this class was instrumented, and this data file contains the instrumentation information.
Report time: 1133ms

[ERROR] Aug 18, 2015 2:10:47 AM net.sourceforge.cobertura.coveragedata.CoverageDataFileHandler
loadCoverageData
INFO: Cobertura: Loaded information on 21 classes.

[INFO] Cobertura Report generation was successful.
[INFO] Cobertura 2.0.3 - GNU GPL License (NO WARRANTY) - See COPYRIGHT file
Report time: 1201ms

[ERROR] Aug 18, 2015 2:10:49 AM net.sourceforge.cobertura.coveragedata.CoverageDataFileHandler
loadCoverageData
INFO: Cobertura: Loaded information on 21 classes.

[INFO] Cobertura Report generation was successful.
[INFO]                                                                         
[INFO] ------------------------------------------------------------------------
[INFO] Building Apache CloudStack Plugin - Nuage VSP 4.6.0-SNAPSHOT
[INFO] ------------------------------------------------------------------------
[WARNING] The POM for org.eclipse.m2e:lifecycle-mapping:jar:1.0.0 is missing, no dependency
information available
[WARNING] Failed to retrieve plugin descriptor for org.eclipse.m2e:lifecycle-mapping:1.0.0:
Plugin org.eclipse.m2e:lifecycle-mapping:1.0.0 or one of its dependencies could not be resolved:
Failed to read artifact descriptor for org.eclipse.m2e:lifecycle-mapping:jar:1.0.0
[INFO] 
[INFO] --- maven-clean-plugin:2.5:clean (default-clean) @ cloud-plugin-network-vsp ---
[INFO] Deleting <http://jenkins.buildacloud.org/job/build-master-slowbuild/ws/plugins/network-elements/nuage-vsp/target>
(includes = [**/*], excludes = [])
[INFO] Deleting <http://jenkins.buildacloud.org/job/build-master-slowbuild/ws/plugins/network-elements/nuage-vsp>
(includes = [target, dist], excludes = [])
[INFO] 
[INFO] --- maven-checkstyle-plugin:2.11:check (cloudstack-checkstyle) @ cloud-plugin-network-vsp
---
[INFO] Starting audit...
Audit done.

[INFO] 
[INFO] --- maven-remote-resources-plugin:1.3:process (default) @ cloud-plugin-network-vsp
---
[INFO] 
[INFO] --- maven-resources-plugin:2.5:resources (default-resources) @ cloud-plugin-network-vsp
---
[debug] execute contextualize
[INFO] Using 'UTF-8' encoding to copy filtered resources.
[INFO] Copying 2 resources
[INFO] Copying 3 resources
[INFO] 
[INFO] --- maven-compiler-plugin:3.2:compile (default-compile) @ cloud-plugin-network-vsp
---
[INFO] Changes detected - recompiling the module!
[INFO] Compiling 43 source files to <http://jenkins.buildacloud.org/job/build-master-slowbuild/ws/plugins/network-elements/nuage-vsp/target/classes>
[INFO] -------------------------------------------------------------
[ERROR] COMPILATION ERROR : 
[INFO] -------------------------------------------------------------
[ERROR] <http://jenkins.buildacloud.org/job/build-master-slowbuild/ws/plugins/network-elements/nuage-vsp/src/com/cloud/network/guru/NuageVspGuestNetworkGuru.java>:[291,25]
error: cannot find symbol
[ERROR]   symbol:   method getIp4Address()
  location: variable nic of type NicProfile
<http://jenkins.buildacloud.org/job/build-master-slowbuild/ws/plugins/network-elements/nuage-vsp/src/com/cloud/network/guru/NuageVspGuestNetworkGuru.java>:[302,131]
error: cannot find symbol
[ERROR]   symbol:   method getIp4Address()
  location: variable nic of type NicProfile
<http://jenkins.buildacloud.org/job/build-master-slowbuild/ws/plugins/network-elements/nuage-vsp/src/com/cloud/network/guru/NuageVspGuestNetworkGuru.java>:[312,102]
error: cannot find symbol
[ERROR]   symbol:   method getIp4Address()
  location: variable nic of type NicProfile
<http://jenkins.buildacloud.org/job/build-master-slowbuild/ws/plugins/network-elements/nuage-vsp/src/com/cloud/network/guru/NuageVspGuestNetworkGuru.java>:[386,23]
error: cannot find symbol
[ERROR]   symbol:   method setIp4Address(String)
  location: variable nic of type NicProfile
<http://jenkins.buildacloud.org/job/build-master-slowbuild/ws/plugins/network-elements/nuage-vsp/src/com/cloud/network/guru/NuageVspGuestNetworkGuru.java>:[387,23]
error: cannot find symbol
[ERROR]   symbol:   method setGateway(String)
  location: variable nic of type NicProfile
<http://jenkins.buildacloud.org/job/build-master-slowbuild/ws/plugins/network-elements/nuage-vsp/src/com/cloud/network/guru/NuageVspGuestNetworkGuru.java>:[388,23]
error: cannot find symbol
[INFO] 6 errors 
[INFO] -------------------------------------------------------------
[INFO] ------------------------------------------------------------------------
[INFO] Reactor Summary:
[INFO] 
[INFO] Apache CloudStack Developer Tools - Checkstyle Configuration  SUCCESS [1.800s]
[INFO] Apache CloudStack ................................. SUCCESS [2.164s]
[INFO] Apache CloudStack Maven Conventions Parent ........ SUCCESS [0.791s]
[INFO] Apache CloudStack Framework - Managed Context ..... SUCCESS [19.203s]
[INFO] Apache CloudStack Utils ........................... SUCCESS [1:14.238s]
[INFO] Apache CloudStack Framework ....................... SUCCESS [0.118s]
[INFO] Apache CloudStack Framework - Event Notification .. SUCCESS [53.336s]
[INFO] Apache CloudStack Framework - Configuration ....... SUCCESS [27.332s]
[INFO] Apache CloudStack API ............................. SUCCESS [1:57.217s]
[INFO] Apache CloudStack Framework - REST ................ SUCCESS [16.537s]
[INFO] Apache CloudStack Framework - IPC ................. SUCCESS [28.799s]
[INFO] Apache CloudStack Cloud Engine .................... SUCCESS [0.098s]
[INFO] Apache CloudStack Cloud Engine API ................ SUCCESS [27.161s]
[INFO] Apache CloudStack Framework - Security ............ SUCCESS [24.581s]
[INFO] Apache CloudStack Core ............................ SUCCESS [1:16.445s]
[INFO] Apache CloudStack Agents .......................... SUCCESS [37.456s]
[INFO] Apache CloudStack Framework - Clustering .......... SUCCESS [32.780s]
[INFO] Apache CloudStack Framework - Event Notification .. SUCCESS [13.951s]
[INFO] Apache CloudStack Cloud Engine Schema Component ... SUCCESS [2:08.935s]
[INFO] Apache CloudStack Framework - Jobs ................ SUCCESS [48.088s]
[INFO] Apache CloudStack Cloud Engine Internal Components API  SUCCESS [30.449s]
[INFO] Apache CloudStack Server .......................... SUCCESS [4:16.972s]
[INFO] Apache CloudStack Usage Server .................... SUCCESS [50.895s]
[INFO] Apache CloudStack Cloud Engine Orchestration Component  SUCCESS [1:29.895s]
[INFO] Apache CloudStack Cloud Services .................. SUCCESS [0.086s]
[INFO] Apache CloudStack Secondary Storage ............... SUCCESS [0.549s]
[INFO] Apache CloudStack Secondary Storage Service ....... SUCCESS [1:02.701s]
[INFO] Apache CloudStack Engine Storage Component ........ SUCCESS [56.528s]
[INFO] Apache CloudStack Engine Storage Volume Component . SUCCESS [32.991s]
[INFO] Apache CloudStack Engine Storage Image Component .. SUCCESS [26.701s]
[INFO] Apache CloudStack Engine Storage Data Motion Component  SUCCESS [23.908s]
[INFO] Apache CloudStack Engine Storage Cache Component .. SUCCESS [21.183s]
[INFO] Apache CloudStack Engine Storage Snapshot Component  SUCCESS [35.718s]
[INFO] Apache CloudStack Cloud Engine API ................ SUCCESS [13.750s]
[INFO] Apache CloudStack Cloud Engine Service ............ SUCCESS [6.140s]
[INFO] Apache CloudStack Plugin POM ...................... SUCCESS [0.744s]
[INFO] Apache CloudStack Plugin - API Rate Limit ......... SUCCESS [1:53.332s]
[INFO] Apache CloudStack Plugin - Storage Volume default provider  SUCCESS [3:15.036s]
[INFO] Apache CloudStack Plugin - Storage Volume SolidFire Provider  SUCCESS [1:12.187s]
[INFO] Apache CloudStack Plugin - API SolidFire .......... SUCCESS [22.515s]
[INFO] Apache CloudStack Plugin - API Discovery .......... SUCCESS [43.211s]
[INFO] Apache CloudStack Plugin - ACL Static Role Based .. SUCCESS [27.119s]
[INFO] Apache CloudStack Plugin - Host Anti-Affinity Processor  SUCCESS [50.772s]
[INFO] Apache CloudStack Plugin - Explicit Dedication Processor  SUCCESS [28.089s]
[INFO] Apache CloudStack Plugin - User Concentrated Pod Deployment Planner  SUCCESS [19.970s]
[INFO] Apache CloudStack Plugin - User Dispersing Deployment Planner  SUCCESS [20.931s]
[INFO] Apache CloudStack Plugin - Implicit Dedication Planner  SUCCESS [27.543s]
[INFO] Apache CloudStack Plugin - Skip Heurestics Planner  SUCCESS [14.990s]
[INFO] Apache CloudStack Plugin - Host Allocator Random .. SUCCESS [16.865s]
[INFO] Apache CloudStack Plugin - Dedicated Resources .... SUCCESS [33.597s]
[INFO] Apache CloudStack Plugin - Hypervisor OracleVM .... SUCCESS [33.967s]
[INFO] Apache CloudStack Plugin - Open vSwitch ........... SUCCESS [34.877s]
[INFO] Apache CloudStack Plugin - Hypervisor XenServer ... SUCCESS [1:20.157s]
[INFO] Apache CloudStack Plugin - Hypervisor KVM ......... SUCCESS [1:14.139s]
[INFO] Apache CloudStack Plugin - RabbitMQ Event Bus ..... SUCCESS [18.684s]
[INFO] Apache CloudStack Plugin - In Memory Event Bus .... SUCCESS [20.188s]
[INFO] Apache CloudStack Plugin - Kafka Event Bus ........ SUCCESS [15.699s]
[INFO] Apache CloudStack Plugin - Hypervisor Baremetal ... SUCCESS [41.161s]
[INFO] Apache CloudStack Plugin - Hypervisor UCS ......... SUCCESS [26.745s]
[INFO] Apache CloudStack Plugin - Hypervisor Hyper-V ..... SUCCESS [40.224s]
[INFO] Apache CloudStack Plugin - Hypervisor OracleVM3 ... SUCCESS [1:24.381s]
[INFO] Apache CloudStack Plugin - Network Elastic Load Balancer  SUCCESS [32.255s]
[INFO] Apache CloudStack Plugin - Network Internal Load Balancer  SUCCESS [38.411s]
[INFO] Apache CloudStack Framework - Spring Life Cycle ... SUCCESS [19.431s]
[INFO] Apache CloudStack Plugin - Network Juniper Contrail  SUCCESS [1:01.661s]
[INFO] Apache CloudStack Plugin - Palo Alto .............. SUCCESS [39.755s]
[INFO] Apache CloudStack Plugin - Network Netscaler ...... SUCCESS [51.476s]
[INFO] Apache CloudStack Plugin - Network Nicira NVP ..... SUCCESS [47.264s]
[INFO] Apache CloudStack Plugin - BigSwitch Virtual Network Segment  SUCCESS [43.951s]
[INFO] Apache CloudStack Plugin - Network Brocade VCS .... SUCCESS [41.898s]
[INFO] Apache CloudStack Plugin - Midokura Midonet ....... SUCCESS [36.319s]
[INFO] Apache CloudStack Plugin - Stratosphere SSP ....... SUCCESS [33.286s]
[INFO] Apache CloudStack Plugin - Network Opendaylight ... SUCCESS [40.350s]
[INFO] Apache CloudStack Plugin - Storage Allocator Random  SUCCESS [17.070s]
[INFO] Apache CloudStack Plugin - User Authenticator LDAP  SUCCESS [32.450s]
[INFO] Apache CloudStack Plugin - User Authenticator MD5 . SUCCESS [21.311s]
[INFO] Apache CloudStack Plugin - User Authenticator PBKDF2-SHA-256  SUCCESS [24.827s]
[INFO] Apache CloudStack Plugin - User Authenticator Plain Text  SUCCESS [17.033s]
[INFO] Apache CloudStack Plugin - User Authenticator SAML2  SUCCESS [1:53.689s]
[INFO] Apache CloudStack Plugin - User Authenticator SHA256 Salted  SUCCESS [20.715s]
[INFO] Apache CloudStack Plugin - Dns Notifier Example ... SUCCESS [13.095s]
[INFO] Apache CloudStack Plugin - Storage Image S3 ....... SUCCESS [20.174s]
[INFO] Apache CloudStack Plugin - Storage Image Swift provider  SUCCESS [18.204s]
[INFO] Apache CloudStack Plugin - Storage Image default provider  SUCCESS [20.303s]
[INFO] Apache CloudStack Plugin - Storage Image sample provider  SUCCESS [17.345s]
[INFO] Apache CloudStack Plugin - Storage Volume Nexenta Provider  SUCCESS [26.696s]
[INFO] Apache CloudStack Plugin - Storage Volume CloudByte Provider  SUCCESS [36.795s]
[INFO] Apache CloudStack Plugin - Storage Volume sample provider  SUCCESS [16.708s]
[INFO] Apache CloudStack Plugin - SNMP Alerts ............ SUCCESS [23.455s]
[INFO] Apache CloudStack Plugin - Syslog Alerts .......... SUCCESS [24.417s]
[INFO] Apache CloudStack Plugin - Network VXLAN .......... SUCCESS [21.988s]
[INFO] Apache CloudStack Plugin - GloboDNS ............... SUCCESS [31.911s]
[INFO] Apache CloudStack Plugin - NetApp File System ..... SUCCESS [28.952s]
[INFO] Apache CloudStack Plugin - F5 ..................... SUCCESS [29.734s]
[INFO] Apache CloudStack Plugin - Juniper SRX ............ SUCCESS [38.170s]
[INFO] Apache CloudStack Plugin - Nuage VSP .............. FAILURE [2.767s]
[INFO] Apache CloudStack VMware Base ..................... SKIPPED
[INFO] Apache CloudStack Plugin - Hypervisor VMware ...... SKIPPED
[INFO] Apache CloudStack Plugin - Cisco VNMC ............. SKIPPED
[INFO] Apache CloudStack Plugin - MySQL HA Strategy ...... SKIPPED
[INFO] Apache CloudStack Framework - Spring Module ....... SKIPPED
[INFO] Apache CloudStack Secondary Storage Controller .... SKIPPED
[INFO] Apache CloudStack Client UI ....................... SKIPPED
[INFO] Apache CloudStack Console Proxy - RDP Client ...... SKIPPED
[INFO] Apache CloudStack Console Proxy ................... SKIPPED
[INFO] Apache CloudStack Console Proxy - Server .......... SKIPPED
[INFO] Apache CloudStack Framework - QuickCloud .......... SKIPPED
[INFO] ------------------------------------------------------------------------
[INFO] BUILD FAILURE
[INFO] ------------------------------------------------------------------------
[INFO] Total time: 1:01:43.078s
[INFO] Finished at: Tue Aug 18 02:10:52 UTC 2015
[INFO] Final Memory: 132M/573M
[INFO] ------------------------------------------------------------------------
[ERROR] Failed to execute goal org.apache.maven.plugins:maven-compiler-plugin:3.2:compile
(default-compile) on project cloud-plugin-network-vsp: Compilation failure: Compilation failure:
[ERROR] <http://jenkins.buildacloud.org/job/build-master-slowbuild/ws/plugins/network-elements/nuage-vsp/src/com/cloud/network/guru/NuageVspGuestNetworkGuru.java>:[291,25]
error: cannot find symbol
[ERROR] symbol:   method getIp4Address()
[ERROR] location: variable nic of type NicProfile
[ERROR] <http://jenkins.buildacloud.org/job/build-master-slowbuild/ws/plugins/network-elements/nuage-vsp/src/com/cloud/network/guru/NuageVspGuestNetworkGuru.java>:[302,131]
error: cannot find symbol
[ERROR] symbol:   method getIp4Address()
[ERROR] location: variable nic of type NicProfile
[ERROR] <http://jenkins.buildacloud.org/job/build-master-slowbuild/ws/plugins/network-elements/nuage-vsp/src/com/cloud/network/guru/NuageVspGuestNetworkGuru.java>:[312,102]
error: cannot find symbol
[ERROR] symbol:   method getIp4Address()
[ERROR] location: variable nic of type NicProfile
[ERROR] <http://jenkins.buildacloud.org/job/build-master-slowbuild/ws/plugins/network-elements/nuage-vsp/src/com/cloud/network/guru/NuageVspGuestNetworkGuru.java>:[386,23]
error: cannot find symbol
[ERROR] symbol:   method setIp4Address(String)
[ERROR] location: variable nic of type NicProfile
[ERROR] <http://jenkins.buildacloud.org/job/build-master-slowbuild/ws/plugins/network-elements/nuage-vsp/src/com/cloud/network/guru/NuageVspGuestNetworkGuru.java>:[387,23]
error: cannot find symbol
[ERROR] symbol:   method setGateway(String)
[ERROR] location: variable nic of type NicProfile
[ERROR] <http://jenkins.buildacloud.org/job/build-master-slowbuild/ws/plugins/network-elements/nuage-vsp/src/com/cloud/network/guru/NuageVspGuestNetworkGuru.java>:[388,23]
error: cannot find symbol
[ERROR] -> [Help 1]
[ERROR] 
[ERROR] To see the full stack trace of the errors, re-run Maven with the -e switch.
[ERROR] Re-run Maven using the -X switch to enable full debug logging.
[ERROR] 
[ERROR] For more information about the errors and possible solutions, please read the following
articles:
[ERROR] [Help 1] http://cwiki.apache.org/confluence/display/MAVEN/MojoFailureException
[ERROR] 
[ERROR] After correcting the problems, you can resume the build with the command
[ERROR]   mvn <goals> -rf :cloud-plugin-network-vsp
Build step 'Invoke top-level Maven targets' marked build as failure
[FINDBUGS] Skipping publisher since build result is FAILURE
Skipping Cobertura coverage report as build was not UNSTABLE or better ...

Mime
View raw message