cloudstack-dev mailing list archives

Site index · List index
Message view « Date » · « Thread »
Top « Date » · « Thread »
From jenk...@cloudstack.org
Subject Build failed in Jenkins: build-master-noredist #4520
Date Fri, 14 Aug 2015 05:54:48 GMT
See <http://jenkins.buildacloud.org/job/build-master-noredist/4520/changes>

Changes:

[Rohit Yadav] CLOUDSTACK-8566: Strips the username and password credentials from host details

[Rohit Yadav] CLOUDSTACK-8613, CLOUDSTACK-6301: Dump KVM domain XML with secure flag

------------------------------------------
[...truncated 10009 lines...]
[debug] execute contextualize
[INFO] Using 'UTF-8' encoding to copy filtered resources.
[INFO] skip non existing resourceDirectory <http://jenkins.buildacloud.org/job/build-master-noredist/ws/engine/storage/datamotion/test/resources>
[INFO] Copying 3 resources
[INFO] 
[INFO] --- maven-compiler-plugin:3.2:testCompile (default-testCompile) @ cloud-engine-storage-datamotion
---
[INFO] Building jar: <http://jenkins.buildacloud.org/job/build-master-noredist/ws/plugins/storage/volume/default/target/cloud-plugin-storage-volume-default-4.6.0-SNAPSHOT.jar>
[INFO] No sources to compile
[INFO] 
[INFO] --- maven-surefire-plugin:2.18.1:test (default-test) @ cloud-engine-storage-datamotion
---
[INFO] 
[INFO] --- maven-jar-plugin:2.5:jar (default-jar) @ cloud-engine-storage-datamotion ---
[INFO] 
[INFO] --- maven-site-plugin:3.1:attach-descriptor (attach-descriptor) @ cloud-plugin-storage-volume-default
---
[INFO] Building jar: <http://jenkins.buildacloud.org/job/build-master-noredist/ws/engine/storage/datamotion/target/cloud-engine-storage-datamotion-4.6.0-SNAPSHOT.jar>
[INFO] 
[INFO] --- maven-surefire-plugin:2.18.1:test (default) @ cloud-plugin-storage-volume-default
---
[INFO] Tests are skipped.
[INFO] 
[INFO] --- maven-install-plugin:2.3.1:install (default-install) @ cloud-plugin-storage-volume-default
---
[INFO] Installing <http://jenkins.buildacloud.org/job/build-master-noredist/ws/plugins/storage/volume/default/target/cloud-plugin-storage-volume-default-4.6.0-SNAPSHOT.jar>
to /home/jenkins/.m2/repository/org/apache/cloudstack/cloud-plugin-storage-volume-default/4.6.0-SNAPSHOT/cloud-plugin-storage-volume-default-4.6.0-SNAPSHOT.jar
[INFO] Installing <http://jenkins.buildacloud.org/job/build-master-noredist/ws/plugins/storage/volume/default/pom.xml>
to /home/jenkins/.m2/repository/org/apache/cloudstack/cloud-plugin-storage-volume-default/4.6.0-SNAPSHOT/cloud-plugin-storage-volume-default-4.6.0-SNAPSHOT.pom
[INFO] 
[INFO] --- maven-site-plugin:3.1:attach-descriptor (attach-descriptor) @ cloud-engine-storage-datamotion
---
[INFO] 
[INFO] --- maven-install-plugin:2.3.1:install (default-install) @ cloud-engine-storage-datamotion
---
[INFO] Installing <http://jenkins.buildacloud.org/job/build-master-noredist/ws/engine/storage/datamotion/target/cloud-engine-storage-datamotion-4.6.0-SNAPSHOT.jar>
to /home/jenkins/.m2/repository/org/apache/cloudstack/cloud-engine-storage-datamotion/4.6.0-SNAPSHOT/cloud-engine-storage-datamotion-4.6.0-SNAPSHOT.jar
[INFO] Installing <http://jenkins.buildacloud.org/job/build-master-noredist/ws/engine/storage/datamotion/pom.xml>
to /home/jenkins/.m2/repository/org/apache/cloudstack/cloud-engine-storage-datamotion/4.6.0-SNAPSHOT/cloud-engine-storage-datamotion-4.6.0-SNAPSHOT.pom
log4j:WARN No appenders could be found for logger (org.springframework.test.context.junit4.SpringJUnit4ClassRunner).
log4j:WARN Please initialize the log4j system properly.
log4j:WARN See http://logging.apache.org/log4j/1.2/faq.html#noconfig for more info.
2015-08-14 05:57:47 DEBUG ConnectionTest:72 - getresult call: check_dom0_port - [ovm-1, 8899,
1]
2015-08-14 05:57:47 ERROR CloudstackPlugin:129 - Dom0 port check failed: com.cloud.hypervisor.ovm3.objects.Ovm3ResourceException:
Client call check_dom0_port to null with [ovm-1, 8899, 1] went wrong: Exception: null
2015-08-14 05:57:47 DEBUG ConnectionTest:72 - getresult call: ovs_mkdirs - [/tmp/testing,
755]
2015-08-14 05:57:47 DEBUG ConnectionTest:72 - getresult call: ping - [ovm-1]
2015-08-14 05:57:47 DEBUG ConnectionTest:72 - getresult call: ovs_upload_ssh_key - [/tmp,
This is some content]
2015-08-14 05:57:47 DEBUG ConnectionTest:72 - getresult call: ovs_mkdirs - [/tmp/testing]
2015-08-14 05:57:47 DEBUG ConnectionTest:72 - getresult call: check_domr_ssh - [169.254.3.2]
2015-08-14 05:57:47 DEBUG ConnectionTest:72 - getresult call: check_dom0_storage_health -
[, , , 120]
2015-08-14 05:57:47 DEBUG ConnectionTest:72 - getresult call: check_dom0_storage_health -
[, , , 120]
2015-08-14 05:57:47 DEBUG ConnectionTest:72 - getresult call: ovs_control_interface - [control0,
169.254.0.1/16]
2015-08-14 05:57:47 DEBUG ConnectionTest:72 - getresult call: check_dom0_storage_health_check
- [, , , 120, 1]
2015-08-14 05:57:47 DEBUG ConnectionTest:72 - getresult call: ovs_domr_upload_file - [test,
/tmp, test.txt, This is some content]
2015-08-14 05:57:47 DEBUG ConnectionTest:72 - getresult call: get_vncport - [test]
2015-08-14 05:57:47 DEBUG ConnectionTest:72 - getresult call: ovs_dom0_stats - [xenbr0]
2015-08-14 05:57:47 DEBUG ConnectionTest:72 - getresult call: ovs_domU_stats - [test]
2015-08-14 05:57:47 DEBUG ConnectionTest:72 - getresult call: check_dom0_ip - [192.168.1.64]
2015-08-14 05:57:47 DEBUG ConnectionTest:72 - getresult call: check_dom0_ip - [192.168.1.64]
2015-08-14 05:57:47 DEBUG ConnectionTest:72 - getresult call: ovs_check_file - [test.txt]
2015-08-14 05:57:47 DEBUG ConnectionTest:72 - getresult call: ovs_mkdirs - [/tmp/testing]
2015-08-14 05:57:47 DEBUG ConnectionTest:72 - getresult call: exec_domr - [169.254.3.2, ls]
2015-08-14 05:57:47 DEBUG ConnectionTest:72 - getresult call: exec_domr - [169.254.3.2, ls]
Tests run: 19, Failures: 0, Errors: 0, Skipped: 0, Time elapsed: 1.037 sec - in com.cloud.hypervisor.ovm3.objects.CloudStackPluginTest
Running com.cloud.hypervisor.ovm3.objects.NtpTest
2015-08-14 05:57:47 DEBUG ConnectionTest:72 - getresult call: enable_ntp - []
2015-08-14 05:57:47 DEBUG ConnectionTest:72 - getresult call: get_ntp - []
Running src.VMSnapshotStrategyTest
2015-08-14 05:57:47 DEBUG ConnectionTest:72 - getresult call: set_ntp - [[ovm-1], true]
2015-08-14 05:57:47 DEBUG ConnectionTest:72 - getresult call: get_ntp - []
2015-08-14 05:57:47 DEBUG ConnectionTest:72 - getresult call: get_ntp - []
2015-08-14 05:57:47 DEBUG ConnectionTest:72 - getresult call: disable_ntp - []
Tests run: 5, Failures: 0, Errors: 0, Skipped: 0, Time elapsed: 0.008 sec - in com.cloud.hypervisor.ovm3.objects.NtpTest

Results :

Tests run: 166, Failures: 0, Errors: 0, Skipped: 0

[INFO] 
[INFO] --- maven-jar-plugin:2.5:jar (default-jar) @ cloud-plugin-hypervisor-ovm3 ---
[INFO] Building jar: <http://jenkins.buildacloud.org/job/build-master-noredist/ws/plugins/hypervisors/ovm3/target/cloud-plugin-hypervisor-ovm3-4.6.0-SNAPSHOT.jar>
[INFO] 
[INFO] --- maven-site-plugin:3.1:attach-descriptor (attach-descriptor) @ cloud-plugin-hypervisor-ovm3
---
[INFO] 
[INFO] --- maven-install-plugin:2.3.1:install (default-install) @ cloud-plugin-hypervisor-ovm3
---
[INFO] Installing <http://jenkins.buildacloud.org/job/build-master-noredist/ws/plugins/hypervisors/ovm3/target/cloud-plugin-hypervisor-ovm3-4.6.0-SNAPSHOT.jar>
to /home/jenkins/.m2/repository/org/apache/cloudstack/cloud-plugin-hypervisor-ovm3/4.6.0-SNAPSHOT/cloud-plugin-hypervisor-ovm3-4.6.0-SNAPSHOT.jar
[INFO] Installing <http://jenkins.buildacloud.org/job/build-master-noredist/ws/plugins/hypervisors/ovm3/pom.xml>
to /home/jenkins/.m2/repository/org/apache/cloudstack/cloud-plugin-hypervisor-ovm3/4.6.0-SNAPSHOT/cloud-plugin-hypervisor-ovm3-4.6.0-SNAPSHOT.pom
[INFO] 
[INFO] --- maven-surefire-plugin:2.18.1:test (default-test) @ cloud-plugin-hypervisor-vmware
---
[INFO] Surefire report directory: <http://jenkins.buildacloud.org/job/build-master-noredist/ws/plugins/hypervisors/vmware/target/surefire-reports>

-------------------------------------------------------
 T E S T S
-------------------------------------------------------
log4j:WARN No appenders could be found for logger (org.springframework.test.context.junit4.SpringJUnit4ClassRunner).
log4j:WARN Please initialize the log4j system properly.
log4j:WARN See http://logging.apache.org/log4j/1.2/faq.html#noconfig for more info.
Running org.apache.cloudstack.storage.motion.VmwareStorageMotionStrategyTest
[INFO] ------------------------------------------------------------------------
[INFO] Reactor Summary:
[INFO] 
[INFO] Apache CloudStack Developer Tools - Checkstyle Configuration  SUCCESS [1.155s]
[INFO] Apache CloudStack ................................. SUCCESS [1.410s]
[INFO] Apache CloudStack Maven Conventions Parent ........ SUCCESS [1.046s]
[INFO] Apache CloudStack Framework - Managed Context ..... SUCCESS [3.366s]
[INFO] Apache CloudStack Utils ........................... SUCCESS [13.423s]
[INFO] Apache CloudStack Framework ....................... SUCCESS [0.089s]
[INFO] Apache CloudStack Framework - Event Notification .. SUCCESS [6.318s]
[INFO] Apache CloudStack Framework - Configuration ....... SUCCESS [3.726s]
[INFO] Apache CloudStack API ............................. SUCCESS [12.914s]
[INFO] Apache CloudStack Framework - REST ................ SUCCESS [4.265s]
[INFO] Apache CloudStack Framework - IPC ................. SUCCESS [4.066s]
[INFO] Apache CloudStack Cloud Engine .................... SUCCESS [0.091s]
[INFO] Apache CloudStack Cloud Engine API ................ SUCCESS [4.006s]
[INFO] Apache CloudStack Framework - Security ............ SUCCESS [2.011s]
[INFO] Apache CloudStack Core ............................ SUCCESS [20.304s]
[INFO] Apache CloudStack Agents .......................... SUCCESS [5.921s]
[INFO] Apache CloudStack Framework - Clustering .......... SUCCESS [2.629s]
[INFO] Apache CloudStack Framework - Event Notification .. SUCCESS [1.675s]
[INFO] Apache CloudStack Cloud Engine Schema Component ... SUCCESS [12.712s]
[INFO] Apache CloudStack Framework - Jobs ................ SUCCESS [5.298s]
[INFO] Apache CloudStack Cloud Engine Internal Components API  SUCCESS [2.702s]
[INFO] Apache CloudStack Server .......................... SUCCESS [37.673s]
[INFO] Apache CloudStack Usage Server .................... SUCCESS [6.435s]
[INFO] Apache CloudStack Cloud Engine Orchestration Component  SUCCESS [9.111s]
[INFO] Apache CloudStack Cloud Services .................. SUCCESS [0.410s]
[INFO] Apache CloudStack Secondary Storage ............... SUCCESS [5.157s]
[INFO] Apache CloudStack Secondary Storage Service ....... SUCCESS [12.595s]
[INFO] Apache CloudStack Engine Storage Component ........ SUCCESS [21.510s]
[INFO] Apache CloudStack Engine Storage Volume Component . SUCCESS [7.828s]
[INFO] Apache CloudStack Engine Storage Image Component .. SUCCESS [5.621s]
[INFO] Apache CloudStack Engine Storage Data Motion Component  SUCCESS [4.289s]
[INFO] Apache CloudStack Engine Storage Cache Component .. SUCCESS [4.716s]
[INFO] Apache CloudStack Engine Storage Snapshot Component  SKIPPED
[INFO] Apache CloudStack Cloud Engine API ................ SUCCESS [1.875s]
[INFO] Apache CloudStack Cloud Engine Service ............ SUCCESS [11.655s]
[INFO] Apache CloudStack Plugin POM ...................... SUCCESS [0.319s]
[INFO] Apache CloudStack Plugin - API Rate Limit ......... SUCCESS [34.169s]
[INFO] Apache CloudStack Plugin - Storage Volume default provider  SUCCESS [4.277s]
[INFO] Apache CloudStack Plugin - Storage Volume SolidFire Provider  SKIPPED
[INFO] Apache CloudStack Plugin - API SolidFire .......... SKIPPED
[INFO] Apache CloudStack Plugin - API Discovery .......... SUCCESS [28.539s]
[INFO] Apache CloudStack Plugin - ACL Static Role Based .. SUCCESS [12.450s]
[INFO] Apache CloudStack Plugin - Host Anti-Affinity Processor  SUCCESS [3.339s]
[INFO] Apache CloudStack Plugin - Explicit Dedication Processor  SUCCESS [7.240s]
[INFO] Apache CloudStack Plugin - User Concentrated Pod Deployment Planner  SUCCESS [13.728s]
[INFO] Apache CloudStack Plugin - User Dispersing Deployment Planner  SUCCESS [6.601s]
[INFO] Apache CloudStack Plugin - Implicit Dedication Planner  SUCCESS [32.787s]
[INFO] Apache CloudStack Plugin - Skip Heurestics Planner  SUCCESS [12.414s]
[INFO] Apache CloudStack Plugin - Host Allocator Random .. SUCCESS [16.239s]
[INFO] Apache CloudStack Plugin - Dedicated Resources .... SUCCESS [33.028s]
[INFO] Apache CloudStack Plugin - Hypervisor OracleVM .... SUCCESS [21.161s]
[INFO] Apache CloudStack Plugin - Open vSwitch ........... SUCCESS [20.742s]
[INFO] Apache CloudStack Plugin - Hypervisor XenServer ... SKIPPED
[INFO] Apache CloudStack Plugin - Hypervisor KVM ......... FAILURE [28.167s]
[INFO] Apache CloudStack Plugin - RabbitMQ Event Bus ..... SUCCESS [8.060s]
[INFO] Apache CloudStack Plugin - In Memory Event Bus .... SUCCESS [25.690s]
[INFO] Apache CloudStack Plugin - Kafka Event Bus ........ SUCCESS [6.602s]
[INFO] Apache CloudStack Plugin - Hypervisor Baremetal ... SUCCESS [22.648s]
[INFO] Apache CloudStack Plugin - Hypervisor UCS ......... SUCCESS [4.030s]
[INFO] Apache CloudStack Plugin - Hypervisor Hyper-V ..... SUCCESS [13.632s]
[INFO] Apache CloudStack Plugin - Hypervisor OracleVM3 ... SUCCESS [52.943s]
[INFO] Apache CloudStack Plugin - Network Elastic Load Balancer  SUCCESS [30.978s]
[INFO] Apache CloudStack Plugin - Network Internal Load Balancer  SUCCESS [39.308s]
[INFO] Apache CloudStack Framework - Spring Life Cycle ... SUCCESS [1.834s]
[INFO] Apache CloudStack Plugin - Network Juniper Contrail  SKIPPED
[INFO] Apache CloudStack Plugin - Palo Alto .............. SUCCESS [35.212s]
[INFO] Apache CloudStack Plugin - Network Netscaler ...... SUCCESS [16.295s]
[INFO] Apache CloudStack Plugin - Network Nicira NVP ..... SUCCESS [44.229s]
[INFO] Apache CloudStack Plugin - BigSwitch Virtual Network Segment  SUCCESS [44.027s]
[INFO] Apache CloudStack Plugin - Network Brocade VCS .... SUCCESS [38.430s]
[INFO] Apache CloudStack Plugin - Midokura Midonet ....... SKIPPED
[INFO] Apache CloudStack Plugin - Stratosphere SSP ....... SUCCESS [29.902s]
[INFO] Apache CloudStack Plugin - Network Opendaylight ... SUCCESS [33.317s]
[INFO] Apache CloudStack Plugin - Storage Allocator Random  SUCCESS [4.391s]
[INFO] Apache CloudStack Plugin - User Authenticator LDAP  SUCCESS [13.529s]
[INFO] Apache CloudStack Plugin - User Authenticator MD5 . SUCCESS [25.600s]
[INFO] Apache CloudStack Plugin - User Authenticator PBKDF2-SHA-256  SUCCESS [30.307s]
[INFO] Apache CloudStack Plugin - User Authenticator Plain Text  SUCCESS [15.250s]
[INFO] Apache CloudStack Plugin - User Authenticator SAML2  SKIPPED
[INFO] Apache CloudStack Plugin - User Authenticator SHA256 Salted  SUCCESS [24.985s]
[INFO] Apache CloudStack Plugin - Dns Notifier Example ... SUCCESS [11.859s]
[INFO] Apache CloudStack Plugin - Storage Image S3 ....... SKIPPED
[INFO] Apache CloudStack Plugin - Storage Image Swift provider  SKIPPED
[INFO] Apache CloudStack Plugin - Storage Image default provider  SKIPPED
[INFO] Apache CloudStack Plugin - Storage Image sample provider  SKIPPED
[INFO] Apache CloudStack Plugin - Storage Volume Nexenta Provider  SKIPPED
[INFO] Apache CloudStack Plugin - Storage Volume CloudByte Provider  SKIPPED
[INFO] Apache CloudStack Plugin - Storage Volume sample provider  SUCCESS [3.838s]
[INFO] Apache CloudStack Plugin - SNMP Alerts ............ SUCCESS [23.815s]
[INFO] Apache CloudStack Plugin - Syslog Alerts .......... SUCCESS [19.844s]
[INFO] Apache CloudStack Plugin - Network VXLAN .......... SUCCESS [23.118s]
[INFO] Apache CloudStack Plugin - GloboDNS ............... SUCCESS [28.049s]
[INFO] Apache CloudStack Plugin - NetApp File System ..... SUCCESS [16.025s]
[INFO] Apache CloudStack Plugin - F5 ..................... SUCCESS [16.312s]
[INFO] Apache CloudStack Plugin - Juniper SRX ............ SUCCESS [18.224s]
[INFO] Apache CloudStack Plugin - Nuage VSP .............. SUCCESS [23.948s]
[INFO] Apache CloudStack VMware Base ..................... SUCCESS [7.009s]
[INFO] Apache CloudStack Plugin - Hypervisor VMware ...... SKIPPED
[INFO] Apache CloudStack Plugin - Cisco VNMC ............. SKIPPED
[INFO] Apache CloudStack Plugin - MySQL HA Strategy ...... SUCCESS [11.296s]
[INFO] Apache CloudStack Framework - Spring Module ....... SUCCESS [6.023s]
[INFO] Apache CloudStack Secondary Storage Controller .... SUCCESS [4.253s]
[INFO] Apache CloudStack Console Proxy - RDP Client ...... SUCCESS [8.702s]
[INFO] Apache CloudStack Console Proxy ................... SUCCESS [4.999s]
[INFO] Apache CloudStack Console Proxy - Server .......... SUCCESS [4.244s]
[INFO] Apache CloudStack System VM ....................... SKIPPED
[INFO] Apache CloudStack Client UI ....................... SKIPPED
[INFO] Apache CloudStack Framework - QuickCloud .......... SUCCESS [0.981s]
[INFO] ------------------------------------------------------------------------
[INFO] BUILD FAILURE
[INFO] ------------------------------------------------------------------------
[INFO] Total time: 2:48.534s (Wall Clock)
[INFO] Finished at: Fri Aug 14 05:57:48 UTC 2015
[INFO] Final Memory: 97M/979M
[INFO] ------------------------------------------------------------------------
[INFO] 
[INFO] --- maven-surefire-plugin:2.18.1:test (default-test) @ cloud-plugin-storage-volume-nexenta
---
[WARNING] The requested profile "awsapi" could not be activated because it does not exist.
Tests run: 3, Failures: 0, Errors: 0, Skipped: 0, Time elapsed: 1.921 sec - in src.VMSnapshotStrategyTest
Running src.SnapshotDataFactoryTest
[INFO] 
[INFO] --- maven-surefire-plugin:2.18.1:test (default-test) @ cloud-plugin-hypervisor-xenserver
---
[ERROR] Failed to execute goal org.apache.maven.plugins:maven-surefire-plugin:2.18.1:test
(default-test) on project cloud-plugin-hypervisor-kvm: There are test failures.
[ERROR] 
[ERROR] Please refer to <http://jenkins.buildacloud.org/job/build-master-noredist/ws/plugins/hypervisors/kvm/target/surefire-reports>
for the individual test results.
[ERROR] -> [Help 1]
[ERROR] 
[ERROR] To see the full stack trace of the errors, re-run Maven with the -e switch.
[ERROR] Re-run Maven using the -X switch to enable full debug logging.
[ERROR] 
[ERROR] For more information about the errors and possible solutions, please read the following
articles:
[ERROR] [Help 1] http://cwiki.apache.org/confluence/display/MAVEN/MojoFailureException
Tests run: 1, Failures: 0, Errors: 0, Skipped: 0, Time elapsed: 0 sec - in src.SnapshotDataFactoryTest
[ERROR] 
[ERROR] After correcting the problems, you can resume the build with the command
[ERROR]   mvn <goals> -rf :cloud-plugin-hypervisor-kvm

Results :

Tests run: 4, Failures: 0, Errors: 0, Skipped: 0

[INFO] 
[INFO] --- maven-jar-plugin:2.5:jar (default-jar) @ cloud-engine-storage-snapshot ---
[INFO] Tests are skipped.
[INFO] 
[INFO] --- maven-jar-plugin:2.5:jar (default-jar) @ cloud-plugin-storage-volume-nexenta ---
[INFO] Surefire report directory: <http://jenkins.buildacloud.org/job/build-master-noredist/ws/plugins/hypervisors/xenserver/target/surefire-reports>

-------------------------------------------------------
 T E S T S
-------------------------------------------------------
Error: Unable to access jarfile <http://jenkins.buildacloud.org/job/build-master-noredist/ws/plugins/hypervisors/xenserver/target/surefire/surefirebooter7914383665331233163.jar>

Results :

Tests run: 0, Failures: 0, Errors: 0, Skipped: 0

Build step 'Invoke top-level Maven targets' marked build as failure
Archiving artifacts

Mime
View raw message