cloudstack-dev mailing list archives

Site index · List index
Message view « Date » · « Thread »
Top « Date » · « Thread »
From jenk...@cloudstack.org
Subject Build failed in Jenkins: build-master-noredist #4547
Date Wed, 19 Aug 2015 17:32:16 GMT
See <http://jenkins.buildacloud.org/job/build-master-noredist/4547/changes>

Changes:

[github] CLOUDSTACK-8748: VM UUID accessible in CreateVMSnapshotCommand and RevertToVMSnapshotCommand

------------------------------------------
[...truncated 10408 lines...]
[INFO] 
[INFO] --- maven-jar-plugin:2.5:jar (default-jar) @ cloud-plugin-storage-volume-nexenta ---
[INFO] Building jar: <http://jenkins.buildacloud.org/job/build-master-noredist/ws/plugins/storage/volume/nexenta/target/cloud-plugin-storage-volume-nexenta-4.6.0-SNAPSHOT.jar>
[INFO] 
[INFO] --- maven-site-plugin:3.1:attach-descriptor (attach-descriptor) @ cloud-plugin-storage-volume-nexenta
---
[INFO] 
[INFO] --- maven-surefire-plugin:2.18.1:test (default) @ cloud-plugin-storage-volume-nexenta
---
[INFO] Tests are skipped.
[INFO] 
[INFO] --- maven-install-plugin:2.3.1:install (default-install) @ cloud-plugin-storage-volume-nexenta
---
[INFO] Installing <http://jenkins.buildacloud.org/job/build-master-noredist/ws/plugins/storage/volume/nexenta/target/cloud-plugin-storage-volume-nexenta-4.6.0-SNAPSHOT.jar>
to /home/jenkins/.m2/repository/org/apache/cloudstack/cloud-plugin-storage-volume-nexenta/4.6.0-SNAPSHOT/cloud-plugin-storage-volume-nexenta-4.6.0-SNAPSHOT.jar
[INFO] Installing <http://jenkins.buildacloud.org/job/build-master-noredist/ws/plugins/storage/volume/nexenta/pom.xml>
to /home/jenkins/.m2/repository/org/apache/cloudstack/cloud-plugin-storage-volume-nexenta/4.6.0-SNAPSHOT/cloud-plugin-storage-volume-nexenta-4.6.0-SNAPSHOT.pom
[INFO] 
[INFO] --- maven-surefire-plugin:2.18.1:test (default-test) @ cloud-plugin-network-midonet
---
[INFO] Surefire report directory: <http://jenkins.buildacloud.org/job/build-master-noredist/ws/plugins/network-elements/midonet/target/surefire-reports>

-------------------------------------------------------
 T E S T S
-------------------------------------------------------
Running com.cloud.network.element.MidoNetElementTest
Tests run: 6, Failures: 0, Errors: 0, Skipped: 0, Time elapsed: 1.395 sec - in org.apache.cloudstack.storage.motion.VmwareStorageMotionStrategyTest
Running com.cloud.hypervisor.vmware.resource.VmwareResourceTest
log4j:WARN No appenders could be found for logger (com.cloud.network.element.MidoNetElement).
log4j:WARN Please initialize the log4j system properly.
log4j:WARN See http://logging.apache.org/log4j/1.2/faq.html#noconfig for more info.
[INFO] 
[INFO] --- license-maven-plugin:2.7:check (cloudstack-checklicence) @ cloud-plugin-storage-volume-cloudbyte
---
[INFO] Checking licenses...
[INFO] 
[INFO] --- maven-resources-plugin:2.5:testResources (default-testResources) @ cloud-plugin-storage-volume-cloudbyte
---
[debug] execute contextualize
[INFO] Using 'UTF-8' encoding to copy filtered resources.
[INFO] skip non existing resourceDirectory <http://jenkins.buildacloud.org/job/build-master-noredist/ws/plugins/storage/volume/cloudbyte/test/resources>
[INFO] Copying 3 resources
[INFO] 
[INFO] --- maven-compiler-plugin:3.2:testCompile (default-testCompile) @ cloud-plugin-storage-volume-cloudbyte
---
[INFO] No sources to compile
[INFO] 
[INFO] --- maven-surefire-plugin:2.18.1:test (default-test) @ cloud-plugin-storage-volume-cloudbyte
---
[INFO] Tests are skipped.
[INFO] 
[INFO] --- maven-jar-plugin:2.5:jar (default-jar) @ cloud-plugin-storage-volume-cloudbyte
---
Tests run: 2, Failures: 0, Errors: 0, Skipped: 0, Time elapsed: 0.654 sec - in com.cloud.network.element.MidoNetElementTest
[INFO] Building jar: <http://jenkins.buildacloud.org/job/build-master-noredist/ws/plugins/storage/volume/cloudbyte/target/cloud-plugin-storage-volume-cloudbyte-4.6.0-SNAPSHOT.jar>

Results :

Tests run: 2, Failures: 0, Errors: 0, Skipped: 0

[INFO] 
[INFO] --- maven-jar-plugin:2.5:jar (default-jar) @ cloud-plugin-network-midonet ---
[INFO] Building jar: <http://jenkins.buildacloud.org/job/build-master-noredist/ws/plugins/network-elements/midonet/target/cloud-plugin-network-midonet-4.6.0-SNAPSHOT.jar>
[INFO] 
[INFO] --- maven-site-plugin:3.1:attach-descriptor (attach-descriptor) @ cloud-plugin-network-midonet
---
[INFO] 
[INFO] --- maven-install-plugin:2.3.1:install (default-install) @ cloud-plugin-network-midonet
---
[INFO] Installing <http://jenkins.buildacloud.org/job/build-master-noredist/ws/plugins/network-elements/midonet/target/cloud-plugin-network-midonet-4.6.0-SNAPSHOT.jar>
to /home/jenkins/.m2/repository/org/apache/cloudstack/cloud-plugin-network-midonet/4.6.0-SNAPSHOT/cloud-plugin-network-midonet-4.6.0-SNAPSHOT.jar
[INFO] Installing <http://jenkins.buildacloud.org/job/build-master-noredist/ws/plugins/network-elements/midonet/pom.xml>
to /home/jenkins/.m2/repository/org/apache/cloudstack/cloud-plugin-network-midonet/4.6.0-SNAPSHOT/cloud-plugin-network-midonet-4.6.0-SNAPSHOT.pom
[INFO] 
[INFO] --- maven-site-plugin:3.1:attach-descriptor (attach-descriptor) @ cloud-plugin-storage-volume-cloudbyte
---
[INFO] 
[INFO] --- maven-surefire-plugin:2.18.1:test (default) @ cloud-plugin-storage-volume-cloudbyte
---
[INFO] Tests are skipped.
[INFO] 
[INFO] --- maven-install-plugin:2.3.1:install (default-install) @ cloud-plugin-storage-volume-cloudbyte
---
[INFO] Installing <http://jenkins.buildacloud.org/job/build-master-noredist/ws/plugins/storage/volume/cloudbyte/target/cloud-plugin-storage-volume-cloudbyte-4.6.0-SNAPSHOT.jar>
to /home/jenkins/.m2/repository/org/apache/cloudstack/cloud-plugin-storage-volume-cloudbyte/4.6.0-SNAPSHOT/cloud-plugin-storage-volume-cloudbyte-4.6.0-SNAPSHOT.jar
[INFO] Installing <http://jenkins.buildacloud.org/job/build-master-noredist/ws/plugins/storage/volume/cloudbyte/pom.xml>
to /home/jenkins/.m2/repository/org/apache/cloudstack/cloud-plugin-storage-volume-cloudbyte/4.6.0-SNAPSHOT/cloud-plugin-storage-volume-cloudbyte-4.6.0-SNAPSHOT.pom
Tests run: 1, Failures: 0, Errors: 0, Skipped: 0, Time elapsed: 0.591 sec - in com.cloud.hypervisor.vmware.resource.VmwareResourceTest
Running com.cloud.hypervisor.vmware.VmwareDatacenterApiUnitTest
[INFO] 
[INFO] --- maven-resources-plugin:2.5:testResources (default-testResources) @ cloud-plugin-storage-volume-solidfire
---
[debug] execute contextualize
[INFO] Using 'UTF-8' encoding to copy filtered resources.
[INFO] skip non existing resourceDirectory <http://jenkins.buildacloud.org/job/build-master-noredist/ws/plugins/storage/volume/solidfire/test/resources>
[INFO] Copying 3 resources
[INFO] 
[INFO] --- maven-compiler-plugin:3.2:testCompile (default-testCompile) @ cloud-plugin-storage-volume-solidfire
---
[INFO] Changes detected - recompiling the module!
[INFO] Compiling 4 source files to <http://jenkins.buildacloud.org/job/build-master-noredist/ws/plugins/storage/volume/solidfire/target/test-classes>
Tests run: 3, Failures: 0, Errors: 0, Skipped: 0, Time elapsed: 0.815 sec - in com.cloud.hypervisor.vmware.VmwareDatacenterApiUnitTest

Results :

Tests run: 10, Failures: 0, Errors: 0, Skipped: 0

[INFO] 
[INFO] --- maven-jar-plugin:2.5:jar (default-jar) @ cloud-plugin-hypervisor-vmware ---
[INFO] Building jar: <http://jenkins.buildacloud.org/job/build-master-noredist/ws/plugins/hypervisors/vmware/target/cloud-plugin-hypervisor-vmware-4.6.0-SNAPSHOT.jar>
[INFO] 
[INFO] --- maven-site-plugin:3.1:attach-descriptor (attach-descriptor) @ cloud-plugin-hypervisor-vmware
---
[INFO] 
[INFO] --- maven-install-plugin:2.3.1:install (default-install) @ cloud-plugin-hypervisor-vmware
---
[INFO] Installing <http://jenkins.buildacloud.org/job/build-master-noredist/ws/plugins/hypervisors/vmware/target/cloud-plugin-hypervisor-vmware-4.6.0-SNAPSHOT.jar>
to /home/jenkins/.m2/repository/org/apache/cloudstack/cloud-plugin-hypervisor-vmware/4.6.0-SNAPSHOT/cloud-plugin-hypervisor-vmware-4.6.0-SNAPSHOT.jar
[INFO] Installing <http://jenkins.buildacloud.org/job/build-master-noredist/ws/plugins/hypervisors/vmware/pom.xml>
to /home/jenkins/.m2/repository/org/apache/cloudstack/cloud-plugin-hypervisor-vmware/4.6.0-SNAPSHOT/cloud-plugin-hypervisor-vmware-4.6.0-SNAPSHOT.pom
[INFO] 
[INFO] --- maven-surefire-plugin:2.18.1:test (default-test) @ cloud-plugin-storage-volume-solidfire
---
[INFO] Tests are skipped.
[INFO] 
[INFO] --- maven-jar-plugin:2.5:jar (default-jar) @ cloud-plugin-storage-volume-solidfire
---
[INFO] Building jar: <http://jenkins.buildacloud.org/job/build-master-noredist/ws/plugins/storage/volume/solidfire/target/cloud-plugin-storage-volume-solidfire-4.6.0-SNAPSHOT.jar>
[INFO] 
[INFO] --- maven-site-plugin:3.1:attach-descriptor (attach-descriptor) @ cloud-plugin-storage-volume-solidfire
---
[INFO] 
[INFO] --- maven-surefire-plugin:2.18.1:test (default) @ cloud-plugin-storage-volume-solidfire
---
[INFO] Tests are skipped.
[INFO] 
[INFO] --- maven-install-plugin:2.3.1:install (default-install) @ cloud-plugin-storage-volume-solidfire
---
[INFO] Installing <http://jenkins.buildacloud.org/job/build-master-noredist/ws/plugins/storage/volume/solidfire/target/cloud-plugin-storage-volume-solidfire-4.6.0-SNAPSHOT.jar>
to /home/jenkins/.m2/repository/org/apache/cloudstack/cloud-plugin-storage-volume-solidfire/4.6.0-SNAPSHOT/cloud-plugin-storage-volume-solidfire-4.6.0-SNAPSHOT.jar
[INFO] Installing <http://jenkins.buildacloud.org/job/build-master-noredist/ws/plugins/storage/volume/solidfire/pom.xml>
to /home/jenkins/.m2/repository/org/apache/cloudstack/cloud-plugin-storage-volume-solidfire/4.6.0-SNAPSHOT/cloud-plugin-storage-volume-solidfire-4.6.0-SNAPSHOT.pom
[INFO] ------------------------------------------------------------------------
[INFO] Reactor Summary:
[INFO] 
[INFO] Apache CloudStack Developer Tools - Checkstyle Configuration  SUCCESS [0.968s]
[INFO] Apache CloudStack ................................. SUCCESS [1.212s]
[INFO] Apache CloudStack Maven Conventions Parent ........ SUCCESS [0.972s]
[INFO] Apache CloudStack Framework - Managed Context ..... SUCCESS [3.266s]
[INFO] Apache CloudStack Utils ........................... SUCCESS [12.584s]
[INFO] Apache CloudStack Framework ....................... SUCCESS [0.328s]
[INFO] Apache CloudStack Framework - Event Notification .. SUCCESS [7.176s]
[INFO] Apache CloudStack Framework - Configuration ....... SUCCESS [3.913s]
[INFO] Apache CloudStack API ............................. SUCCESS [13.021s]
[INFO] Apache CloudStack Framework - REST ................ SUCCESS [3.907s]
[INFO] Apache CloudStack Framework - IPC ................. SUCCESS [4.220s]
[INFO] Apache CloudStack Cloud Engine .................... SUCCESS [0.328s]
[INFO] Apache CloudStack Cloud Engine API ................ SUCCESS [4.278s]
[INFO] Apache CloudStack Framework - Security ............ SUCCESS [1.984s]
[INFO] Apache CloudStack Core ............................ SUCCESS [21.218s]
[INFO] Apache CloudStack Agents .......................... SUCCESS [6.713s]
[INFO] Apache CloudStack Framework - Clustering .......... SUCCESS [2.774s]
[INFO] Apache CloudStack Framework - Event Notification .. SUCCESS [1.762s]
[INFO] Apache CloudStack Cloud Engine Schema Component ... SUCCESS [13.561s]
[INFO] Apache CloudStack Framework - Jobs ................ SUCCESS [5.833s]
[INFO] Apache CloudStack Cloud Engine Internal Components API  SUCCESS [2.817s]
[INFO] Apache CloudStack Server .......................... SUCCESS [44.130s]
[INFO] Apache CloudStack Usage Server .................... SUCCESS [6.545s]
[INFO] Apache CloudStack Cloud Engine Orchestration Component  SUCCESS [10.099s]
[INFO] Apache CloudStack Cloud Services .................. SUCCESS [0.328s]
[INFO] Apache CloudStack Secondary Storage ............... SUCCESS [2.674s]
[INFO] Apache CloudStack Secondary Storage Service ....... SUCCESS [12.509s]
[INFO] Apache CloudStack Engine Storage Component ........ SUCCESS [23.953s]
[INFO] Apache CloudStack Engine Storage Volume Component . SUCCESS [11.054s]
[INFO] Apache CloudStack Engine Storage Image Component .. SUCCESS [6.868s]
[INFO] Apache CloudStack Engine Storage Data Motion Component  SUCCESS [4.715s]
[INFO] Apache CloudStack Engine Storage Cache Component .. SUCCESS [6.531s]
[INFO] Apache CloudStack Engine Storage Snapshot Component  SUCCESS [17.534s]
[INFO] Apache CloudStack Cloud Engine API ................ SUCCESS [1.847s]
[INFO] Apache CloudStack Cloud Engine Service ............ SUCCESS [14.230s]
[INFO] Apache CloudStack Plugin POM ...................... SUCCESS [0.324s]
[INFO] Apache CloudStack Plugin - API Rate Limit ......... SUCCESS [32.441s]
[INFO] Apache CloudStack Plugin - Storage Volume default provider  SUCCESS [4.653s]
[INFO] Apache CloudStack Plugin - Storage Volume SolidFire Provider  SUCCESS [5.778s]
[INFO] Apache CloudStack Plugin - API SolidFire .......... SKIPPED
[INFO] Apache CloudStack Plugin - API Discovery .......... SUCCESS [10.937s]
[INFO] Apache CloudStack Plugin - ACL Static Role Based .. SUCCESS [12.796s]
[INFO] Apache CloudStack Plugin - Host Anti-Affinity Processor  SUCCESS [7.597s]
[INFO] Apache CloudStack Plugin - Explicit Dedication Processor  SUCCESS [7.272s]
[INFO] Apache CloudStack Plugin - User Concentrated Pod Deployment Planner  SUCCESS [3.665s]
[INFO] Apache CloudStack Plugin - User Dispersing Deployment Planner  SUCCESS [15.990s]
[INFO] Apache CloudStack Plugin - Implicit Dedication Planner  SUCCESS [35.718s]
[INFO] Apache CloudStack Plugin - Skip Heurestics Planner  SUCCESS [12.436s]
[INFO] Apache CloudStack Plugin - Host Allocator Random .. SUCCESS [8.518s]
[INFO] Apache CloudStack Plugin - Dedicated Resources .... SUCCESS [35.226s]
[INFO] Apache CloudStack Plugin - Hypervisor OracleVM .... SUCCESS [12.259s]
[INFO] Apache CloudStack Plugin - Open vSwitch ........... SUCCESS [19.466s]
[INFO] Apache CloudStack Plugin - Hypervisor XenServer ... FAILURE [16.949s]
[INFO] Apache CloudStack Plugin - Hypervisor KVM ......... SUCCESS [33.971s]
[INFO] Apache CloudStack Plugin - RabbitMQ Event Bus ..... SUCCESS [7.988s]
[INFO] Apache CloudStack Plugin - In Memory Event Bus .... SUCCESS [27.694s]
[INFO] Apache CloudStack Plugin - Kafka Event Bus ........ SUCCESS [7.723s]
[INFO] Apache CloudStack Plugin - Hypervisor Baremetal ... SUCCESS [26.959s]
[INFO] Apache CloudStack Plugin - Hypervisor UCS ......... SUCCESS [15.203s]
[INFO] Apache CloudStack Plugin - Hypervisor Hyper-V ..... SUCCESS [33.941s]
[INFO] Apache CloudStack Plugin - Hypervisor OracleVM3 ... SUCCESS [56.497s]
[INFO] Apache CloudStack Plugin - Network Elastic Load Balancer  SUCCESS [23.647s]
[INFO] Apache CloudStack Plugin - Network Internal Load Balancer  SUCCESS [41.320s]
[INFO] Apache CloudStack Framework - Spring Life Cycle ... SUCCESS [2.059s]
[INFO] Apache CloudStack Plugin - Network Juniper Contrail  SKIPPED
[INFO] Apache CloudStack Plugin - Palo Alto .............. SUCCESS [37.326s]
[INFO] Apache CloudStack Plugin - Network Netscaler ...... SUCCESS [26.240s]
[INFO] Apache CloudStack Plugin - Network Nicira NVP ..... SUCCESS [55.683s]
[INFO] Apache CloudStack Plugin - BigSwitch Virtual Network Segment  SUCCESS [55.444s]
[INFO] Apache CloudStack Plugin - Network Brocade VCS .... SUCCESS [40.709s]
[INFO] Apache CloudStack Plugin - Midokura Midonet ....... SUCCESS [9.249s]
[INFO] Apache CloudStack Plugin - Stratosphere SSP ....... SUCCESS [33.354s]
[INFO] Apache CloudStack Plugin - Network Opendaylight ... SUCCESS [36.196s]
[INFO] Apache CloudStack Plugin - Storage Allocator Random  SUCCESS [5.875s]
[INFO] Apache CloudStack Plugin - User Authenticator LDAP  SUCCESS [20.995s]
[INFO] Apache CloudStack Plugin - User Authenticator MD5 . SUCCESS [24.448s]
[INFO] Apache CloudStack Plugin - User Authenticator PBKDF2-SHA-256  SUCCESS [29.771s]
[INFO] Apache CloudStack Plugin - User Authenticator Plain Text  SUCCESS [14.159s]
[INFO] Apache CloudStack Plugin - User Authenticator SAML2  SKIPPED
[INFO] Apache CloudStack Plugin - User Authenticator SHA256 Salted  SUCCESS [26.405s]
[INFO] Apache CloudStack Plugin - Dns Notifier Example ... SUCCESS [16.552s]
[INFO] Apache CloudStack Plugin - Storage Image S3 ....... SKIPPED
[INFO] Apache CloudStack Plugin - Storage Image Swift provider  SKIPPED
[INFO] Apache CloudStack Plugin - Storage Image default provider  SKIPPED
[INFO] Apache CloudStack Plugin - Storage Image sample provider  SKIPPED
[INFO] Apache CloudStack Plugin - Storage Volume Nexenta Provider  SUCCESS [6.852s]
[INFO] Apache CloudStack Plugin - Storage Volume CloudByte Provider  SUCCESS [3.948s]
[INFO] Apache CloudStack Plugin - Storage Volume sample provider  SUCCESS [4.065s]
[INFO] Apache CloudStack Plugin - SNMP Alerts ............ SUCCESS [27.015s]
[INFO] Apache CloudStack Plugin - Syslog Alerts .......... SUCCESS [24.392s]
[INFO] Apache CloudStack Plugin - Network VXLAN .......... SUCCESS [25.515s]
[INFO] Apache CloudStack Plugin - GloboDNS ............... SUCCESS [32.175s]
[INFO] Apache CloudStack Plugin - NetApp File System ..... SUCCESS [17.578s]
[INFO] Apache CloudStack Plugin - F5 ..................... SUCCESS [20.347s]
[INFO] Apache CloudStack Plugin - Juniper SRX ............ SUCCESS [22.138s]
[INFO] Apache CloudStack Plugin - Nuage VSP .............. SUCCESS [28.900s]
[INFO] Apache CloudStack VMware Base ..................... SUCCESS [8.531s]
[INFO] Apache CloudStack Plugin - Hypervisor VMware ...... SUCCESS [20.685s]
[INFO] Apache CloudStack Plugin - Cisco VNMC ............. SKIPPED
[INFO] Apache CloudStack Plugin - MySQL HA Strategy ...... SUCCESS [14.350s]
[INFO] Apache CloudStack Framework - Spring Module ....... SUCCESS [6.433s]
[INFO] Apache CloudStack Secondary Storage Controller .... SUCCESS [4.421s]
[INFO] Apache CloudStack Console Proxy - RDP Client ...... SUCCESS [9.210s]
[INFO] Apache CloudStack Console Proxy ................... SUCCESS [2.365s]
[INFO] Apache CloudStack Console Proxy - Server .......... SUCCESS [4.706s]
[INFO] Apache CloudStack System VM ....................... SKIPPED
[INFO] Apache CloudStack Client UI ....................... SKIPPED
[INFO] Apache CloudStack Framework - QuickCloud .......... SUCCESS [0.787s]
[INFO] ------------------------------------------------------------------------
[INFO] BUILD FAILURE
[INFO] ------------------------------------------------------------------------
[INFO] Total time: 3:09.227s (Wall Clock)
[INFO] Finished at: Wed Aug 19 17:35:23 UTC 2015
[Fatal Error] :-1:-1: Premature end of file.
[INFO] Final Memory: 92M/946M
[INFO] ------------------------------------------------------------------------
[WARNING] The requested profile "awsapi" could not be activated because it does not exist.
Tests run: 2, Failures: 0, Errors: 0, Skipped: 0, Time elapsed: 8.258 sec - in org.apache.cloudstack.api.command.SAML2LoginAPIAuthenticatorCmdTest
Running org.apache.cloudstack.api.command.SAML2LogoutAPIAuthenticatorCmdTest
[ERROR] Failed to execute goal org.apache.maven.plugins:maven-compiler-plugin:3.2:testCompile
(default-testCompile) on project cloud-plugin-hypervisor-xenserver: Compilation failure: Compilation
failure:
[ERROR] <http://jenkins.buildacloud.org/job/build-master-noredist/ws/plugins/hypervisors/xenserver/test/com/cloud/hypervisor/xenserver/resource/wrapper/xenbase/CitrixRequestWrapperTest.java>:[1581,51]
error: constructor CreateVMSnapshotCommand in class CreateVMSnapshotCommand cannot be applied
to given types;
[ERROR] required: String,String,VMSnapshotTO,List<VolumeObjectTO>,String
[ERROR] found: String,VMSnapshotTO,List<VolumeObjectTO>,String
[ERROR] reason: actual and formal argument lists differ in length
[ERROR] <http://jenkins.buildacloud.org/job/build-master-noredist/ws/plugins/hypervisors/xenserver/test/com/cloud/hypervisor/xenserver/resource/wrapper/xenbase/CitrixRequestWrapperTest.java>:[1623,53]
error: no suitable constructor found for RevertToVMSnapshotCommand(String,VMSnapshotTO,List<VolumeObjectTO>,String)
[ERROR] -> [Help 1]
[ERROR] 
[ERROR] To see the full stack trace of the errors, re-run Maven with the -e switch.
[ERROR] Re-run Maven using the -X switch to enable full debug logging.
[ERROR] 
[ERROR] For more information about the errors and possible solutions, please read the following
articles:
[ERROR] [Help 1] http://cwiki.apache.org/confluence/display/MAVEN/MojoFailureException
[ERROR] 
[ERROR] After correcting the problems, you can resume the build with the command
[ERROR]   mvn <goals> -rf :cloud-plugin-hypervisor-xenserver
Build step 'Invoke top-level Maven targets' marked build as failure
Archiving artifacts

Mime
View raw message