cloudstack-dev mailing list archives

Site index · List index
Message view « Date » · « Thread »
Top « Date » · « Thread »
From jenk...@cloudstack.org
Subject Build failed in Jenkins: build-master-jdk18 #293
Date Wed, 19 Aug 2015 18:15:52 GMT
See <http://jenkins.buildacloud.org/job/build-master-jdk18/293/changes>

Changes:

[github] CLOUDSTACK-8748: VM UUID accessible in CreateVMSnapshotCommand and RevertToVMSnapshotCommand

------------------------------------------
[...truncated 2601 lines...]
Results :

Tests run: 10, Failures: 0, Errors: 0, Skipped: 0

[INFO]                                                                         
[INFO] ------------------------------------------------------------------------
[INFO] Building Apache CloudStack Plugin - Hypervisor OracleVM 4.6.0-SNAPSHOT
[INFO] ------------------------------------------------------------------------
[INFO] 
[INFO] --- maven-clean-plugin:2.5:clean (default-clean) @ cloud-plugin-hypervisor-ovm ---
[INFO] Deleting <http://jenkins.buildacloud.org/job/build-master-jdk18/ws/plugins/hypervisors/ovm/target>
(includes = [**/*], excludes = [])
[INFO] Deleting <http://jenkins.buildacloud.org/job/build-master-jdk18/ws/plugins/hypervisors/ovm>
(includes = [target, dist], excludes = [])
[INFO] 
[INFO] --- maven-checkstyle-plugin:2.11:check (cloudstack-checkstyle) @ cloud-plugin-hypervisor-ovm
---
[INFO] Starting audit...
Audit done.

[INFO] 
[INFO] --- maven-remote-resources-plugin:1.3:process (default) @ cloud-plugin-hypervisor-ovm
---
[INFO] 
[INFO] --- maven-resources-plugin:2.5:resources (default-resources) @ cloud-plugin-hypervisor-ovm
---
[debug] execute contextualize
[INFO] Using 'UTF-8' encoding to copy filtered resources.
[INFO] Copying 4 resources
[INFO] Copying 3 resources
[INFO] 
[INFO] --- maven-compiler-plugin:3.2:compile (default-compile) @ cloud-plugin-hypervisor-ovm
---
[INFO] Changes detected - recompiling the module!
[INFO] Compiling 18 source files to <http://jenkins.buildacloud.org/job/build-master-jdk18/ws/plugins/hypervisors/ovm/target/classes>
[INFO] 
[INFO] --- maven-resources-plugin:2.5:testResources (default-testResources) @ cloud-plugin-hypervisor-ovm
---
[debug] execute contextualize
[INFO] Using 'UTF-8' encoding to copy filtered resources.
[INFO] skip non existing resourceDirectory <http://jenkins.buildacloud.org/job/build-master-jdk18/ws/plugins/hypervisors/ovm/test/resources>
[INFO] Copying 3 resources
[INFO] 
[INFO] --- maven-compiler-plugin:3.2:testCompile (default-testCompile) @ cloud-plugin-hypervisor-ovm
---
[INFO] No sources to compile
[INFO] 
[INFO] --- maven-surefire-plugin:2.18.1:test (default-test) @ cloud-plugin-hypervisor-ovm
---
[INFO]                                                                         
[INFO] ------------------------------------------------------------------------
[INFO] Building Apache CloudStack Plugin - Open vSwitch 4.6.0-SNAPSHOT
[INFO] ------------------------------------------------------------------------
[INFO] 
[INFO] --- maven-clean-plugin:2.5:clean (default-clean) @ cloud-plugin-network-ovs ---
[INFO] Deleting <http://jenkins.buildacloud.org/job/build-master-jdk18/ws/plugins/network-elements/ovs/target>
(includes = [**/*], excludes = [])
[INFO] Deleting <http://jenkins.buildacloud.org/job/build-master-jdk18/ws/plugins/network-elements/ovs>
(includes = [target, dist], excludes = [])
[INFO] 
[INFO] --- maven-checkstyle-plugin:2.11:check (cloudstack-checkstyle) @ cloud-plugin-network-ovs
---
[INFO] Starting audit...
Audit done.

[INFO] 
[INFO] --- maven-remote-resources-plugin:1.3:process (default) @ cloud-plugin-network-ovs
---
[INFO] 
[INFO] --- maven-resources-plugin:2.5:resources (default-resources) @ cloud-plugin-network-ovs
---
[debug] execute contextualize
[INFO] Using 'UTF-8' encoding to copy filtered resources.
[INFO] Copying 2 resources
[INFO] Copying 3 resources
[INFO] 
[INFO] --- maven-compiler-plugin:3.2:compile (default-compile) @ cloud-plugin-network-ovs
---
[INFO] Changes detected - recompiling the module!
[INFO] Compiling 33 source files to <http://jenkins.buildacloud.org/job/build-master-jdk18/ws/plugins/network-elements/ovs/target/classes>
[INFO] 
[INFO] --- maven-resources-plugin:2.5:testResources (default-testResources) @ cloud-plugin-network-ovs
---
[debug] execute contextualize
[INFO] Using 'UTF-8' encoding to copy filtered resources.
[INFO] skip non existing resourceDirectory <http://jenkins.buildacloud.org/job/build-master-jdk18/ws/plugins/network-elements/ovs/test/resources>
[INFO] Copying 3 resources
[INFO] 
[INFO] --- maven-compiler-plugin:3.2:testCompile (default-testCompile) @ cloud-plugin-network-ovs
---
[INFO] No sources to compile
[INFO] 
[INFO] --- maven-surefire-plugin:2.18.1:test (default-test) @ cloud-plugin-network-ovs ---
[INFO]                                                                         
[INFO] ------------------------------------------------------------------------
[INFO] Building Apache CloudStack Plugin - Hypervisor XenServer 4.6.0-SNAPSHOT
[INFO] ------------------------------------------------------------------------
[INFO] 
[INFO] --- maven-clean-plugin:2.5:clean (default-clean) @ cloud-plugin-hypervisor-xenserver
---
[INFO] Deleting <http://jenkins.buildacloud.org/job/build-master-jdk18/ws/plugins/hypervisors/xenserver/target>
(includes = [**/*], excludes = [])
[INFO] Deleting <http://jenkins.buildacloud.org/job/build-master-jdk18/ws/plugins/hypervisors/xenserver>
(includes = [target, dist], excludes = [])
[INFO] 
[INFO] --- maven-checkstyle-plugin:2.11:check (cloudstack-checkstyle) @ cloud-plugin-hypervisor-xenserver
---
[INFO] Starting audit...
Audit done.

[INFO] 
[INFO] --- maven-remote-resources-plugin:1.3:process (default) @ cloud-plugin-hypervisor-xenserver
---
[INFO] 
[INFO] --- maven-resources-plugin:2.5:resources (default-resources) @ cloud-plugin-hypervisor-xenserver
---
[debug] execute contextualize
[INFO] Using 'UTF-8' encoding to copy filtered resources.
[INFO] Copying 4 resources
[INFO] Copying 3 resources
[INFO] 
[INFO] --- maven-compiler-plugin:3.2:compile (default-compile) @ cloud-plugin-hypervisor-xenserver
---
[INFO] Changes detected - recompiling the module!
[INFO] Compiling 99 source files to <http://jenkins.buildacloud.org/job/build-master-jdk18/ws/plugins/hypervisors/xenserver/target/classes>
[INFO] 
[INFO] --- maven-resources-plugin:2.5:testResources (default-testResources) @ cloud-plugin-hypervisor-xenserver
---
[debug] execute contextualize
[INFO] Using 'UTF-8' encoding to copy filtered resources.
[INFO] skip non existing resourceDirectory <http://jenkins.buildacloud.org/job/build-master-jdk18/ws/plugins/hypervisors/xenserver/test/resources>
[INFO] Copying 3 resources
[INFO] 
[INFO] --- maven-compiler-plugin:3.2:testCompile (default-testCompile) @ cloud-plugin-hypervisor-xenserver
---
[INFO] Changes detected - recompiling the module!
[INFO] Compiling 7 source files to <http://jenkins.buildacloud.org/job/build-master-jdk18/ws/plugins/hypervisors/xenserver/target/test-classes>
[INFO] -------------------------------------------------------------
[ERROR] COMPILATION ERROR : 
[INFO] -------------------------------------------------------------
[ERROR] <http://jenkins.buildacloud.org/job/build-master-jdk18/ws/plugins/hypervisors/xenserver/test/com/cloud/hypervisor/xenserver/resource/wrapper/xenbase/CitrixRequestWrapperTest.java>:[1581,51]
error: constructor CreateVMSnapshotCommand in class CreateVMSnapshotCommand cannot be applied
to given types;
[ERROR]   required: String,String,VMSnapshotTO,List<VolumeObjectTO>,String
  found: String,VMSnapshotTO,List<VolumeObjectTO>,String
  reason: actual and formal argument lists differ in length
<http://jenkins.buildacloud.org/job/build-master-jdk18/ws/plugins/hypervisors/xenserver/test/com/cloud/hypervisor/xenserver/resource/wrapper/xenbase/CitrixRequestWrapperTest.java>:[1623,53]
error: no suitable constructor found for RevertToVMSnapshotCommand(String,VMSnapshotTO,List<VolumeObjectTO>,String)
[INFO] 2 errors 
[INFO] -------------------------------------------------------------
[INFO] ------------------------------------------------------------------------
[INFO] Reactor Summary:
[INFO] 
[INFO] Apache CloudStack Developer Tools - Checkstyle Configuration  SUCCESS [3.024s]
[INFO] Apache CloudStack ................................. SUCCESS [3.444s]
[INFO] Apache CloudStack Maven Conventions Parent ........ SUCCESS [6.326s]
[INFO] Apache CloudStack Framework - Managed Context ..... SUCCESS [10.284s]
[INFO] Apache CloudStack Utils ........................... SUCCESS [37.633s]
[INFO] Apache CloudStack Framework ....................... SUCCESS [0.113s]
[INFO] Apache CloudStack Framework - Event Notification .. SUCCESS [20.177s]
[INFO] Apache CloudStack Framework - Configuration ....... SUCCESS [12.068s]
[INFO] Apache CloudStack API ............................. SUCCESS [44.323s]
[INFO] Apache CloudStack Framework - REST ................ SUCCESS [6.533s]
[INFO] Apache CloudStack Framework - IPC ................. SUCCESS [13.224s]
[INFO] Apache CloudStack Cloud Engine .................... SUCCESS [0.095s]
[INFO] Apache CloudStack Cloud Engine API ................ SUCCESS [12.521s]
[INFO] Apache CloudStack Framework - Security ............ SUCCESS [5.495s]
[INFO] Apache CloudStack Core ............................ SUCCESS [28.729s]
[INFO] Apache CloudStack Agents .......................... SUCCESS [15.062s]
[INFO] Apache CloudStack Framework - Clustering .......... SUCCESS [8.202s]
[INFO] Apache CloudStack Framework - Event Notification .. SUCCESS [5.670s]
[INFO] Apache CloudStack Cloud Engine Schema Component ... SUCCESS [40.895s]
[INFO] Apache CloudStack Framework - Jobs ................ SUCCESS [13.541s]
[INFO] Apache CloudStack Cloud Engine Internal Components API  SUCCESS [7.950s]
[INFO] Apache CloudStack Server .......................... SUCCESS [2:08.389s]
[INFO] Apache CloudStack Usage Server .................... SUCCESS [18.083s]
[INFO] Apache CloudStack Cloud Engine Orchestration Component  SUCCESS [26.715s]
[INFO] Apache CloudStack Cloud Services .................. SUCCESS [0.083s]
[INFO] Apache CloudStack Secondary Storage ............... SUCCESS [0.910s]
[INFO] Apache CloudStack Secondary Storage Service ....... SUCCESS [15.723s]
[INFO] Apache CloudStack Engine Storage Component ........ SUCCESS [21.996s]
[INFO] Apache CloudStack Engine Storage Volume Component . SUCCESS [12.537s]
[INFO] Apache CloudStack Engine Storage Image Component .. SUCCESS [7.677s]
[INFO] Apache CloudStack Engine Storage Data Motion Component  SUCCESS [6.323s]
[INFO] Apache CloudStack Engine Storage Cache Component .. SUCCESS [6.435s]
[INFO] Apache CloudStack Engine Storage Snapshot Component  SUCCESS [23.182s]
[INFO] Apache CloudStack Cloud Engine API ................ SUCCESS [4.436s]
[INFO] Apache CloudStack Cloud Engine Service ............ SUCCESS [1.604s]
[INFO] Apache CloudStack Plugin POM ...................... SUCCESS [0.731s]
[INFO] Apache CloudStack Plugin - API Rate Limit ......... SUCCESS [16.399s]
[INFO] Apache CloudStack Plugin - Storage Volume default provider  SUCCESS [6.746s]
[INFO] Apache CloudStack Plugin - Storage Volume SolidFire Provider  SUCCESS [13.361s]
[INFO] Apache CloudStack Plugin - API SolidFire .......... SUCCESS [5.725s]
[INFO] Apache CloudStack Plugin - API Discovery .......... SUCCESS [11.861s]
[INFO] Apache CloudStack Plugin - ACL Static Role Based .. SUCCESS [5.059s]
[INFO] Apache CloudStack Plugin - Host Anti-Affinity Processor  SUCCESS [4.611s]
[INFO] Apache CloudStack Plugin - Explicit Dedication Processor  SUCCESS [5.818s]
[INFO] Apache CloudStack Plugin - User Concentrated Pod Deployment Planner  SUCCESS [5.042s]
[INFO] Apache CloudStack Plugin - User Dispersing Deployment Planner  SUCCESS [5.807s]
[INFO] Apache CloudStack Plugin - Implicit Dedication Planner  SUCCESS [19.188s]
[INFO] Apache CloudStack Plugin - Skip Heurestics Planner  SUCCESS [4.979s]
[INFO] Apache CloudStack Plugin - Host Allocator Random .. SUCCESS [5.109s]
[INFO] Apache CloudStack Plugin - Dedicated Resources .... SUCCESS [18.950s]
[INFO] Apache CloudStack Plugin - Hypervisor OracleVM .... SUCCESS [8.466s]
[INFO] Apache CloudStack Plugin - Open vSwitch ........... SUCCESS [9.644s]
[INFO] Apache CloudStack Plugin - Hypervisor XenServer ... FAILURE [25.993s]
[INFO] Apache CloudStack Plugin - Hypervisor KVM ......... SKIPPED
[INFO] Apache CloudStack Plugin - RabbitMQ Event Bus ..... SKIPPED
[INFO] Apache CloudStack Plugin - In Memory Event Bus .... SKIPPED
[INFO] Apache CloudStack Plugin - Kafka Event Bus ........ SKIPPED
[INFO] Apache CloudStack Plugin - Hypervisor Baremetal ... SKIPPED
[INFO] Apache CloudStack Plugin - Hypervisor UCS ......... SKIPPED
[INFO] Apache CloudStack Plugin - Hypervisor Hyper-V ..... SKIPPED
[INFO] Apache CloudStack Plugin - Hypervisor OracleVM3 ... SKIPPED
[INFO] Apache CloudStack Plugin - Network Elastic Load Balancer  SKIPPED
[INFO] Apache CloudStack Plugin - Network Internal Load Balancer  SKIPPED
[INFO] Apache CloudStack Framework - Spring Life Cycle ... SKIPPED
[INFO] Apache CloudStack Plugin - Network Juniper Contrail  SKIPPED
[INFO] Apache CloudStack Plugin - Palo Alto .............. SKIPPED
[INFO] Apache CloudStack Plugin - Network Netscaler ...... SKIPPED
[INFO] Apache CloudStack Plugin - Network Nicira NVP ..... SKIPPED
[INFO] Apache CloudStack Plugin - BigSwitch Virtual Network Segment  SKIPPED
[INFO] Apache CloudStack Plugin - Network Brocade VCS .... SKIPPED
[INFO] Apache CloudStack Plugin - Midokura Midonet ....... SKIPPED
[INFO] Apache CloudStack Plugin - Stratosphere SSP ....... SKIPPED
[INFO] Apache CloudStack Plugin - Network Opendaylight ... SKIPPED
[INFO] Apache CloudStack Plugin - Storage Allocator Random  SKIPPED
[INFO] Apache CloudStack Plugin - User Authenticator LDAP  SKIPPED
[INFO] Apache CloudStack Plugin - User Authenticator MD5 . SKIPPED
[INFO] Apache CloudStack Plugin - User Authenticator PBKDF2-SHA-256  SKIPPED
[INFO] Apache CloudStack Plugin - User Authenticator Plain Text  SKIPPED
[INFO] Apache CloudStack Plugin - User Authenticator SAML2  SKIPPED
[INFO] Apache CloudStack Plugin - User Authenticator SHA256 Salted  SKIPPED
[INFO] Apache CloudStack Plugin - Dns Notifier Example ... SKIPPED
[INFO] Apache CloudStack Plugin - Storage Image S3 ....... SKIPPED
[INFO] Apache CloudStack Plugin - Storage Image Swift provider  SKIPPED
[INFO] Apache CloudStack Plugin - Storage Image default provider  SKIPPED
[INFO] Apache CloudStack Plugin - Storage Image sample provider  SKIPPED
[INFO] Apache CloudStack Plugin - Storage Volume Nexenta Provider  SKIPPED
[INFO] Apache CloudStack Plugin - Storage Volume CloudByte Provider  SKIPPED
[INFO] Apache CloudStack Plugin - Storage Volume sample provider  SKIPPED
[INFO] Apache CloudStack Plugin - SNMP Alerts ............ SKIPPED
[INFO] Apache CloudStack Plugin - Syslog Alerts .......... SKIPPED
[INFO] Apache CloudStack Plugin - Network VXLAN .......... SKIPPED
[INFO] Apache CloudStack Plugin - GloboDNS ............... SKIPPED
[INFO] Apache CloudStack Framework - Spring Module ....... SKIPPED
[INFO] Apache CloudStack Secondary Storage Controller .... SKIPPED
[INFO] Apache CloudStack Console Proxy - RDP Client ...... SKIPPED
[INFO] Apache CloudStack Console Proxy ................... SKIPPED
[INFO] Apache CloudStack Console Proxy - Server .......... SKIPPED
[INFO] Apache CloudStack System VM ....................... SKIPPED
[INFO] Apache CloudStack Client UI ....................... SKIPPED
[INFO] Apache CloudStack Framework - QuickCloud .......... SKIPPED
[INFO] ------------------------------------------------------------------------
[INFO] BUILD FAILURE
[INFO] ------------------------------------------------------------------------
[INFO] Total time: 12:30.092s
[INFO] Finished at: Wed Aug 19 18:20:14 UTC 2015
[INFO] Final Memory: 58M/202M
[INFO] ------------------------------------------------------------------------
[ERROR] Failed to execute goal org.apache.maven.plugins:maven-compiler-plugin:3.2:testCompile
(default-testCompile) on project cloud-plugin-hypervisor-xenserver: Compilation failure: Compilation
failure:
[ERROR] <http://jenkins.buildacloud.org/job/build-master-jdk18/ws/plugins/hypervisors/xenserver/test/com/cloud/hypervisor/xenserver/resource/wrapper/xenbase/CitrixRequestWrapperTest.java>:[1581,51]
error: constructor CreateVMSnapshotCommand in class CreateVMSnapshotCommand cannot be applied
to given types;
[ERROR] required: String,String,VMSnapshotTO,List<VolumeObjectTO>,String
[ERROR] found: String,VMSnapshotTO,List<VolumeObjectTO>,String
[ERROR] reason: actual and formal argument lists differ in length
[ERROR] <http://jenkins.buildacloud.org/job/build-master-jdk18/ws/plugins/hypervisors/xenserver/test/com/cloud/hypervisor/xenserver/resource/wrapper/xenbase/CitrixRequestWrapperTest.java>:[1623,53]
error: no suitable constructor found for RevertToVMSnapshotCommand(String,VMSnapshotTO,List<VolumeObjectTO>,String)
[ERROR] -> [Help 1]
[ERROR] 
[ERROR] To see the full stack trace of the errors, re-run Maven with the -e switch.
[ERROR] Re-run Maven using the -X switch to enable full debug logging.
[ERROR] 
[ERROR] For more information about the errors and possible solutions, please read the following
articles:
[ERROR] [Help 1] http://cwiki.apache.org/confluence/display/MAVEN/MojoFailureException
[ERROR] 
[ERROR] After correcting the problems, you can resume the build with the command
[ERROR]   mvn <goals> -rf :cloud-plugin-hypervisor-xenserver
Build step 'Invoke top-level Maven targets' marked build as failure
Recording test results

Mime
View raw message