cloudstack-dev mailing list archives

Site index · List index
Message view « Date » · « Thread »
Top « Date » · « Thread »
From jenk...@cloudstack.org
Subject Build failed in Jenkins: build-master-noredist #4588
Date Sat, 29 Aug 2015 20:08:02 GMT
See <http://jenkins.buildacloud.org/job/build-master-noredist/4588/changes>

Changes:

[rafaelweingartner] Solved jira ticket: CLOUDSTACK-8750

------------------------------------------
[...truncated 10337 lines...]
Tests run: 1, Failures: 0, Errors: 0, Skipped: 0, Time elapsed: 0.003 sec - in src.SnapshotDataFactoryTest
[INFO] 
[INFO] --- maven-resources-plugin:2.5:testResources (default-testResources) @ cloud-engine-storage-datamotion
---
[debug] execute contextualize
[INFO] Using 'UTF-8' encoding to copy filtered resources.
[INFO] skip non existing resourceDirectory <http://jenkins.buildacloud.org/job/build-master-noredist/ws/engine/storage/datamotion/test/resources>
[INFO] Copying 3 resources
[INFO] 
[INFO] --- maven-compiler-plugin:3.2:testCompile (default-testCompile) @ cloud-engine-storage-datamotion
---
[INFO] No sources to compile

Results :

[INFO] 
Tests run: 4, Failures: 0, Errors: 0, Skipped: 0

[INFO] --- maven-surefire-plugin:2.18.1:test (default-test) @ cloud-engine-storage-datamotion
---
[INFO] 
[INFO] --- maven-jar-plugin:2.5:jar (default-jar) @ cloud-engine-storage-snapshot ---
[INFO] 
[INFO] --- maven-resources-plugin:2.5:testResources (default-testResources) @ cloud-plugin-network-midonet
---
[debug] execute contextualize
[INFO] Using 'UTF-8' encoding to copy filtered resources.
[INFO] skip non existing resourceDirectory <http://jenkins.buildacloud.org/job/build-master-noredist/ws/plugins/network-elements/midonet/test/resources>
[INFO] 
[INFO] --- maven-jar-plugin:2.5:jar (default-jar) @ cloud-engine-storage-datamotion ---
[INFO] Copying 3 resources
[INFO] 
[INFO] --- maven-compiler-plugin:3.2:testCompile (default-testCompile) @ cloud-plugin-network-midonet
---
[INFO] Building jar: <http://jenkins.buildacloud.org/job/build-master-noredist/ws/engine/storage/snapshot/target/cloud-engine-storage-snapshot-4.6.0-SNAPSHOT.jar>
[INFO] Changes detected - recompiling the module!
[INFO] Compiling 1 source file to <http://jenkins.buildacloud.org/job/build-master-noredist/ws/plugins/network-elements/midonet/target/test-classes>
[INFO] Building jar: <http://jenkins.buildacloud.org/job/build-master-noredist/ws/engine/storage/datamotion/target/cloud-engine-storage-datamotion-4.6.0-SNAPSHOT.jar>
[INFO] 
[INFO] --- maven-resources-plugin:2.5:testResources (default-testResources) @ cloud-plugin-storage-volume-nexenta
---
[debug] execute contextualize
[INFO] Using 'UTF-8' encoding to copy filtered resources.
[INFO] skip non existing resourceDirectory <http://jenkins.buildacloud.org/job/build-master-noredist/ws/plugins/storage/volume/nexenta/test/resources>
[INFO] Copying 3 resources
[INFO] 
[INFO] --- maven-compiler-plugin:3.2:testCompile (default-testCompile) @ cloud-plugin-storage-volume-nexenta
---
[INFO] Changes detected - recompiling the module!
[INFO] Compiling 2 source files to <http://jenkins.buildacloud.org/job/build-master-noredist/ws/plugins/storage/volume/nexenta/target/test-classes>
[INFO] 
[INFO] --- maven-site-plugin:3.1:attach-descriptor (attach-descriptor) @ cloud-engine-storage-snapshot
---
[INFO] 
[INFO] --- maven-surefire-plugin:2.18.1:test (default) @ cloud-engine-storage-snapshot ---
[INFO] 
[INFO] --- maven-site-plugin:3.1:attach-descriptor (attach-descriptor) @ cloud-engine-storage-datamotion
---
[INFO] Skipping execution of surefire because it has already been run for this configuration
[INFO] 
[INFO] --- maven-install-plugin:2.3.1:install (default-install) @ cloud-engine-storage-snapshot
---
[INFO] 
[INFO] --- maven-install-plugin:2.3.1:install (default-install) @ cloud-engine-storage-datamotion
---
[INFO] Installing <http://jenkins.buildacloud.org/job/build-master-noredist/ws/engine/storage/snapshot/target/cloud-engine-storage-snapshot-4.6.0-SNAPSHOT.jar>
to /home/jenkins/.m2/repository/org/apache/cloudstack/cloud-engine-storage-snapshot/4.6.0-SNAPSHOT/cloud-engine-storage-snapshot-4.6.0-SNAPSHOT.jar
[INFO] Installing <http://jenkins.buildacloud.org/job/build-master-noredist/ws/engine/storage/datamotion/target/cloud-engine-storage-datamotion-4.6.0-SNAPSHOT.jar>
to /home/jenkins/.m2/repository/org/apache/cloudstack/cloud-engine-storage-datamotion/4.6.0-SNAPSHOT/cloud-engine-storage-datamotion-4.6.0-SNAPSHOT.jar
[INFO] Installing <http://jenkins.buildacloud.org/job/build-master-noredist/ws/engine/storage/snapshot/pom.xml>
to /home/jenkins/.m2/repository/org/apache/cloudstack/cloud-engine-storage-snapshot/4.6.0-SNAPSHOT/cloud-engine-storage-snapshot-4.6.0-SNAPSHOT.pom
[INFO] Installing <http://jenkins.buildacloud.org/job/build-master-noredist/ws/engine/storage/datamotion/pom.xml>
to /home/jenkins/.m2/repository/org/apache/cloudstack/cloud-engine-storage-datamotion/4.6.0-SNAPSHOT/cloud-engine-storage-datamotion-4.6.0-SNAPSHOT.pom
[INFO] 
[INFO] --- maven-surefire-plugin:2.18.1:test (default-test) @ cloud-plugin-hypervisor-xenserver
---
[INFO] Surefire report directory: <http://jenkins.buildacloud.org/job/build-master-noredist/ws/plugins/hypervisors/xenserver/target/surefire-reports>

-------------------------------------------------------
 T E S T S
-------------------------------------------------------
log4j:WARN No appenders could be found for logger (org.opensaml.DefaultBootstrap).
log4j:WARN Please initialize the log4j system properly.
log4j:WARN See http://logging.apache.org/log4j/1.2/faq.html#noconfig for more info.
Running com.cloud.hypervisor.xenserver.resource.XenServer650ResourcePathTest
log4j:WARN No appenders could be found for logger (com.cloud.hypervisor.xenserver.resource.XenServerConnectionPool).
log4j:WARN Please initialize the log4j system properly.
log4j:WARN See http://logging.apache.org/log4j/1.2/faq.html#noconfig for more info.
Tests run: 1, Failures: 0, Errors: 0, Skipped: 0, Time elapsed: 0.164 sec - in com.cloud.hypervisor.xenserver.resource.XenServer650ResourcePathTest
Running com.cloud.hypervisor.xenserver.resource.XenServer56ResourcePathTest
Tests run: 1, Failures: 0, Errors: 0, Skipped: 0, Time elapsed: 0.001 sec - in com.cloud.hypervisor.xenserver.resource.XenServer56ResourcePathTest
Running com.cloud.hypervisor.xenserver.resource.wrapper.xenbase.CitrixRequestWrapperTest
[INFO] 
[INFO] --- maven-surefire-plugin:2.18.1:test (default-test) @ cloud-plugin-storage-volume-nexenta
---
[INFO] Tests are skipped.
[INFO] 
[INFO] --- maven-jar-plugin:2.5:jar (default-jar) @ cloud-plugin-storage-volume-nexenta ---
[INFO] Building jar: <http://jenkins.buildacloud.org/job/build-master-noredist/ws/plugins/storage/volume/nexenta/target/cloud-plugin-storage-volume-nexenta-4.6.0-SNAPSHOT.jar>
[INFO] 
[INFO] --- maven-site-plugin:3.1:attach-descriptor (attach-descriptor) @ cloud-plugin-storage-volume-nexenta
---
[INFO] 
[INFO] --- maven-surefire-plugin:2.18.1:test (default) @ cloud-plugin-storage-volume-nexenta
---
[INFO] Tests are skipped.
[INFO] 
[INFO] --- maven-install-plugin:2.3.1:install (default-install) @ cloud-plugin-storage-volume-nexenta
---
[INFO] Installing <http://jenkins.buildacloud.org/job/build-master-noredist/ws/plugins/storage/volume/nexenta/target/cloud-plugin-storage-volume-nexenta-4.6.0-SNAPSHOT.jar>
to /home/jenkins/.m2/repository/org/apache/cloudstack/cloud-plugin-storage-volume-nexenta/4.6.0-SNAPSHOT/cloud-plugin-storage-volume-nexenta-4.6.0-SNAPSHOT.jar
[INFO] Installing <http://jenkins.buildacloud.org/job/build-master-noredist/ws/plugins/storage/volume/nexenta/pom.xml>
to /home/jenkins/.m2/repository/org/apache/cloudstack/cloud-plugin-storage-volume-nexenta/4.6.0-SNAPSHOT/cloud-plugin-storage-volume-nexenta-4.6.0-SNAPSHOT.pom
[INFO] 
[INFO] --- maven-surefire-plugin:2.18.1:test (default-test) @ cloud-plugin-network-midonet
---
[INFO] Surefire report directory: <http://jenkins.buildacloud.org/job/build-master-noredist/ws/plugins/network-elements/midonet/target/surefire-reports>

-------------------------------------------------------
 T E S T S
-------------------------------------------------------
Running com.cloud.network.element.MidoNetElementTest
[INFO] ------------------------------------------------------------------------
[INFO] Reactor Summary:
[INFO] 
[INFO] Apache CloudStack Developer Tools - Checkstyle Configuration  SUCCESS [1.528s]
[INFO] Apache CloudStack ................................. SUCCESS [1.844s]
[INFO] Apache CloudStack Maven Conventions Parent ........ SUCCESS [1.084s]
[INFO] Apache CloudStack Framework - Managed Context ..... SUCCESS [3.711s]
[INFO] Apache CloudStack Utils ........................... SUCCESS [13.290s]
[INFO] Apache CloudStack Framework ....................... SUCCESS [0.131s]
[INFO] Apache CloudStack Framework - Event Notification .. SUCCESS [7.052s]
[INFO] Apache CloudStack Framework - Configuration ....... SUCCESS [4.192s]
[INFO] Apache CloudStack API ............................. SUCCESS [13.899s]
[INFO] Apache CloudStack Framework - REST ................ SUCCESS [4.659s]
[INFO] Apache CloudStack Framework - IPC ................. SUCCESS [5.342s]
[INFO] Apache CloudStack Cloud Engine .................... SUCCESS [0.533s]
[INFO] Apache CloudStack Cloud Engine API ................ SUCCESS [4.786s]
[INFO] Apache CloudStack Framework - Security ............ SUCCESS [2.410s]
[INFO] Apache CloudStack Core ............................ SUCCESS [26.650s]
[INFO] Apache CloudStack Agents .......................... SUCCESS [6.436s]
[INFO] Apache CloudStack Framework - Clustering .......... SUCCESS [5.243s]
[INFO] Apache CloudStack Framework - Event Notification .. SUCCESS [1.857s]
[INFO] Apache CloudStack Cloud Engine Schema Component ... SUCCESS [18.812s]
[INFO] Apache CloudStack Framework - Jobs ................ SUCCESS [5.614s]
[INFO] Apache CloudStack Cloud Engine Internal Components API  SUCCESS [3.131s]
[INFO] Apache CloudStack Server .......................... SUCCESS [44.339s]
[INFO] Apache CloudStack Usage Server .................... SUCCESS [7.035s]
[INFO] Apache CloudStack Cloud Engine Orchestration Component  SUCCESS [9.960s]
[INFO] Apache CloudStack Cloud Services .................. SUCCESS [0.507s]
[INFO] Apache CloudStack Secondary Storage ............... SUCCESS [4.302s]
[INFO] Apache CloudStack Secondary Storage Service ....... SUCCESS [14.339s]
[INFO] Apache CloudStack Engine Storage Component ........ SUCCESS [24.521s]
[INFO] Apache CloudStack Engine Storage Volume Component . SUCCESS [8.533s]
[INFO] Apache CloudStack Engine Storage Image Component .. SUCCESS [5.213s]
[INFO] Apache CloudStack Engine Storage Data Motion Component  SUCCESS [5.430s]
[INFO] Apache CloudStack Engine Storage Cache Component .. SUCCESS [4.340s]
[INFO] Apache CloudStack Engine Storage Snapshot Component  SUCCESS [13.959s]
[INFO] Apache CloudStack Cloud Engine API ................ SUCCESS [1.794s]
[INFO] Apache CloudStack Cloud Engine Service ............ SUCCESS [10.771s]
[INFO] Apache CloudStack Plugin POM ...................... SUCCESS [0.428s]
[INFO] Apache CloudStack Plugin - API Rate Limit ......... SUCCESS [29.239s]
[INFO] Apache CloudStack Plugin - Storage Volume default provider  SUCCESS [4.175s]
[INFO] Apache CloudStack Plugin - Storage Volume SolidFire Provider  SKIPPED
[INFO] Apache CloudStack Plugin - API SolidFire .......... SKIPPED
[INFO] Apache CloudStack Plugin - API Discovery .......... SUCCESS [27.140s]
[INFO] Apache CloudStack Plugin - ACL Static Role Based .. SUCCESS [4.859s]
[INFO] Apache CloudStack Plugin - Host Anti-Affinity Processor  SUCCESS [11.048s]
[INFO] Apache CloudStack Plugin - Explicit Dedication Processor  SUCCESS [4.975s]
[INFO] Apache CloudStack Plugin - User Concentrated Pod Deployment Planner  SUCCESS [7.713s]
[INFO] Apache CloudStack Plugin - User Dispersing Deployment Planner  SUCCESS [9.974s]
[INFO] Apache CloudStack Plugin - Implicit Dedication Planner  SUCCESS [31.735s]
[INFO] Apache CloudStack Plugin - Skip Heurestics Planner  SUCCESS [4.966s]
[INFO] Apache CloudStack Plugin - Host Allocator Random .. SUCCESS [4.822s]
[INFO] Apache CloudStack Plugin - Dedicated Resources .... SUCCESS [32.810s]
[INFO] Apache CloudStack Plugin - Hypervisor OracleVM .... SUCCESS [19.862s]
[INFO] Apache CloudStack Plugin - Open vSwitch ........... SUCCESS [18.476s]
[INFO] Apache CloudStack Plugin - Hypervisor XenServer ... SKIPPED
[INFO] Apache CloudStack Plugin - Hypervisor KVM ......... SUCCESS [29.407s]
[INFO] Apache CloudStack Plugin - RabbitMQ Event Bus ..... SUCCESS [9.833s]
[INFO] Apache CloudStack Plugin - In Memory Event Bus .... SUCCESS [14.956s]
[INFO] Apache CloudStack Plugin - Kafka Event Bus ........ SUCCESS [12.724s]
[INFO] Apache CloudStack Plugin - Hypervisor Baremetal ... SUCCESS [27.527s]
[INFO] Apache CloudStack Plugin - Hypervisor UCS ......... SUCCESS [9.954s]
[INFO] Apache CloudStack Plugin - Hypervisor Hyper-V ..... SUCCESS [34.403s]
[INFO] Apache CloudStack Plugin - Hypervisor OracleVM3 ... SUCCESS [55.784s]
[INFO] Apache CloudStack Plugin - Network Elastic Load Balancer  SUCCESS [31.727s]
[INFO] Apache CloudStack Plugin - Network Internal Load Balancer  SUCCESS [37.631s]
[INFO] Apache CloudStack Framework - Spring Life Cycle ... SUCCESS [2.206s]
[INFO] Apache CloudStack Plugin - Network Juniper Contrail  SKIPPED
[INFO] Apache CloudStack Plugin - Palo Alto .............. SUCCESS [35.955s]
[INFO] Apache CloudStack Plugin - Network Netscaler ...... SUCCESS [26.972s]
[INFO] Apache CloudStack Plugin - Network Nicira NVP ..... SUCCESS [47.820s]
[INFO] Apache CloudStack Plugin - BigSwitch Virtual Network Segment  SUCCESS [45.416s]
[INFO] Apache CloudStack Plugin - Network Brocade VCS .... SUCCESS [39.602s]
[INFO] Apache CloudStack Plugin - Midokura Midonet ....... SKIPPED
[INFO] Apache CloudStack Plugin - Stratosphere SSP ....... SUCCESS [31.727s]
[INFO] Apache CloudStack Plugin - Network Opendaylight ... SUCCESS [34.533s]
[INFO] Apache CloudStack Plugin - Storage Allocator Random  SUCCESS [4.114s]
[INFO] Apache CloudStack Plugin - User Authenticator LDAP  SUCCESS [24.646s]
[INFO] Apache CloudStack Plugin - User Authenticator MD5 . SUCCESS [24.729s]
[INFO] Apache CloudStack Plugin - User Authenticator PBKDF2-SHA-256  SUCCESS [29.899s]
[INFO] Apache CloudStack Plugin - User Authenticator Plain Text  SUCCESS [14.870s]
[INFO] Apache CloudStack Plugin - User Authenticator SAML2  SKIPPED
[INFO] Apache CloudStack Plugin - User Authenticator SHA256 Salted  SUCCESS [29.753s]
[INFO] Apache CloudStack Plugin - Dns Notifier Example ... SUCCESS [15.790s]
[INFO] Apache CloudStack Plugin - Storage Image S3 ....... SKIPPED
[INFO] Apache CloudStack Plugin - Storage Image Swift provider  SKIPPED
[INFO] Apache CloudStack Plugin - Storage Image default provider  SKIPPED
[INFO] Apache CloudStack Plugin - Storage Image sample provider  SKIPPED
[INFO] Apache CloudStack Plugin - Storage Volume Nexenta Provider  SUCCESS [6.851s]
[INFO] Apache CloudStack Plugin - Storage Volume CloudByte Provider  SKIPPED
[INFO] Apache CloudStack Plugin - Storage Volume sample provider  SUCCESS [3.473s]
[INFO] Apache CloudStack Plugin - SNMP Alerts ............ SUCCESS [24.267s]
[INFO] Apache CloudStack Plugin - Syslog Alerts .......... SUCCESS [25.271s]
[INFO] Apache CloudStack Plugin - Network VXLAN .......... SUCCESS [25.213s]
[INFO] Apache CloudStack Plugin - GloboDNS ............... SUCCESS [30.584s]
[INFO] Apache CloudStack Plugin - NetApp File System ..... SUCCESS [18.969s]
[INFO] Apache CloudStack Plugin - F5 ..................... SUCCESS [19.835s]
[INFO] Apache CloudStack Plugin - Juniper SRX ............ SUCCESS [21.335s]
[INFO] Apache CloudStack Plugin - Nuage VSP .............. SUCCESS [26.215s]
[INFO] Apache CloudStack VMware Base ..................... SUCCESS [9.404s]
[INFO] Apache CloudStack Plugin - Hypervisor VMware ...... FAILURE [10.749s]
[INFO] Apache CloudStack Plugin - Cisco VNMC ............. SKIPPED
[INFO] Apache CloudStack Plugin - MySQL HA Strategy ...... SUCCESS [15.309s]
[INFO] Apache CloudStack Framework - Spring Module ....... SUCCESS [6.161s]
[INFO] Apache CloudStack Secondary Storage Controller .... SUCCESS [5.266s]
[INFO] Apache CloudStack Console Proxy - RDP Client ...... SUCCESS [9.056s]
[INFO] Apache CloudStack Console Proxy ................... SUCCESS [4.141s]
[INFO] Apache CloudStack Console Proxy - Server .......... SUCCESS [6.222s]
[INFO] Apache CloudStack System VM ....................... SKIPPED
[INFO] Apache CloudStack Client UI ....................... SKIPPED
[INFO] Apache CloudStack Framework - QuickCloud .......... SUCCESS [1.091s]
[INFO] ------------------------------------------------------------------------
[INFO] BUILD FAILURE
[INFO] ------------------------------------------------------------------------
[INFO] Total time: 3:13.798s (Wall Clock)
[INFO] Finished at: Sat Aug 29 20:11:20 UTC 2015
log4j:WARN No appenders could be found for logger (com.cloud.network.element.MidoNetElement).
log4j:WARN Please initialize the log4j system properly.
log4j:WARN See http://logging.apache.org/log4j/1.2/faq.html#noconfig for more info.
[INFO] Final Memory: 89M/991M
[INFO] ------------------------------------------------------------------------
[WARNING] The requested profile "awsapi" could not be activated because it does not exist.
Tests run: 2, Failures: 0, Errors: 0, Skipped: 0, Time elapsed: 0.964 sec - in com.cloud.network.element.MidoNetElementTest

Results :

Tests run: 2, Failures: 0, Errors: 0, Skipped: 0

[INFO] 
[INFO] --- maven-jar-plugin:2.5:jar (default-jar) @ cloud-plugin-network-midonet ---
[ERROR] Failed to execute goal org.apache.maven.plugins:maven-compiler-plugin:3.2:compile
(default-compile) on project cloud-plugin-hypervisor-vmware: Compilation failure
[ERROR] <http://jenkins.buildacloud.org/job/build-master-noredist/ws/plugins/hypervisors/vmware/src/com/cloud/hypervisor/guru/VMwareGuru.java>:[484,12]
error: non-static variable logger cannot be referenced from a static context
[ERROR] -> [Help 1]
[ERROR] 
[ERROR] To see the full stack trace of the errors, re-run Maven with the -e switch.
[ERROR] Re-run Maven using the -X switch to enable full debug logging.
[ERROR] 
[ERROR] For more information about the errors and possible solutions, please read the following
articles:
[ERROR] [Help 1] http://cwiki.apache.org/confluence/display/MAVEN/MojoFailureException
[ERROR] 
[ERROR] After correcting the problems, you can resume the build with the command
[ERROR]   mvn <goals> -rf :cloud-plugin-hypervisor-vmware
Tests run: 80, Failures: 0, Errors: 0, Skipped: 0, Time elapsed: 1.787 sec - in com.cloud.hypervisor.xenserver.resource.wrapper.xenbase.CitrixRequestWrapperTest
Running com.cloud.hypervisor.xenserver.resource.wrapper.xenbase.XcpServerWrapperTest
Tests run: 3, Failures: 0, Errors: 0, Skipped: 0, Time elapsed: 0 sec - in com.cloud.hypervisor.xenserver.resource.wrapper.xenbase.XcpServerWrapperTest
Running com.cloud.hypervisor.xenserver.resource.wrapper.xenbase.XenServer620SP1WrapperTest
Tests run: 2, Failures: 0, Errors: 0, Skipped: 0, Time elapsed: 0 sec - in com.cloud.hypervisor.xenserver.resource.wrapper.xenbase.XenServer620SP1WrapperTest
Running com.cloud.hypervisor.xenserver.resource.wrapper.xenbase.XenServer610WrapperTest
Build step 'Invoke top-level Maven targets' marked build as failure
Archiving artifacts

Mime
View raw message