cloudstack-dev mailing list archives

Site index · List index
Message view « Date » · « Thread »
Top « Date » · « Thread »
From Rafael Fonseca <rsafons...@gmail.com>
Subject Re: Build failed in Jenkins: simulator-singlerun #1271
Date Fri, 19 Jun 2015 13:02:47 GMT
>
> Do you have enough access to bump up the git version? Check this out, it's
> the closest i've found to this issue from a quick search :
> https://issues.jenkins-ci.org/browse/JENKINS-22682
>



On Fri, Jun 19, 2015 at 2:08 PM, Daan Hoogland <daan.hoogland@gmail.com>
> wrote:
>
>> just a guess, sorry
>>
>> On Fri, Jun 19, 2015 at 2:02 PM, Rafael Fonseca <rsafonseca@gmail.com>
>> wrote:
>> > But how did you go from that to .git permissions issue? :)
>> > Trying to understand it better to see if there's anyway i can help out
>> in
>> > fixing it
>> >
>> > On Fri, Jun 19, 2015 at 1:56 PM, Daan Hoogland <daan.hoogland@gmail.com
>> >
>> > wrote:
>> >>
>> >> I tried to reach the http://... no problem, then I cleaned the
>> >> workspace, -> problem
>> >>
>> >> On Fri, Jun 19, 2015 at 1:48 PM, Rafael Fonseca <rsafonseca@gmail.com>
>> >> wrote:
>> >> > How did you figure that? From the output it really just seems that
>> HTTP
>> >> > request is failing, probably some authentication failure with the ssh
>> >> > keys
>> >> > or something like that, further debugging would be needed, i suppose
>> you
>> >> > can
>> >> > see a lot more than me ;).
>> >> > Why do you think it's related to .git/ rights?
>> >> >
>> >> > On Fri, Jun 19, 2015 at 1:08 PM, Daan Hoogland <
>> daan.hoogland@gmail.com>
>> >> > wrote:
>> >> >>
>> >> >> Prasanna, If you are still on this list, can you help me getting
the
>> >> >> jenkins-slave-node 'simulator' back on track? It seems there is
an
>> >> >> issue with the rights on files in the .git directory of the working
>> >> >> dirs of some of the jobs. thanks
>> >> >>
>> >> >> On Fri, Jun 19, 2015 at 12:50 PM,  <jenkins@cloudstack.org>
wrote:
>> >> >> > See <http://jenkins.buildacloud.org/job/simulator-singlerun/1271/
>> >
>> >> >> >
>> >> >> > ------------------------------------------
>> >> >> > Started by upstream project "build-master-simulator" build
number
>> >> >> > 2089
>> >> >> > originally caused by:
>> >> >> >  Started by an SCM change
>> >> >> >  Started by an SCM change
>> >> >> >  Started by an SCM change
>> >> >> >  Started by an SCM change
>> >> >> > [EnvInject] - Loading node environment variables.
>> >> >> > Building remotely on simulator in workspace
>> >> >> > <http://jenkins.buildacloud.org/job/simulator-singlerun/ws/>
>> >> >> >  > /usr/bin/git rev-parse --is-inside-work-tree # timeout=400
>> >> >> > Fetching changes from the remote Git repository
>> >> >> >  > /usr/bin/git config remote.origin.url
>> >> >> > https://git-wip-us.apache.org/repos/asf/cloudstack.git #
>> timeout=400
>> >> >> > Fetching upstream changes from
>> >> >> > https://git-wip-us.apache.org/repos/asf/cloudstack.git
>> >> >> >  > /usr/bin/git --version # timeout=400
>> >> >> >  > /usr/bin/git fetch --tags --progress
>> >> >> > https://git-wip-us.apache.org/repos/asf/cloudstack.git
>> >> >> > +refs/heads/*:refs/remotes/origin/*
>> >> >> > ERROR: Error fetching remote repo 'origin'
>> >> >> > hudson.plugins.git.GitException: Failed to fetch from
>> >> >> > https://git-wip-us.apache.org/repos/asf/cloudstack.git
>> >> >> >         at hudson.plugins.git.GitSCM.fetchFrom(GitSCM.java:735)
>> >> >> >         at
>> hudson.plugins.git.GitSCM.retrieveChanges(GitSCM.java:983)
>> >> >> >         at hudson.plugins.git.GitSCM.checkout(GitSCM.java:1016)
>> >> >> >         at hudson.scm.SCM.checkout(SCM.java:484)
>> >> >> >         at
>> >> >> > hudson.model.AbstractProject.checkout(AbstractProject.java:1258)
>> >> >> >         at
>> >> >> >
>> >> >> >
>> hudson.model.AbstractBuild$AbstractBuildExecution.defaultCheckout(AbstractBuild.java:622)
>> >> >> >         at
>> >> >> >
>> jenkins.scm.SCMCheckoutStrategy.checkout(SCMCheckoutStrategy.java:86)
>> >> >> >         at
>> >> >> >
>> >> >> >
>> hudson.model.AbstractBuild$AbstractBuildExecution.run(AbstractBuild.java:528)
>> >> >> >         at hudson.model.Run.execute(Run.java:1759)
>> >> >> >         at hudson.model.FreeStyleBuild.run(FreeStyleBuild.java:43)
>> >> >> >         at
>> >> >> >
>> hudson.model.ResourceController.execute(ResourceController.java:89)
>> >> >> >         at hudson.model.Executor.run(Executor.java:240)
>> >> >> > Caused by: hudson.plugins.git.GitException: Command "/usr/bin/git
>> >> >> > fetch
>> >> >> > --tags --progress
>> >> >> > https://git-wip-us.apache.org/repos/asf/cloudstack.git
>> >> >> > +refs/heads/*:refs/remotes/origin/*" returned status code
128:
>> >> >> > stdout:
>> >> >> > stderr: error:  while accessing
>> >> >> > https://git-wip-us.apache.org/repos/asf/cloudstack.git/info/refs
>> >> >> >
>> >> >> > fatal: HTTP request failed
>> >> >> >
>> >> >> >         at
>> >> >> >
>> >> >> >
>> org.jenkinsci.plugins.gitclient.CliGitAPIImpl.launchCommandIn(CliGitAPIImpl.java:1591)
>> >> >> >         at
>> >> >> >
>> >> >> >
>> org.jenkinsci.plugins.gitclient.CliGitAPIImpl.launchCommandWithCredentials(CliGitAPIImpl.java:1379)
>> >> >> >         at
>> >> >> >
>> >> >> >
>> org.jenkinsci.plugins.gitclient.CliGitAPIImpl.access$300(CliGitAPIImpl.java:86)
>> >> >> >         at
>> >> >> >
>> >> >> >
>> org.jenkinsci.plugins.gitclient.CliGitAPIImpl$1.execute(CliGitAPIImpl.java:324)
>> >> >> >         at
>> >> >> >
>> >> >> >
>> org.jenkinsci.plugins.gitclient.RemoteGitImpl$CommandInvocationHandler$1.call(RemoteGitImpl.java:152)
>> >> >> >         at
>> >> >> >
>> >> >> >
>> org.jenkinsci.plugins.gitclient.RemoteGitImpl$CommandInvocationHandler$1.call(RemoteGitImpl.java:145)
>> >> >> >         at
>> hudson.remoting.UserRequest.perform(UserRequest.java:121)
>> >> >> >         at
>> hudson.remoting.UserRequest.perform(UserRequest.java:49)
>> >> >> >         at hudson.remoting.Request$2.run(Request.java:324)
>> >> >> >         at
>> >> >> >
>> >> >> >
>> hudson.remoting.InterceptingExecutorService$1.call(InterceptingExecutorService.java:68)
>> >> >> >         at
>> java.util.concurrent.FutureTask.run(FutureTask.java:262)
>> >> >> >         at
>> >> >> >
>> >> >> >
>> java.util.concurrent.ThreadPoolExecutor.runWorker(ThreadPoolExecutor.java:1145)
>> >> >> >         at
>> >> >> >
>> >> >> >
>> java.util.concurrent.ThreadPoolExecutor$Worker.run(ThreadPoolExecutor.java:615)
>> >> >> >         at java.lang.Thread.run(Thread.java:744)
>> >> >> >         at ......remote call to simulator(Native Method)
>> >> >> >         at
>> >> >> >
>> hudson.remoting.Channel.attachCallSiteStackTrace(Channel.java:1356)
>> >> >> >         at
>> >> >> > hudson.remoting.UserResponse.retrieve(UserRequest.java:221)
>> >> >> >         at hudson.remoting.Channel.call(Channel.java:752)
>> >> >> >         at
>> >> >> >
>> >> >> >
>> org.jenkinsci.plugins.gitclient.RemoteGitImpl$CommandInvocationHandler.execute(RemoteGitImpl.java:145)
>> >> >> >         at sun.reflect.GeneratedMethodAccessor375.invoke(Unknown
>> >> >> > Source)
>> >> >> >         at
>> >> >> >
>> >> >> >
>> sun.reflect.DelegatingMethodAccessorImpl.invoke(DelegatingMethodAccessorImpl.java:43)
>> >> >> >         at java.lang.reflect.Method.invoke(Method.java:601)
>> >> >> >         at
>> >> >> >
>> >> >> >
>> org.jenkinsci.plugins.gitclient.RemoteGitImpl$CommandInvocationHandler.invoke(RemoteGitImpl.java:131)
>> >> >> >         at sun.proxy.$Proxy46.execute(Unknown Source)
>> >> >> >         at hudson.plugins.git.GitSCM.fetchFrom(GitSCM.java:733)
>> >> >> >         ... 11 more
>> >> >> > ERROR: Error fetching remote repo 'origin'
>> >> >> > [xUnit] [INFO] - Starting to record.
>> >> >> > [xUnit] [INFO] - Processing JUnit
>> >> >> > [xUnit] [INFO] - [JUnit] - 1 test report file(s) were found
with
>> the
>> >> >> > pattern 'xunit.xml' relative to
>> >> >> > '<http://jenkins.buildacloud.org/job/simulator-singlerun/ws/'>
>> for
>> >> >> > the
>> >> >> > testing framework 'JUnit'.
>> >> >> > [xUnit] [ERROR] - Test reports were found but not all of them
are
>> >> >> > new.
>> >> >> > Did all the tests run?
>> >> >> >   *
>> >> >> > <
>> http://jenkins.buildacloud.org/job/simulator-singlerun/ws/xunit.xml>
>> >> >> > is 1
>> >> >> > mo 18 days old
>> >> >> >
>> >> >> > [xUnit] [INFO] - Failing BUILD.
>> >> >> > [xUnit] [INFO] - There are errors when processing test results.
>> >> >> > [xUnit] [INFO] - Skipping tests recording.
>> >> >> > [xUnit] [INFO] - Stop build.
>> >> >>
>> >> >>
>> >> >>
>> >> >> --
>> >> >> Daan
>> >> >
>> >> >
>> >>
>> >>
>> >>
>> >> --
>> >> Daan
>> >
>> >
>>
>>
>>
>> --
>> Daan
>
>

Mime
  • Unnamed multipart/alternative (inline, None, 0 bytes)
View raw message