cloudstack-dev mailing list archives

Site index · List index
Message view « Date » · « Thread »
Top « Date » · « Thread »
From jenk...@cloudstack.org
Subject Build failed in Jenkins: build-master-noredist #4274
Date Tue, 16 Jun 2015 07:08:35 GMT
See <http://jenkins.buildacloud.org/job/build-master-noredist/4274/changes>

Changes:

[Daan Hoogland] Fix findbugs encoding issue in VmwareResource.java Key file should be UTF-8
encoded in VR

[Daan Hoogland] Fix findbugs warning in VmwareStorageManagerImpl.java Any encoding would do
fine as it's just used to generate a UUID. Sticking with UTF-8 for consistency

[Daan Hoogland] Fix findbugs encoding issue in VmwareStorageProcessor.java Any encoding would
do fine as it's just used to generate a UUID. Sticking with UTF-8 for consistency

------------------------------------------
[...truncated 10316 lines...]
[INFO] 
[INFO] --- maven-resources-plugin:2.5:testResources (default-testResources) @ cloud-engine-storage-datamotion
---
[debug] execute contextualize
[INFO] Using 'UTF-8' encoding to copy filtered resources.
[INFO] skip non existing resourceDirectory <http://jenkins.buildacloud.org/job/build-master-noredist/ws/engine/storage/datamotion/test/resources>
[INFO] Copying 3 resources
[INFO] 
[INFO] --- maven-compiler-plugin:3.2:testCompile (default-testCompile) @ cloud-engine-storage-datamotion
---
[INFO] No sources to compile
[INFO] 
[INFO] --- maven-surefire-plugin:2.18.1:test (default-test) @ cloud-engine-storage-datamotion
---
[INFO] 
[INFO] --- maven-jar-plugin:2.5:jar (default-jar) @ cloud-engine-storage-datamotion ---
[INFO] Building jar: <http://jenkins.buildacloud.org/job/build-master-noredist/ws/engine/storage/datamotion/target/cloud-engine-storage-datamotion-4.6.0-SNAPSHOT.jar>
[INFO] 
[INFO] --- maven-resources-plugin:2.5:testResources (default-testResources) @ cloud-plugin-storage-volume-nexenta
---
[debug] execute contextualize
[INFO] Using 'UTF-8' encoding to copy filtered resources.
[INFO] skip non existing resourceDirectory <http://jenkins.buildacloud.org/job/build-master-noredist/ws/plugins/storage/volume/nexenta/test/resources>
[INFO] Copying 3 resources
[INFO] 
[INFO] --- maven-compiler-plugin:3.2:testCompile (default-testCompile) @ cloud-plugin-storage-volume-nexenta
---
[INFO] 
[INFO] --- maven-site-plugin:3.1:attach-descriptor (attach-descriptor) @ cloud-engine-storage-datamotion
---
[INFO] 
[INFO] --- maven-install-plugin:2.3.1:install (default-install) @ cloud-engine-storage-datamotion
---
[INFO] Installing <http://jenkins.buildacloud.org/job/build-master-noredist/ws/engine/storage/datamotion/target/cloud-engine-storage-datamotion-4.6.0-SNAPSHOT.jar>
to /home/jenkins/.m2/repository/org/apache/cloudstack/cloud-engine-storage-datamotion/4.6.0-SNAPSHOT/cloud-engine-storage-datamotion-4.6.0-SNAPSHOT.jar
[INFO] Changes detected - recompiling the module!
[INFO] Compiling 2 source files to <http://jenkins.buildacloud.org/job/build-master-noredist/ws/plugins/storage/volume/nexenta/target/test-classes>
[INFO] Installing <http://jenkins.buildacloud.org/job/build-master-noredist/ws/engine/storage/datamotion/pom.xml>
to /home/jenkins/.m2/repository/org/apache/cloudstack/cloud-engine-storage-datamotion/4.6.0-SNAPSHOT/cloud-engine-storage-datamotion-4.6.0-SNAPSHOT.pom
log4j:WARN No appenders could be found for logger (org.springframework.test.context.junit4.SpringJUnit4ClassRunner).
log4j:WARN Please initialize the log4j system properly.
log4j:WARN See http://logging.apache.org/log4j/1.2/faq.html#noconfig for more info.
Running src.VMSnapshotStrategyTest
[INFO] 
[INFO] --- maven-resources-plugin:2.5:testResources (default-testResources) @ cloud-plugin-network-midonet
---
[debug] execute contextualize
[INFO] Using 'UTF-8' encoding to copy filtered resources.
[INFO] skip non existing resourceDirectory <http://jenkins.buildacloud.org/job/build-master-noredist/ws/plugins/network-elements/midonet/test/resources>
[INFO] Copying 3 resources
[INFO] 
[INFO] --- maven-compiler-plugin:3.2:testCompile (default-testCompile) @ cloud-plugin-network-midonet
---
[INFO] Changes detected - recompiling the module!
[INFO] Compiling 1 source file to <http://jenkins.buildacloud.org/job/build-master-noredist/ws/plugins/network-elements/midonet/target/test-classes>
[INFO] 
[INFO] --- maven-surefire-plugin:2.18.1:test (default-test) @ cloud-plugin-storage-volume-nexenta
---
[INFO] Tests are skipped.
[INFO] 
[INFO] --- maven-jar-plugin:2.5:jar (default-jar) @ cloud-plugin-storage-volume-nexenta ---
[INFO] Building jar: <http://jenkins.buildacloud.org/job/build-master-noredist/ws/plugins/storage/volume/nexenta/target/cloud-plugin-storage-volume-nexenta-4.6.0-SNAPSHOT.jar>
[INFO] 
[INFO] --- maven-site-plugin:3.1:attach-descriptor (attach-descriptor) @ cloud-plugin-storage-volume-nexenta
---
[INFO] 
[INFO] --- maven-surefire-plugin:2.18.1:test (default) @ cloud-plugin-storage-volume-nexenta
---
[INFO] Tests are skipped.
[INFO] 
[INFO] --- maven-install-plugin:2.3.1:install (default-install) @ cloud-plugin-storage-volume-nexenta
---
[INFO] Installing <http://jenkins.buildacloud.org/job/build-master-noredist/ws/plugins/storage/volume/nexenta/target/cloud-plugin-storage-volume-nexenta-4.6.0-SNAPSHOT.jar>
to /home/jenkins/.m2/repository/org/apache/cloudstack/cloud-plugin-storage-volume-nexenta/4.6.0-SNAPSHOT/cloud-plugin-storage-volume-nexenta-4.6.0-SNAPSHOT.jar
[INFO] Installing <http://jenkins.buildacloud.org/job/build-master-noredist/ws/plugins/storage/volume/nexenta/pom.xml>
to /home/jenkins/.m2/repository/org/apache/cloudstack/cloud-plugin-storage-volume-nexenta/4.6.0-SNAPSHOT/cloud-plugin-storage-volume-nexenta-4.6.0-SNAPSHOT.pom
[INFO] 
[INFO] --- maven-surefire-plugin:2.18.1:test (default-test) @ cloud-plugin-network-midonet
---
[INFO] Surefire report directory: <http://jenkins.buildacloud.org/job/build-master-noredist/ws/plugins/network-elements/midonet/target/surefire-reports>

-------------------------------------------------------
 T E S T S
-------------------------------------------------------
[INFO] 
[INFO] --- maven-surefire-plugin:2.18.1:test (default-test) @ cloud-plugin-hypervisor-xenserver
---
[INFO] Surefire report directory: <http://jenkins.buildacloud.org/job/build-master-noredist/ws/plugins/hypervisors/xenserver/target/surefire-reports>

-------------------------------------------------------
 T E S T S
-------------------------------------------------------
Tests run: 3, Failures: 0, Errors: 0, Skipped: 0, Time elapsed: 1.789 sec - in src.VMSnapshotStrategyTest
Running src.SnapshotDataFactoryTest
Tests run: 1, Failures: 0, Errors: 0, Skipped: 0, Time elapsed: 0.003 sec - in src.SnapshotDataFactoryTest

Results :

Tests run: 4, Failures: 0, Errors: 0, Skipped: 0

[INFO] 
[INFO] --- maven-jar-plugin:2.5:jar (default-jar) @ cloud-engine-storage-snapshot ---
[INFO] Building jar: <http://jenkins.buildacloud.org/job/build-master-noredist/ws/engine/storage/snapshot/target/cloud-engine-storage-snapshot-4.6.0-SNAPSHOT.jar>
[INFO] 
[INFO] --- maven-site-plugin:3.1:attach-descriptor (attach-descriptor) @ cloud-engine-storage-snapshot
---
[INFO] 
[INFO] --- maven-surefire-plugin:2.18.1:test (default) @ cloud-engine-storage-snapshot ---
[INFO] Skipping execution of surefire because it has already been run for this configuration
[INFO] 
[INFO] --- maven-install-plugin:2.3.1:install (default-install) @ cloud-engine-storage-snapshot
---
[INFO] Installing <http://jenkins.buildacloud.org/job/build-master-noredist/ws/engine/storage/snapshot/target/cloud-engine-storage-snapshot-4.6.0-SNAPSHOT.jar>
to /home/jenkins/.m2/repository/org/apache/cloudstack/cloud-engine-storage-snapshot/4.6.0-SNAPSHOT/cloud-engine-storage-snapshot-4.6.0-SNAPSHOT.jar
[INFO] Installing <http://jenkins.buildacloud.org/job/build-master-noredist/ws/engine/storage/snapshot/pom.xml>
to /home/jenkins/.m2/repository/org/apache/cloudstack/cloud-engine-storage-snapshot/4.6.0-SNAPSHOT/cloud-engine-storage-snapshot-4.6.0-SNAPSHOT.pom
Running com.cloud.network.element.MidoNetElementTest
Running com.cloud.hypervisor.xenserver.resource.wrapper.xenbase.CitrixRequestWrapperTest
log4j:WARN No appenders could be found for logger (com.cloud.network.element.MidoNetElement).
log4j:WARN Please initialize the log4j system properly.
log4j:WARN See http://logging.apache.org/log4j/1.2/faq.html#noconfig for more info.
Tests run: 2, Failures: 0, Errors: 0, Skipped: 0, Time elapsed: 0.537 sec - in com.cloud.network.element.MidoNetElementTest

Results :

Tests run: 2, Failures: 0, Errors: 0, Skipped: 0

[INFO] 
[INFO] --- maven-jar-plugin:2.5:jar (default-jar) @ cloud-plugin-network-midonet ---
[INFO] Building jar: <http://jenkins.buildacloud.org/job/build-master-noredist/ws/plugins/network-elements/midonet/target/cloud-plugin-network-midonet-4.6.0-SNAPSHOT.jar>
[INFO] 
[INFO] --- maven-site-plugin:3.1:attach-descriptor (attach-descriptor) @ cloud-plugin-network-midonet
---
[INFO] 
[INFO] --- maven-install-plugin:2.3.1:install (default-install) @ cloud-plugin-network-midonet
---
[INFO] Installing <http://jenkins.buildacloud.org/job/build-master-noredist/ws/plugins/network-elements/midonet/target/cloud-plugin-network-midonet-4.6.0-SNAPSHOT.jar>
to /home/jenkins/.m2/repository/org/apache/cloudstack/cloud-plugin-network-midonet/4.6.0-SNAPSHOT/cloud-plugin-network-midonet-4.6.0-SNAPSHOT.jar
[INFO] Installing <http://jenkins.buildacloud.org/job/build-master-noredist/ws/plugins/network-elements/midonet/pom.xml>
to /home/jenkins/.m2/repository/org/apache/cloudstack/cloud-plugin-network-midonet/4.6.0-SNAPSHOT/cloud-plugin-network-midonet-4.6.0-SNAPSHOT.pom
log4j:WARN No appenders could be found for logger (com.cloud.hypervisor.xenserver.resource.XenServerConnectionPool).
log4j:WARN Please initialize the log4j system properly.
log4j:WARN See http://logging.apache.org/log4j/1.2/faq.html#noconfig for more info.
[INFO] ------------------------------------------------------------------------
[INFO] Reactor Summary:
[INFO] 
[INFO] Apache CloudStack Developer Tools - Checkstyle Configuration  SUCCESS [1.365s]
[INFO] Apache CloudStack ................................. SUCCESS [1.739s]
[INFO] Apache CloudStack Maven Conventions Parent ........ SUCCESS [1.012s]
[INFO] Apache CloudStack Framework - Managed Context ..... SUCCESS [3.171s]
[INFO] Apache CloudStack Utils ........................... SUCCESS [13.273s]
[INFO] Apache CloudStack Framework ....................... SUCCESS [0.346s]
[INFO] Apache CloudStack Framework - Event Notification .. SUCCESS [8.100s]
[INFO] Apache CloudStack Framework - Configuration ....... SUCCESS [4.167s]
[INFO] Apache CloudStack API ............................. SUCCESS [14.318s]
[INFO] Apache CloudStack Framework - REST ................ SUCCESS [3.802s]
[INFO] Apache CloudStack Framework - IPC ................. SUCCESS [4.695s]
[INFO] Apache CloudStack Cloud Engine .................... SUCCESS [0.340s]
[INFO] Apache CloudStack Cloud Engine API ................ SUCCESS [4.570s]
[INFO] Apache CloudStack Framework - Security ............ SUCCESS [2.184s]
[INFO] Apache CloudStack Core ............................ SUCCESS [22.630s]
[INFO] Apache CloudStack Agents .......................... SUCCESS [6.424s]
[INFO] Apache CloudStack Framework - Clustering .......... SUCCESS [3.224s]
[INFO] Apache CloudStack Framework - Event Notification .. SUCCESS [2.120s]
[INFO] Apache CloudStack Cloud Engine Schema Component ... SUCCESS [14.717s]
[INFO] Apache CloudStack Framework - Jobs ................ SUCCESS [5.722s]
[INFO] Apache CloudStack Cloud Engine Internal Components API  SUCCESS [2.915s]
[INFO] Apache CloudStack Server .......................... SUCCESS [40.201s]
[INFO] Apache CloudStack Usage Server .................... SUCCESS [6.974s]
[INFO] Apache CloudStack Cloud Engine Orchestration Component  SUCCESS [10.309s]
[INFO] Apache CloudStack Cloud Services .................. SUCCESS [0.337s]
[INFO] Apache CloudStack Secondary Storage ............... SUCCESS [2.240s]
[INFO] Apache CloudStack Secondary Storage Service ....... SUCCESS [10.680s]
[INFO] Apache CloudStack Engine Storage Component ........ SUCCESS [21.106s]
[INFO] Apache CloudStack Engine Storage Volume Component . SUCCESS [6.531s]
[INFO] Apache CloudStack Engine Storage Image Component .. SUCCESS [4.277s]
[INFO] Apache CloudStack Engine Storage Data Motion Component  SUCCESS [3.703s]
[INFO] Apache CloudStack Engine Storage Cache Component .. SUCCESS [3.702s]
[INFO] Apache CloudStack Engine Storage Snapshot Component  SUCCESS [12.301s]
[INFO] Apache CloudStack Cloud Engine API ................ SUCCESS [1.960s]
[INFO] Apache CloudStack Cloud Engine Service ............ SUCCESS [9.198s]
[INFO] Apache CloudStack Plugin POM ...................... SUCCESS [0.436s]
[INFO] Apache CloudStack Plugin - API Rate Limit ......... SUCCESS [35.363s]
[INFO] Apache CloudStack Plugin - Storage Volume default provider  SUCCESS [3.489s]
[INFO] Apache CloudStack Plugin - Storage Volume SolidFire Provider  SKIPPED
[INFO] Apache CloudStack Plugin - API SolidFire .......... SKIPPED
[INFO] Apache CloudStack Plugin - API Discovery .......... SUCCESS [18.036s]
[INFO] Apache CloudStack Plugin - ACL Static Role Based .. SUCCESS [6.873s]
[INFO] Apache CloudStack Plugin - Host Anti-Affinity Processor  SUCCESS [6.807s]
[INFO] Apache CloudStack Plugin - Explicit Dedication Processor  SUCCESS [11.589s]
[INFO] Apache CloudStack Plugin - User Concentrated Pod Deployment Planner  SUCCESS [14.041s]
[INFO] Apache CloudStack Plugin - User Dispersing Deployment Planner  SUCCESS [6.782s]
[INFO] Apache CloudStack Plugin - Implicit Dedication Planner  SUCCESS [34.751s]
[INFO] Apache CloudStack Plugin - Skip Heurestics Planner  SUCCESS [5.996s]
[INFO] Apache CloudStack Plugin - Host Allocator Random .. SUCCESS [14.272s]
[INFO] Apache CloudStack Plugin - Dedicated Resources .... SUCCESS [34.318s]
[INFO] Apache CloudStack Plugin - Hypervisor OracleVM .... SUCCESS [12.980s]
[INFO] Apache CloudStack Plugin - Open vSwitch ........... SUCCESS [25.383s]
[INFO] Apache CloudStack Plugin - Hypervisor XenServer ... SKIPPED
[INFO] Apache CloudStack Plugin - Hypervisor KVM ......... SUCCESS [27.297s]
[INFO] Apache CloudStack Plugin - RabbitMQ Event Bus ..... SUCCESS [11.739s]
[INFO] Apache CloudStack Plugin - In Memory Event Bus .... SUCCESS [27.066s]
[INFO] Apache CloudStack Plugin - Kafka Event Bus ........ SUCCESS [13.452s]
[INFO] Apache CloudStack Plugin - Hypervisor Baremetal ... SUCCESS [27.077s]
[INFO] Apache CloudStack Plugin - Hypervisor UCS ......... SUCCESS [26.060s]
[INFO] Apache CloudStack Plugin - Hypervisor Hyper-V ..... SUCCESS [33.255s]
[INFO] Apache CloudStack Plugin - Hypervisor OracleVM3 ... SUCCESS [54.193s]
[INFO] Apache CloudStack Plugin - Network Elastic Load Balancer  SUCCESS [34.854s]
[INFO] Apache CloudStack Plugin - Network Internal Load Balancer  SUCCESS [30.542s]
[INFO] Apache CloudStack Framework - Spring Life Cycle ... SUCCESS [2.243s]
[INFO] Apache CloudStack Plugin - Network Juniper Contrail  SKIPPED
[INFO] Apache CloudStack Plugin - Palo Alto .............. SUCCESS [30.762s]
[INFO] Apache CloudStack Plugin - Network Netscaler ...... SUCCESS [26.076s]
[INFO] Apache CloudStack Plugin - Network Nicira NVP ..... SUCCESS [47.535s]
[INFO] Apache CloudStack Plugin - BigSwitch Virtual Network Segment  SUCCESS [47.309s]
[INFO] Apache CloudStack Plugin - Network Brocade VCS .... SUCCESS [40.442s]
[INFO] Apache CloudStack Plugin - Midokura Midonet ....... SUCCESS [6.904s]
[INFO] Apache CloudStack Plugin - Stratosphere SSP ....... SUCCESS [36.009s]
[INFO] Apache CloudStack Plugin - Network Opendaylight ... SUCCESS [36.605s]
[INFO] Apache CloudStack Plugin - Storage Allocator Random  SUCCESS [3.084s]
[INFO] Apache CloudStack Plugin - User Authenticator LDAP  SUCCESS [25.594s]
[INFO] Apache CloudStack Plugin - User Authenticator MD5 . SUCCESS [27.735s]
[INFO] Apache CloudStack Plugin - User Authenticator PBKDF2-SHA-256  SUCCESS [31.448s]
[INFO] Apache CloudStack Plugin - User Authenticator Plain Text  SUCCESS [18.683s]
[INFO] Apache CloudStack Plugin - User Authenticator SAML2  SKIPPED
[INFO] Apache CloudStack Plugin - User Authenticator SHA256 Salted  SUCCESS [26.020s]
[INFO] Apache CloudStack Plugin - Dns Notifier Example ... SUCCESS [15.356s]
[INFO] Apache CloudStack Plugin - Storage Image S3 ....... SKIPPED
[INFO] Apache CloudStack Plugin - Storage Image Swift provider  SKIPPED
[INFO] Apache CloudStack Plugin - Storage Image default provider  SKIPPED
[INFO] Apache CloudStack Plugin - Storage Image sample provider  SKIPPED
[INFO] Apache CloudStack Plugin - Storage Volume Nexenta Provider  SUCCESS [5.405s]
[INFO] Apache CloudStack Plugin - Storage Volume CloudByte Provider  SKIPPED
[INFO] Apache CloudStack Plugin - Storage Volume sample provider  SUCCESS [3.178s]
[INFO] Apache CloudStack Plugin - SNMP Alerts ............ SUCCESS [22.708s]
[INFO] Apache CloudStack Plugin - Syslog Alerts .......... SUCCESS [22.039s]
[INFO] Apache CloudStack Plugin - Network VXLAN .......... SUCCESS [22.558s]
[INFO] Apache CloudStack Plugin - GloboDNS ............... SUCCESS [30.851s]
[INFO] Apache CloudStack Plugin - NetApp File System ..... SUCCESS [20.079s]
[INFO] Apache CloudStack Plugin - F5 ..................... SUCCESS [20.934s]
[INFO] Apache CloudStack Plugin - Juniper SRX ............ SUCCESS [20.492s]
[INFO] Apache CloudStack Plugin - Nuage VSP .............. SUCCESS [21.274s]
[INFO] Apache CloudStack VMware Base ..................... SUCCESS [7.712s]
[INFO] Apache CloudStack Plugin - Hypervisor VMware ...... FAILURE [8.234s]
[INFO] Apache CloudStack Plugin - Cisco VNMC ............. SKIPPED
[INFO] Apache CloudStack Plugin - MySQL HA Strategy ...... SUCCESS [11.158s]
[INFO] Apache CloudStack Framework - Spring Module ....... SUCCESS [6.854s]
[INFO] Apache CloudStack Secondary Storage Controller .... SUCCESS [4.499s]
[INFO] Apache CloudStack Console Proxy - RDP Client ...... SUCCESS [10.056s]
[INFO] Apache CloudStack Console Proxy ................... SUCCESS [2.190s]
[INFO] Apache CloudStack Console Proxy - Server .......... SUCCESS [4.854s]
[INFO] Apache CloudStack System VM ....................... SKIPPED
[INFO] Apache CloudStack Client UI ....................... SKIPPED
[INFO] Apache CloudStack Framework - QuickCloud .......... SUCCESS [0.870s]
[INFO] ------------------------------------------------------------------------
[INFO] BUILD FAILURE
[INFO] ------------------------------------------------------------------------
[INFO] Total time: 3:04.953s (Wall Clock)
[INFO] Finished at: Tue Jun 16 07:10:26 UTC 2015
[INFO] Final Memory: 103M/977M
[INFO] ------------------------------------------------------------------------
[WARNING] The requested profile "awsapi" could not be activated because it does not exist.
[ERROR] Failed to execute goal org.apache.maven.plugins:maven-compiler-plugin:3.2:compile
(default-compile) on project cloud-plugin-hypervisor-vmware: Compilation failure
[ERROR] <http://jenkins.buildacloud.org/job/build-master-noredist/ws/plugins/hypervisors/vmware/src/com/cloud/storage/resource/VmwareStorageProcessor.java>:[2268,138]
error: unreported exception UnsupportedEncodingException; must be caught or declared to be
thrown
[ERROR] -> [Help 1]
[ERROR] 
[ERROR] To see the full stack trace of the errors, re-run Maven with the -e switch.
[ERROR] Re-run Maven using the -X switch to enable full debug logging.
[ERROR] 
[ERROR] For more information about the errors and possible solutions, please read the following
articles:
[ERROR] [Help 1] http://cwiki.apache.org/confluence/display/MAVEN/MojoFailureException
[ERROR] 
[ERROR] After correcting the problems, you can resume the build with the command
[ERROR]   mvn <goals> -rf :cloud-plugin-hypervisor-vmware
Build step 'Invoke top-level Maven targets' marked build as failure
Archiving artifacts

Mime
View raw message