cloudstack-dev mailing list archives

Site index · List index
Message view « Date » · « Thread »
Top « Date » · « Thread »
From jenk...@cloudstack.org
Subject Build failed in Jenkins: build-master-jdk18 #39
Date Wed, 13 May 2015 12:19:00 GMT
See <http://jenkins.buildacloud.org/job/build-master-jdk18/39/changes>

Changes:

[Gaurav Aradhye] CLOUDSTACK-8468: Correct test case in test_bugs.py

------------------------------------------
[...truncated 2665 lines...]
[INFO] --- maven-remote-resources-plugin:1.3:process (default) @ cloud-plugin-hypervisor-xenserver
---
[INFO] 
[INFO] --- maven-resources-plugin:2.5:resources (default-resources) @ cloud-plugin-hypervisor-xenserver
---
[debug] execute contextualize
[INFO] Using 'UTF-8' encoding to copy filtered resources.
[INFO] Copying 4 resources
[INFO] Copying 3 resources
[INFO] 
[INFO] --- maven-compiler-plugin:3.2:compile (default-compile) @ cloud-plugin-hypervisor-xenserver
---
[INFO] Changes detected - recompiling the module!
[INFO] Compiling 95 source files to <http://jenkins.buildacloud.org/job/build-master-jdk18/ws/plugins/hypervisors/xenserver/target/classes>
[INFO] 
[INFO] --- maven-resources-plugin:2.5:testResources (default-testResources) @ cloud-plugin-hypervisor-xenserver
---
[debug] execute contextualize
[INFO] Using 'UTF-8' encoding to copy filtered resources.
[INFO] skip non existing resourceDirectory <http://jenkins.buildacloud.org/job/build-master-jdk18/ws/plugins/hypervisors/xenserver/test/resources>
[INFO] Copying 3 resources
[INFO] 
[INFO] --- maven-compiler-plugin:3.2:testCompile (default-testCompile) @ cloud-plugin-hypervisor-xenserver
---
[INFO] Changes detected - recompiling the module!
[INFO] Compiling 7 source files to <http://jenkins.buildacloud.org/job/build-master-jdk18/ws/plugins/hypervisors/xenserver/target/test-classes>
[INFO] 
[INFO] --- maven-surefire-plugin:2.18.1:test (default-test) @ cloud-plugin-hypervisor-xenserver
---
[INFO] Surefire report directory: <http://jenkins.buildacloud.org/job/build-master-jdk18/ws/plugins/hypervisors/xenserver/target/surefire-reports>

-------------------------------------------------------
 T E S T S
-------------------------------------------------------
Running com.cloud.hypervisor.xenserver.resource.wrapper.XenServer56FP1WrapperTest
log4j:WARN No appenders could be found for logger (com.cloud.hypervisor.xenserver.resource.XenServerConnectionPool).
log4j:WARN Please initialize the log4j system properly.
log4j:WARN See http://logging.apache.org/log4j/1.2/faq.html#noconfig for more info.
Tests run: 1, Failures: 0, Errors: 0, Skipped: 0, Time elapsed: 2.411 sec - in com.cloud.hypervisor.xenserver.resource.wrapper.XenServer56FP1WrapperTest
Running com.cloud.hypervisor.xenserver.resource.wrapper.XenServer610WrapperTest
Tests run: 9, Failures: 0, Errors: 0, Skipped: 0, Time elapsed: 0.833 sec - in com.cloud.hypervisor.xenserver.resource.wrapper.XenServer610WrapperTest
Running com.cloud.hypervisor.xenserver.resource.wrapper.XcpServerWrapperTest
Tests run: 3, Failures: 0, Errors: 0, Skipped: 0, Time elapsed: 0.191 sec - in com.cloud.hypervisor.xenserver.resource.wrapper.XcpServerWrapperTest
Running com.cloud.hypervisor.xenserver.resource.wrapper.XenServer56WrapperTest
Tests run: 7, Failures: 0, Errors: 0, Skipped: 0, Time elapsed: 0.286 sec - in com.cloud.hypervisor.xenserver.resource.wrapper.XenServer56WrapperTest
Running com.cloud.hypervisor.xenserver.resource.wrapper.XenServer620SP1WrapperTest
Tests run: 2, Failures: 0, Errors: 0, Skipped: 0, Time elapsed: 0.17 sec - in com.cloud.hypervisor.xenserver.resource.wrapper.XenServer620SP1WrapperTest
Running com.cloud.hypervisor.xenserver.resource.wrapper.XenServer620WrapperTest
Tests run: 1, Failures: 0, Errors: 0, Skipped: 0, Time elapsed: 0.02 sec - in com.cloud.hypervisor.xenserver.resource.wrapper.XenServer620WrapperTest
Running com.cloud.hypervisor.xenserver.resource.wrapper.CitrixRequestWrapperTest
Tests run: 77, Failures: 0, Errors: 0, Skipped: 0, Time elapsed: 3.727 sec - in com.cloud.hypervisor.xenserver.resource.wrapper.CitrixRequestWrapperTest

Results :

Tests run: 100, Failures: 0, Errors: 0, Skipped: 0

[INFO]                                                                         
[INFO] ------------------------------------------------------------------------
[INFO] Building Apache CloudStack Plugin - Hypervisor KVM 4.6.0-SNAPSHOT
[INFO] ------------------------------------------------------------------------
[INFO] 
[INFO] --- maven-clean-plugin:2.5:clean (default-clean) @ cloud-plugin-hypervisor-kvm ---
[INFO] Deleting <http://jenkins.buildacloud.org/job/build-master-jdk18/ws/plugins/hypervisors/kvm/target>
(includes = [**/*], excludes = [])
[INFO] Deleting <http://jenkins.buildacloud.org/job/build-master-jdk18/ws/plugins/hypervisors/kvm>
(includes = [target, dist], excludes = [])
[INFO] 
[INFO] --- maven-checkstyle-plugin:2.11:check (cloudstack-checkstyle) @ cloud-plugin-hypervisor-kvm
---
[INFO] Starting audit...
Audit done.

[INFO] 
[INFO] --- maven-remote-resources-plugin:1.3:process (default) @ cloud-plugin-hypervisor-kvm
---
[INFO] 
[INFO] --- maven-resources-plugin:2.5:resources (default-resources) @ cloud-plugin-hypervisor-kvm
---
[debug] execute contextualize
[INFO] Using 'UTF-8' encoding to copy filtered resources.
[INFO] Copying 2 resources
[INFO] Copying 3 resources
[INFO] 
[INFO] --- maven-compiler-plugin:3.2:compile (default-compile) @ cloud-plugin-hypervisor-kvm
---
[INFO] Changes detected - recompiling the module!
[INFO] Compiling 99 source files to <http://jenkins.buildacloud.org/job/build-master-jdk18/ws/plugins/hypervisors/kvm/target/classes>
[INFO] 
[INFO] --- maven-resources-plugin:2.5:testResources (default-testResources) @ cloud-plugin-hypervisor-kvm
---
[debug] execute contextualize
[INFO] Using 'UTF-8' encoding to copy filtered resources.
[INFO] skip non existing resourceDirectory <http://jenkins.buildacloud.org/job/build-master-jdk18/ws/plugins/hypervisors/kvm/test/resources>
[INFO] Copying 3 resources
[INFO] 
[INFO] --- maven-compiler-plugin:3.2:testCompile (default-testCompile) @ cloud-plugin-hypervisor-kvm
---
[INFO] Changes detected - recompiling the module!
[INFO] Compiling 9 source files to <http://jenkins.buildacloud.org/job/build-master-jdk18/ws/plugins/hypervisors/kvm/target/test-classes>
[INFO] 
[INFO] --- maven-surefire-plugin:2.18.1:test (default-test) @ cloud-plugin-hypervisor-kvm
---
[INFO] Surefire report directory: <http://jenkins.buildacloud.org/job/build-master-jdk18/ws/plugins/hypervisors/kvm/target/surefire-reports>

-------------------------------------------------------
 T E S T S
-------------------------------------------------------
Running com.cloud.hypervisor.kvm.storage.KVMStorageProcessorTest
Tests run: 2, Failures: 0, Errors: 0, Skipped: 0, Time elapsed: 0.019 sec - in com.cloud.hypervisor.kvm.storage.KVMStorageProcessorTest
Running com.cloud.hypervisor.kvm.resource.LibvirtComputingResourceTest
log4j:WARN No appenders could be found for logger (com.cloud.hypervisor.kvm.resource.wrapper.LibvirtConsoleProxyLoadCommandWrapper).
log4j:WARN Please initialize the log4j system properly.
log4j:WARN See http://logging.apache.org/log4j/1.2/faq.html#noconfig for more info.
Tests run: 143, Failures: 0, Errors: 1, Skipped: 0, Time elapsed: 267.471 sec <<<
FAILURE! - in com.cloud.hypervisor.kvm.resource.LibvirtComputingResourceTest
testGetHostStatsCommand(com.cloud.hypervisor.kvm.resource.LibvirtComputingResourceTest)  Time
elapsed: 0.232 sec  <<< ERROR!
java.lang.Exception: Unexpected exception, expected<java.lang.NumberFormatException>
but was<java.lang.NullPointerException>
	at com.cloud.hypervisor.kvm.resource.wrapper.LibvirtGetHostStatsCommandWrapper.execute(LibvirtGetHostStatsCommandWrapper.java:77)
	at com.cloud.hypervisor.kvm.resource.wrapper.LibvirtGetHostStatsCommandWrapper.execute(LibvirtGetHostStatsCommandWrapper.java:34)
	at com.cloud.hypervisor.kvm.resource.wrapper.LibvirtRequestWrapper.execute(LibvirtRequestWrapper.java:182)
	at com.cloud.hypervisor.kvm.resource.LibvirtComputingResourceTest.testGetHostStatsCommand(LibvirtComputingResourceTest.java:930)

Running com.cloud.hypervisor.kvm.resource.LibvirtStoragePoolDefTest
Tests run: 3, Failures: 0, Errors: 0, Skipped: 0, Time elapsed: 0.008 sec - in com.cloud.hypervisor.kvm.resource.LibvirtStoragePoolDefTest
Running com.cloud.hypervisor.kvm.resource.LibvirtVifDriverTest
Tests run: 7, Failures: 0, Errors: 0, Skipped: 0, Time elapsed: 0.22 sec - in com.cloud.hypervisor.kvm.resource.LibvirtVifDriverTest
Running com.cloud.hypervisor.kvm.resource.LibvirtDomainXMLParserTest
Tests run: 1, Failures: 0, Errors: 0, Skipped: 0, Time elapsed: 0.032 sec - in com.cloud.hypervisor.kvm.resource.LibvirtDomainXMLParserTest
Running com.cloud.hypervisor.kvm.resource.LibvirtVMDefTest
Tests run: 5, Failures: 0, Errors: 0, Skipped: 0, Time elapsed: 0.024 sec - in com.cloud.hypervisor.kvm.resource.LibvirtVMDefTest
Running com.cloud.hypervisor.kvm.resource.LibvirtSecretDefTest
Tests run: 2, Failures: 0, Errors: 0, Skipped: 0, Time elapsed: 0 sec - in com.cloud.hypervisor.kvm.resource.LibvirtSecretDefTest

Results :

Tests in error: 
  LibvirtComputingResourceTest.testGetHostStatsCommand ยป  Unexpected exception, ...

Tests run: 163, Failures: 0, Errors: 1, Skipped: 0

[INFO] ------------------------------------------------------------------------
[INFO] Reactor Summary:
[INFO] 
[INFO] Apache CloudStack Developer Tools - Checkstyle Configuration  SUCCESS [2.488s]
[INFO] Apache CloudStack ................................. SUCCESS [3.260s]
[INFO] Apache CloudStack Maven Conventions Parent ........ SUCCESS [5.521s]
[INFO] Apache CloudStack Framework - Managed Context ..... SUCCESS [8.869s]
[INFO] Apache CloudStack Utils ........................... SUCCESS [49.665s]
[INFO] Apache CloudStack Framework ....................... SUCCESS [0.134s]
[INFO] Apache CloudStack Framework - Event Notification .. SUCCESS [22.539s]
[INFO] Apache CloudStack Framework - Configuration ....... SUCCESS [13.017s]
[INFO] Apache CloudStack API ............................. SUCCESS [44.309s]
[INFO] Apache CloudStack Framework - REST ................ SUCCESS [7.297s]
[INFO] Apache CloudStack Framework - IPC ................. SUCCESS [13.409s]
[INFO] Apache CloudStack Cloud Engine .................... SUCCESS [0.095s]
[INFO] Apache CloudStack Cloud Engine API ................ SUCCESS [15.675s]
[INFO] Apache CloudStack Framework - Security ............ SUCCESS [7.944s]
[INFO] Apache CloudStack Core ............................ SUCCESS [33.112s]
[INFO] Apache CloudStack Agents .......................... SUCCESS [15.438s]
[INFO] Apache CloudStack Framework - Clustering .......... SUCCESS [7.987s]
[INFO] Apache CloudStack Framework - Event Notification .. SUCCESS [6.431s]
[INFO] Apache CloudStack Cloud Engine Schema Component ... SUCCESS [44.203s]
[INFO] Apache CloudStack Framework - Jobs ................ SUCCESS [14.469s]
[INFO] Apache CloudStack Cloud Engine Internal Components API  SUCCESS [8.696s]
[INFO] Apache CloudStack Server .......................... SUCCESS [2:04.224s]
[INFO] Apache CloudStack Usage Server .................... SUCCESS [18.419s]
[INFO] Apache CloudStack Cloud Engine Orchestration Component  SUCCESS [28.016s]
[INFO] Apache CloudStack Cloud Services .................. SUCCESS [0.076s]
[INFO] Apache CloudStack Secondary Storage ............... SUCCESS [0.693s]
[INFO] Apache CloudStack Secondary Storage Service ....... SUCCESS [16.657s]
[INFO] Apache CloudStack Engine Storage Component ........ SUCCESS [22.181s]
[INFO] Apache CloudStack Engine Storage Volume Component . SUCCESS [14.054s]
[INFO] Apache CloudStack Engine Storage Image Component .. SUCCESS [8.843s]
[INFO] Apache CloudStack Engine Storage Data Motion Component  SUCCESS [7.215s]
[INFO] Apache CloudStack Engine Storage Cache Component .. SUCCESS [6.457s]
[INFO] Apache CloudStack Engine Storage Snapshot Component  SUCCESS [26.342s]
[INFO] Apache CloudStack Cloud Engine API ................ SUCCESS [5.505s]
[INFO] Apache CloudStack Cloud Engine Service ............ SUCCESS [1.608s]
[INFO] Apache CloudStack Plugin POM ...................... SUCCESS [1.052s]
[INFO] Apache CloudStack Plugin - API Rate Limit ......... SUCCESS [18.414s]
[INFO] Apache CloudStack Plugin - Storage Volume default provider  SUCCESS [6.817s]
[INFO] Apache CloudStack Plugin - Storage Volume SolidFire Provider  SUCCESS [14.413s]
[INFO] Apache CloudStack Plugin - API SolidFire .......... SUCCESS [6.368s]
[INFO] Apache CloudStack Plugin - API Discovery .......... SUCCESS [12.982s]
[INFO] Apache CloudStack Plugin - ACL Static Role Based .. SUCCESS [5.520s]
[INFO] Apache CloudStack Plugin - Host Anti-Affinity Processor  SUCCESS [6.033s]
[INFO] Apache CloudStack Plugin - Explicit Dedication Processor  SUCCESS [6.396s]
[INFO] Apache CloudStack Plugin - User Concentrated Pod Deployment Planner  SUCCESS [5.699s]
[INFO] Apache CloudStack Plugin - User Dispersing Deployment Planner  SUCCESS [5.772s]
[INFO] Apache CloudStack Plugin - Implicit Dedication Planner  SUCCESS [21.242s]
[INFO] Apache CloudStack Plugin - Skip Heurestics Planner  SUCCESS [5.843s]
[INFO] Apache CloudStack Plugin - Host Allocator Random .. SUCCESS [6.243s]
[INFO] Apache CloudStack Plugin - Dedicated Resources .... SUCCESS [19.739s]
[INFO] Apache CloudStack Plugin - Hypervisor OracleVM .... SUCCESS [9.281s]
[INFO] Apache CloudStack Plugin - Open vSwitch ........... SUCCESS [11.496s]
[INFO] Apache CloudStack Plugin - Hypervisor XenServer ... SUCCESS [37.377s]
[INFO] Apache CloudStack Plugin - Hypervisor KVM ......... FAILURE [4:57.171s]
[INFO] Apache CloudStack Plugin - RabbitMQ Event Bus ..... SKIPPED
[INFO] Apache CloudStack Plugin - In Memory Event Bus .... SKIPPED
[INFO] Apache CloudStack Plugin - Kafka Event Bus ........ SKIPPED
[INFO] Apache CloudStack Plugin - Hypervisor Baremetal ... SKIPPED
[INFO] Apache CloudStack Plugin - Hypervisor UCS ......... SKIPPED
[INFO] Apache CloudStack Plugin - Hypervisor Hyper-V ..... SKIPPED
[INFO] Apache CloudStack Plugin - Hypervisor OracleVM3 ... SKIPPED
[INFO] Apache CloudStack Plugin - Network Elastic Load Balancer  SKIPPED
[INFO] Apache CloudStack Plugin - Network Internal Load Balancer  SKIPPED
[INFO] Apache CloudStack Framework - Spring Life Cycle ... SKIPPED
[INFO] Apache CloudStack Plugin - Network Juniper Contrail  SKIPPED
[INFO] Apache CloudStack Plugin - Palo Alto .............. SKIPPED
[INFO] Apache CloudStack Plugin - Network Netscaler ...... SKIPPED
[INFO] Apache CloudStack Plugin - Network Nicira NVP ..... SKIPPED
[INFO] Apache CloudStack Plugin - BigSwitch Virtual Network Segment  SKIPPED
[INFO] Apache CloudStack Plugin - Network Brocade VCS .... SKIPPED
[INFO] Apache CloudStack Plugin - Midokura Midonet ....... SKIPPED
[INFO] Apache CloudStack Plugin - Stratosphere SSP ....... SKIPPED
[INFO] Apache CloudStack Plugin - Network Opendaylight ... SKIPPED
[INFO] Apache CloudStack Plugin - Storage Allocator Random  SKIPPED
[INFO] Apache CloudStack Plugin - User Authenticator LDAP  SKIPPED
[INFO] Apache CloudStack Plugin - User Authenticator MD5 . SKIPPED
[INFO] Apache CloudStack Plugin - User Authenticator PBKDF2-SHA-256  SKIPPED
[INFO] Apache CloudStack Plugin - User Authenticator Plain Text  SKIPPED
[INFO] Apache CloudStack Plugin - User Authenticator SAML2  SKIPPED
[INFO] Apache CloudStack Plugin - User Authenticator SHA256 Salted  SKIPPED
[INFO] Apache CloudStack Plugin - Dns Notifier Example ... SKIPPED
[INFO] Apache CloudStack Plugin - Storage Image S3 ....... SKIPPED
[INFO] Apache CloudStack Plugin - Storage Image Swift provider  SKIPPED
[INFO] Apache CloudStack Plugin - Storage Image default provider  SKIPPED
[INFO] Apache CloudStack Plugin - Storage Image sample provider  SKIPPED
[INFO] Apache CloudStack Plugin - Storage Volume Nexenta Provider  SKIPPED
[INFO] Apache CloudStack Plugin - Storage Volume CloudByte Provider  SKIPPED
[INFO] Apache CloudStack Plugin - Storage Volume sample provider  SKIPPED
[INFO] Apache CloudStack Plugin - SNMP Alerts ............ SKIPPED
[INFO] Apache CloudStack Plugin - Syslog Alerts .......... SKIPPED
[INFO] Apache CloudStack Plugin - Network VXLAN .......... SKIPPED
[INFO] Apache CloudStack Plugin - GloboDNS ............... SKIPPED
[INFO] Apache CloudStack Framework - Spring Module ....... SKIPPED
[INFO] Apache CloudStack Secondary Storage Controller .... SKIPPED
[INFO] Apache CloudStack Console Proxy - RDP Client ...... SKIPPED
[INFO] Apache CloudStack Console Proxy ................... SKIPPED
[INFO] Apache CloudStack Console Proxy - Server .......... SKIPPED
[INFO] Apache CloudStack System VM ....................... SKIPPED
[INFO] Apache CloudStack Client UI ....................... SKIPPED
[INFO] Apache CloudStack Framework - QuickCloud .......... SKIPPED
[INFO] ------------------------------------------------------------------------
[INFO] BUILD FAILURE
[INFO] ------------------------------------------------------------------------
[INFO] Total time: 18:30.234s
[INFO] Finished at: Wed May 13 12:22:06 UTC 2015
[INFO] Final Memory: 64M/367M
[INFO] ------------------------------------------------------------------------
[ERROR] Failed to execute goal org.apache.maven.plugins:maven-surefire-plugin:2.18.1:test
(default-test) on project cloud-plugin-hypervisor-kvm: There are test failures.
[ERROR] 
[ERROR] Please refer to <http://jenkins.buildacloud.org/job/build-master-jdk18/ws/plugins/hypervisors/kvm/target/surefire-reports>
for the individual test results.
[ERROR] -> [Help 1]
[ERROR] 
[ERROR] To see the full stack trace of the errors, re-run Maven with the -e switch.
[ERROR] Re-run Maven using the -X switch to enable full debug logging.
[ERROR] 
[ERROR] For more information about the errors and possible solutions, please read the following
articles:
[ERROR] [Help 1] http://cwiki.apache.org/confluence/display/MAVEN/MojoFailureException
[ERROR] 
[ERROR] After correcting the problems, you can resume the build with the command
[ERROR]   mvn <goals> -rf :cloud-plugin-hypervisor-kvm
Build step 'Invoke top-level Maven targets' marked build as failure
Recording test results

Mime
View raw message