cloudstack-dev mailing list archives

Site index · List index
Message view « Date » · « Thread »
Top « Date » · « Thread »
From jenk...@cloudstack.org
Subject Build failed in Jenkins: build-master-jdk18 #73
Date Sat, 23 May 2015 10:13:28 GMT
See <http://jenkins.buildacloud.org/job/build-master-jdk18/73/changes>

Changes:

[wrodrigues] CLOUDSTACK-8506

[wrodrigues] CLOUDSTACK-8506

------------------------------------------
[...truncated 2607 lines...]
[INFO] 
[INFO] --- maven-compiler-plugin:3.2:compile (default-compile) @ cloud-plugin-hypervisor-ovm
---
[INFO] Changes detected - recompiling the module!
[INFO] Compiling 18 source files to <http://jenkins.buildacloud.org/job/build-master-jdk18/ws/plugins/hypervisors/ovm/target/classes>
[INFO] 
[INFO] --- maven-resources-plugin:2.5:testResources (default-testResources) @ cloud-plugin-hypervisor-ovm
---
[debug] execute contextualize
[INFO] Using 'UTF-8' encoding to copy filtered resources.
[INFO] skip non existing resourceDirectory <http://jenkins.buildacloud.org/job/build-master-jdk18/ws/plugins/hypervisors/ovm/test/resources>
[INFO] Copying 3 resources
[INFO] 
[INFO] --- maven-compiler-plugin:3.2:testCompile (default-testCompile) @ cloud-plugin-hypervisor-ovm
---
[INFO] No sources to compile
[INFO] 
[INFO] --- maven-surefire-plugin:2.18.1:test (default-test) @ cloud-plugin-hypervisor-ovm
---
[INFO]                                                                         
[INFO] ------------------------------------------------------------------------
[INFO] Building Apache CloudStack Plugin - Open vSwitch 4.6.0-SNAPSHOT
[INFO] ------------------------------------------------------------------------
[INFO] 
[INFO] --- maven-clean-plugin:2.5:clean (default-clean) @ cloud-plugin-network-ovs ---
[INFO] Deleting <http://jenkins.buildacloud.org/job/build-master-jdk18/ws/plugins/network-elements/ovs/target>
(includes = [**/*], excludes = [])
[INFO] Deleting <http://jenkins.buildacloud.org/job/build-master-jdk18/ws/plugins/network-elements/ovs>
(includes = [target, dist], excludes = [])
[INFO] 
[INFO] --- maven-checkstyle-plugin:2.11:check (cloudstack-checkstyle) @ cloud-plugin-network-ovs
---
[INFO] Starting audit...
Audit done.

[INFO] 
[INFO] --- maven-remote-resources-plugin:1.3:process (default) @ cloud-plugin-network-ovs
---
[INFO] 
[INFO] --- maven-resources-plugin:2.5:resources (default-resources) @ cloud-plugin-network-ovs
---
[debug] execute contextualize
[INFO] Using 'UTF-8' encoding to copy filtered resources.
[INFO] Copying 2 resources
[INFO] Copying 3 resources
[INFO] 
[INFO] --- maven-compiler-plugin:3.2:compile (default-compile) @ cloud-plugin-network-ovs
---
[INFO] Changes detected - recompiling the module!
[INFO] Compiling 33 source files to <http://jenkins.buildacloud.org/job/build-master-jdk18/ws/plugins/network-elements/ovs/target/classes>
[INFO] 
[INFO] --- maven-resources-plugin:2.5:testResources (default-testResources) @ cloud-plugin-network-ovs
---
[debug] execute contextualize
[INFO] Using 'UTF-8' encoding to copy filtered resources.
[INFO] skip non existing resourceDirectory <http://jenkins.buildacloud.org/job/build-master-jdk18/ws/plugins/network-elements/ovs/test/resources>
[INFO] Copying 3 resources
[INFO] 
[INFO] --- maven-compiler-plugin:3.2:testCompile (default-testCompile) @ cloud-plugin-network-ovs
---
[INFO] No sources to compile
[INFO] 
[INFO] --- maven-surefire-plugin:2.18.1:test (default-test) @ cloud-plugin-network-ovs ---
[INFO]                                                                         
[INFO] ------------------------------------------------------------------------
[INFO] Building Apache CloudStack Plugin - Hypervisor XenServer 4.6.0-SNAPSHOT
[INFO] ------------------------------------------------------------------------
[INFO] 
[INFO] --- maven-clean-plugin:2.5:clean (default-clean) @ cloud-plugin-hypervisor-xenserver
---
[INFO] Deleting <http://jenkins.buildacloud.org/job/build-master-jdk18/ws/plugins/hypervisors/xenserver/target>
(includes = [**/*], excludes = [])
[INFO] Deleting <http://jenkins.buildacloud.org/job/build-master-jdk18/ws/plugins/hypervisors/xenserver>
(includes = [target, dist], excludes = [])
[INFO] 
[INFO] --- maven-checkstyle-plugin:2.11:check (cloudstack-checkstyle) @ cloud-plugin-hypervisor-xenserver
---
[INFO] Starting audit...
Audit done.

[INFO] 
[INFO] --- maven-remote-resources-plugin:1.3:process (default) @ cloud-plugin-hypervisor-xenserver
---
[INFO] 
[INFO] --- maven-resources-plugin:2.5:resources (default-resources) @ cloud-plugin-hypervisor-xenserver
---
[debug] execute contextualize
[INFO] Using 'UTF-8' encoding to copy filtered resources.
[INFO] Copying 4 resources
[INFO] Copying 3 resources
[INFO] 
[INFO] --- maven-compiler-plugin:3.2:compile (default-compile) @ cloud-plugin-hypervisor-xenserver
---
[INFO] Changes detected - recompiling the module!
[INFO] Compiling 96 source files to <http://jenkins.buildacloud.org/job/build-master-jdk18/ws/plugins/hypervisors/xenserver/target/classes>
[INFO] 
[INFO] --- maven-resources-plugin:2.5:testResources (default-testResources) @ cloud-plugin-hypervisor-xenserver
---
[debug] execute contextualize
[INFO] Using 'UTF-8' encoding to copy filtered resources.
[INFO] skip non existing resourceDirectory <http://jenkins.buildacloud.org/job/build-master-jdk18/ws/plugins/hypervisors/xenserver/test/resources>
[INFO] Copying 3 resources
[INFO] 
[INFO] --- maven-compiler-plugin:3.2:testCompile (default-testCompile) @ cloud-plugin-hypervisor-xenserver
---
[INFO] Changes detected - recompiling the module!
[INFO] Compiling 7 source files to <http://jenkins.buildacloud.org/job/build-master-jdk18/ws/plugins/hypervisors/xenserver/target/test-classes>
[INFO] 
[INFO] --- maven-surefire-plugin:2.18.1:test (default-test) @ cloud-plugin-hypervisor-xenserver
---
[INFO] Surefire report directory: <http://jenkins.buildacloud.org/job/build-master-jdk18/ws/plugins/hypervisors/xenserver/target/surefire-reports>

-------------------------------------------------------
 T E S T S
-------------------------------------------------------
Running com.cloud.hypervisor.xenserver.resource.wrapper.XenServer56FP1WrapperTest
log4j:WARN No appenders could be found for logger (com.cloud.hypervisor.xenserver.resource.XenServerConnectionPool).
log4j:WARN Please initialize the log4j system properly.
log4j:WARN See http://logging.apache.org/log4j/1.2/faq.html#noconfig for more info.
Tests run: 1, Failures: 0, Errors: 0, Skipped: 0, Time elapsed: 2.849 sec - in com.cloud.hypervisor.xenserver.resource.wrapper.XenServer56FP1WrapperTest
Running com.cloud.hypervisor.xenserver.resource.wrapper.XenServer610WrapperTest
Tests run: 9, Failures: 0, Errors: 0, Skipped: 0, Time elapsed: 0.838 sec - in com.cloud.hypervisor.xenserver.resource.wrapper.XenServer610WrapperTest
Running com.cloud.hypervisor.xenserver.resource.wrapper.XcpServerWrapperTest
Tests run: 3, Failures: 0, Errors: 0, Skipped: 0, Time elapsed: 0.19 sec - in com.cloud.hypervisor.xenserver.resource.wrapper.XcpServerWrapperTest
Running com.cloud.hypervisor.xenserver.resource.wrapper.XenServer56WrapperTest
Tests run: 7, Failures: 0, Errors: 0, Skipped: 0, Time elapsed: 0.399 sec - in com.cloud.hypervisor.xenserver.resource.wrapper.XenServer56WrapperTest
Running com.cloud.hypervisor.xenserver.resource.wrapper.XenServer620SP1WrapperTest
Tests run: 2, Failures: 0, Errors: 0, Skipped: 0, Time elapsed: 0.251 sec - in com.cloud.hypervisor.xenserver.resource.wrapper.XenServer620SP1WrapperTest
Running com.cloud.hypervisor.xenserver.resource.wrapper.XenServer620WrapperTest
Tests run: 1, Failures: 0, Errors: 0, Skipped: 0, Time elapsed: 0.016 sec - in com.cloud.hypervisor.xenserver.resource.wrapper.XenServer620WrapperTest
Running com.cloud.hypervisor.xenserver.resource.wrapper.CitrixRequestWrapperTest
Tests run: 78, Failures: 0, Errors: 1, Skipped: 0, Time elapsed: 1.994 sec <<< FAILURE!
- in com.cloud.hypervisor.xenserver.resource.wrapper.CitrixRequestWrapperTest
testCheckOnHostCommand(com.cloud.hypervisor.xenserver.resource.wrapper.CitrixRequestWrapperTest)
 Time elapsed: 0.021 sec  <<< ERROR!
java.lang.ClassCastException: com.cloud.hypervisor.xenserver.resource.CitrixResourceBase$$EnhancerByMockitoWithCGLIB$$ff8b50d0
cannot be cast to com.cloud.hypervisor.xenserver.resource.XenServer56Resource
	at com.cloud.hypervisor.xenserver.resource.wrapper.xen56.XenServer56CheckOnHostCommandWrapper.execute(XenServer56CheckOnHostCommandWrapper.java:31)
	at com.cloud.hypervisor.xenserver.resource.wrapper.CitrixRequestWrapper.execute(CitrixRequestWrapper.java:122)
	at com.cloud.hypervisor.xenserver.resource.wrapper.CitrixRequestWrapperTest.testCheckOnHostCommand(CitrixRequestWrapperTest.java:668)


Results :

Tests in error: 
  CitrixRequestWrapperTest.testCheckOnHostCommand:668 ยป ClassCast com.cloud.hype...

Tests run: 101, Failures: 0, Errors: 1, Skipped: 0

[INFO] ------------------------------------------------------------------------
[INFO] Reactor Summary:
[INFO] 
[INFO] Apache CloudStack Developer Tools - Checkstyle Configuration  SUCCESS [2.781s]
[INFO] Apache CloudStack ................................. SUCCESS [3.050s]
[INFO] Apache CloudStack Maven Conventions Parent ........ SUCCESS [3.183s]
[INFO] Apache CloudStack Framework - Managed Context ..... SUCCESS [9.355s]
[INFO] Apache CloudStack Utils ........................... SUCCESS [50.966s]
[INFO] Apache CloudStack Framework ....................... SUCCESS [0.114s]
[INFO] Apache CloudStack Framework - Event Notification .. SUCCESS [20.854s]
[INFO] Apache CloudStack Framework - Configuration ....... SUCCESS [12.646s]
[INFO] Apache CloudStack API ............................. SUCCESS [42.415s]
[INFO] Apache CloudStack Framework - REST ................ SUCCESS [6.417s]
[INFO] Apache CloudStack Framework - IPC ................. SUCCESS [13.082s]
[INFO] Apache CloudStack Cloud Engine .................... SUCCESS [0.088s]
[INFO] Apache CloudStack Cloud Engine API ................ SUCCESS [15.119s]
[INFO] Apache CloudStack Framework - Security ............ SUCCESS [6.866s]
[INFO] Apache CloudStack Core ............................ SUCCESS [29.729s]
[INFO] Apache CloudStack Agents .......................... SUCCESS [15.478s]
[INFO] Apache CloudStack Framework - Clustering .......... SUCCESS [8.472s]
[INFO] Apache CloudStack Framework - Event Notification .. SUCCESS [6.065s]
[INFO] Apache CloudStack Cloud Engine Schema Component ... SUCCESS [45.866s]
[INFO] Apache CloudStack Framework - Jobs ................ SUCCESS [13.754s]
[INFO] Apache CloudStack Cloud Engine Internal Components API  SUCCESS [8.519s]
[INFO] Apache CloudStack Server .......................... SUCCESS [2:01.837s]
[INFO] Apache CloudStack Usage Server .................... SUCCESS [18.239s]
[INFO] Apache CloudStack Cloud Engine Orchestration Component  SUCCESS [26.909s]
[INFO] Apache CloudStack Cloud Services .................. SUCCESS [0.065s]
[INFO] Apache CloudStack Secondary Storage ............... SUCCESS [0.769s]
[INFO] Apache CloudStack Secondary Storage Service ....... SUCCESS [17.011s]
[INFO] Apache CloudStack Engine Storage Component ........ SUCCESS [20.034s]
[INFO] Apache CloudStack Engine Storage Volume Component . SUCCESS [13.625s]
[INFO] Apache CloudStack Engine Storage Image Component .. SUCCESS [7.762s]
[INFO] Apache CloudStack Engine Storage Data Motion Component  SUCCESS [7.067s]
[INFO] Apache CloudStack Engine Storage Cache Component .. SUCCESS [6.263s]
[INFO] Apache CloudStack Engine Storage Snapshot Component  SUCCESS [25.634s]
[INFO] Apache CloudStack Cloud Engine API ................ SUCCESS [4.147s]
[INFO] Apache CloudStack Cloud Engine Service ............ SUCCESS [1.526s]
[INFO] Apache CloudStack Plugin POM ...................... SUCCESS [0.991s]
[INFO] Apache CloudStack Plugin - API Rate Limit ......... SUCCESS [16.727s]
[INFO] Apache CloudStack Plugin - Storage Volume default provider  SUCCESS [6.121s]
[INFO] Apache CloudStack Plugin - Storage Volume SolidFire Provider  SUCCESS [14.257s]
[INFO] Apache CloudStack Plugin - API SolidFire .......... SUCCESS [6.325s]
[INFO] Apache CloudStack Plugin - API Discovery .......... SUCCESS [13.405s]
[INFO] Apache CloudStack Plugin - ACL Static Role Based .. SUCCESS [5.252s]
[INFO] Apache CloudStack Plugin - Host Anti-Affinity Processor  SUCCESS [5.733s]
[INFO] Apache CloudStack Plugin - Explicit Dedication Processor  SUCCESS [6.302s]
[INFO] Apache CloudStack Plugin - User Concentrated Pod Deployment Planner  SUCCESS [6.104s]
[INFO] Apache CloudStack Plugin - User Dispersing Deployment Planner  SUCCESS [5.623s]
[INFO] Apache CloudStack Plugin - Implicit Dedication Planner  SUCCESS [19.748s]
[INFO] Apache CloudStack Plugin - Skip Heurestics Planner  SUCCESS [5.237s]
[INFO] Apache CloudStack Plugin - Host Allocator Random .. SUCCESS [5.535s]
[INFO] Apache CloudStack Plugin - Dedicated Resources .... SUCCESS [18.925s]
[INFO] Apache CloudStack Plugin - Hypervisor OracleVM .... SUCCESS [8.422s]
[INFO] Apache CloudStack Plugin - Open vSwitch ........... SUCCESS [9.662s]
[INFO] Apache CloudStack Plugin - Hypervisor XenServer ... FAILURE [33.963s]
[INFO] Apache CloudStack Plugin - Hypervisor KVM ......... SKIPPED
[INFO] Apache CloudStack Plugin - RabbitMQ Event Bus ..... SKIPPED
[INFO] Apache CloudStack Plugin - In Memory Event Bus .... SKIPPED
[INFO] Apache CloudStack Plugin - Kafka Event Bus ........ SKIPPED
[INFO] Apache CloudStack Plugin - Hypervisor Baremetal ... SKIPPED
[INFO] Apache CloudStack Plugin - Hypervisor UCS ......... SKIPPED
[INFO] Apache CloudStack Plugin - Hypervisor Hyper-V ..... SKIPPED
[INFO] Apache CloudStack Plugin - Hypervisor OracleVM3 ... SKIPPED
[INFO] Apache CloudStack Plugin - Network Elastic Load Balancer  SKIPPED
[INFO] Apache CloudStack Plugin - Network Internal Load Balancer  SKIPPED
[INFO] Apache CloudStack Framework - Spring Life Cycle ... SKIPPED
[INFO] Apache CloudStack Plugin - Network Juniper Contrail  SKIPPED
[INFO] Apache CloudStack Plugin - Palo Alto .............. SKIPPED
[INFO] Apache CloudStack Plugin - Network Netscaler ...... SKIPPED
[INFO] Apache CloudStack Plugin - Network Nicira NVP ..... SKIPPED
[INFO] Apache CloudStack Plugin - BigSwitch Virtual Network Segment  SKIPPED
[INFO] Apache CloudStack Plugin - Network Brocade VCS .... SKIPPED
[INFO] Apache CloudStack Plugin - Midokura Midonet ....... SKIPPED
[INFO] Apache CloudStack Plugin - Stratosphere SSP ....... SKIPPED
[INFO] Apache CloudStack Plugin - Network Opendaylight ... SKIPPED
[INFO] Apache CloudStack Plugin - Storage Allocator Random  SKIPPED
[INFO] Apache CloudStack Plugin - User Authenticator LDAP  SKIPPED
[INFO] Apache CloudStack Plugin - User Authenticator MD5 . SKIPPED
[INFO] Apache CloudStack Plugin - User Authenticator PBKDF2-SHA-256  SKIPPED
[INFO] Apache CloudStack Plugin - User Authenticator Plain Text  SKIPPED
[INFO] Apache CloudStack Plugin - User Authenticator SAML2  SKIPPED
[INFO] Apache CloudStack Plugin - User Authenticator SHA256 Salted  SKIPPED
[INFO] Apache CloudStack Plugin - Dns Notifier Example ... SKIPPED
[INFO] Apache CloudStack Plugin - Storage Image S3 ....... SKIPPED
[INFO] Apache CloudStack Plugin - Storage Image Swift provider  SKIPPED
[INFO] Apache CloudStack Plugin - Storage Image default provider  SKIPPED
[INFO] Apache CloudStack Plugin - Storage Image sample provider  SKIPPED
[INFO] Apache CloudStack Plugin - Storage Volume Nexenta Provider  SKIPPED
[INFO] Apache CloudStack Plugin - Storage Volume CloudByte Provider  SKIPPED
[INFO] Apache CloudStack Plugin - Storage Volume sample provider  SKIPPED
[INFO] Apache CloudStack Plugin - SNMP Alerts ............ SKIPPED
[INFO] Apache CloudStack Plugin - Syslog Alerts .......... SKIPPED
[INFO] Apache CloudStack Plugin - Network VXLAN .......... SKIPPED
[INFO] Apache CloudStack Plugin - GloboDNS ............... SKIPPED
[INFO] Apache CloudStack Framework - Spring Module ....... SKIPPED
[INFO] Apache CloudStack Secondary Storage Controller .... SKIPPED
[INFO] Apache CloudStack Console Proxy - RDP Client ...... SKIPPED
[INFO] Apache CloudStack Console Proxy ................... SKIPPED
[INFO] Apache CloudStack Console Proxy - Server .......... SKIPPED
[INFO] Apache CloudStack System VM ....................... SKIPPED
[INFO] Apache CloudStack Client UI ....................... SKIPPED
[INFO] Apache CloudStack Framework - QuickCloud .......... SKIPPED
[INFO] ------------------------------------------------------------------------
[INFO] BUILD FAILURE
[INFO] ------------------------------------------------------------------------
[INFO] Total time: 13:02.282s
[INFO] Finished at: Sat May 23 10:16:57 UTC 2015
[INFO] Final Memory: 66M/359M
[INFO] ------------------------------------------------------------------------
[ERROR] Failed to execute goal org.apache.maven.plugins:maven-surefire-plugin:2.18.1:test
(default-test) on project cloud-plugin-hypervisor-xenserver: There are test failures.
[ERROR] 
[ERROR] Please refer to <http://jenkins.buildacloud.org/job/build-master-jdk18/ws/plugins/hypervisors/xenserver/target/surefire-reports>
for the individual test results.
[ERROR] -> [Help 1]
[ERROR] 
[ERROR] To see the full stack trace of the errors, re-run Maven with the -e switch.
[ERROR] Re-run Maven using the -X switch to enable full debug logging.
[ERROR] 
[ERROR] For more information about the errors and possible solutions, please read the following
articles:
[ERROR] [Help 1] http://cwiki.apache.org/confluence/display/MAVEN/MojoFailureException
[ERROR] 
[ERROR] After correcting the problems, you can resume the build with the command
[ERROR]   mvn <goals> -rf :cloud-plugin-hypervisor-xenserver
Build step 'Invoke top-level Maven targets' marked build as failure
Recording test results

Mime
View raw message