cloudstack-dev mailing list archives

Site index · List index
Message view « Date » · « Thread »
Top « Date » · « Thread »
From jenk...@cloudstack.org
Subject Build failed in Jenkins: build-master-jdk18 #68
Date Fri, 22 May 2015 12:13:41 GMT
See <http://jenkins.buildacloud.org/job/build-master-jdk18/68/changes>

Changes:

[Rohit Yadav] CLOUDSTACK-8338: Fix hypervisor stats reporting for KVM on EL7

------------------------------------------
[...truncated 2600 lines...]
[INFO] 
[INFO] --- maven-compiler-plugin:3.2:compile (default-compile) @ cloud-plugin-hypervisor-ovm
---
[INFO] Changes detected - recompiling the module!
[INFO] Compiling 18 source files to <http://jenkins.buildacloud.org/job/build-master-jdk18/ws/plugins/hypervisors/ovm/target/classes>
[INFO] 
[INFO] --- maven-resources-plugin:2.5:testResources (default-testResources) @ cloud-plugin-hypervisor-ovm
---
[debug] execute contextualize
[INFO] Using 'UTF-8' encoding to copy filtered resources.
[INFO] skip non existing resourceDirectory <http://jenkins.buildacloud.org/job/build-master-jdk18/ws/plugins/hypervisors/ovm/test/resources>
[INFO] Copying 3 resources
[INFO] 
[INFO] --- maven-compiler-plugin:3.2:testCompile (default-testCompile) @ cloud-plugin-hypervisor-ovm
---
[INFO] No sources to compile
[INFO] 
[INFO] --- maven-surefire-plugin:2.18.1:test (default-test) @ cloud-plugin-hypervisor-ovm
---
[INFO]                                                                         
[INFO] ------------------------------------------------------------------------
[INFO] Building Apache CloudStack Plugin - Open vSwitch 4.6.0-SNAPSHOT
[INFO] ------------------------------------------------------------------------
[INFO] 
[INFO] --- maven-clean-plugin:2.5:clean (default-clean) @ cloud-plugin-network-ovs ---
[INFO] Deleting <http://jenkins.buildacloud.org/job/build-master-jdk18/ws/plugins/network-elements/ovs/target>
(includes = [**/*], excludes = [])
[INFO] Deleting <http://jenkins.buildacloud.org/job/build-master-jdk18/ws/plugins/network-elements/ovs>
(includes = [target, dist], excludes = [])
[INFO] 
[INFO] --- maven-checkstyle-plugin:2.11:check (cloudstack-checkstyle) @ cloud-plugin-network-ovs
---
[INFO] Starting audit...
Audit done.

[INFO] 
[INFO] --- maven-remote-resources-plugin:1.3:process (default) @ cloud-plugin-network-ovs
---
[INFO] 
[INFO] --- maven-resources-plugin:2.5:resources (default-resources) @ cloud-plugin-network-ovs
---
[debug] execute contextualize
[INFO] Using 'UTF-8' encoding to copy filtered resources.
[INFO] Copying 2 resources
[INFO] Copying 3 resources
[INFO] 
[INFO] --- maven-compiler-plugin:3.2:compile (default-compile) @ cloud-plugin-network-ovs
---
[INFO] Changes detected - recompiling the module!
[INFO] Compiling 33 source files to <http://jenkins.buildacloud.org/job/build-master-jdk18/ws/plugins/network-elements/ovs/target/classes>
[INFO] 
[INFO] --- maven-resources-plugin:2.5:testResources (default-testResources) @ cloud-plugin-network-ovs
---
[debug] execute contextualize
[INFO] Using 'UTF-8' encoding to copy filtered resources.
[INFO] skip non existing resourceDirectory <http://jenkins.buildacloud.org/job/build-master-jdk18/ws/plugins/network-elements/ovs/test/resources>
[INFO] Copying 3 resources
[INFO] 
[INFO] --- maven-compiler-plugin:3.2:testCompile (default-testCompile) @ cloud-plugin-network-ovs
---
[INFO] No sources to compile
[INFO] 
[INFO] --- maven-surefire-plugin:2.18.1:test (default-test) @ cloud-plugin-network-ovs ---
[INFO]                                                                         
[INFO] ------------------------------------------------------------------------
[INFO] Building Apache CloudStack Plugin - Hypervisor XenServer 4.6.0-SNAPSHOT
[INFO] ------------------------------------------------------------------------
[INFO] 
[INFO] --- maven-clean-plugin:2.5:clean (default-clean) @ cloud-plugin-hypervisor-xenserver
---
[INFO] Deleting <http://jenkins.buildacloud.org/job/build-master-jdk18/ws/plugins/hypervisors/xenserver/target>
(includes = [**/*], excludes = [])
[INFO] Deleting <http://jenkins.buildacloud.org/job/build-master-jdk18/ws/plugins/hypervisors/xenserver>
(includes = [target, dist], excludes = [])
[INFO] 
[INFO] --- maven-checkstyle-plugin:2.11:check (cloudstack-checkstyle) @ cloud-plugin-hypervisor-xenserver
---
[INFO] Starting audit...
Audit done.

[INFO] 
[INFO] --- maven-remote-resources-plugin:1.3:process (default) @ cloud-plugin-hypervisor-xenserver
---
[INFO] 
[INFO] --- maven-resources-plugin:2.5:resources (default-resources) @ cloud-plugin-hypervisor-xenserver
---
[debug] execute contextualize
[INFO] Using 'UTF-8' encoding to copy filtered resources.
[INFO] Copying 4 resources
[INFO] Copying 3 resources
[INFO] 
[INFO] --- maven-compiler-plugin:3.2:compile (default-compile) @ cloud-plugin-hypervisor-xenserver
---
[INFO] Changes detected - recompiling the module!
[INFO] Compiling 96 source files to <http://jenkins.buildacloud.org/job/build-master-jdk18/ws/plugins/hypervisors/xenserver/target/classes>
[INFO] 
[INFO] --- maven-resources-plugin:2.5:testResources (default-testResources) @ cloud-plugin-hypervisor-xenserver
---
[debug] execute contextualize
[INFO] Using 'UTF-8' encoding to copy filtered resources.
[INFO] skip non existing resourceDirectory <http://jenkins.buildacloud.org/job/build-master-jdk18/ws/plugins/hypervisors/xenserver/test/resources>
[INFO] Copying 3 resources
[INFO] 
[INFO] --- maven-compiler-plugin:3.2:testCompile (default-testCompile) @ cloud-plugin-hypervisor-xenserver
---
[INFO] Changes detected - recompiling the module!
[INFO] Compiling 7 source files to <http://jenkins.buildacloud.org/job/build-master-jdk18/ws/plugins/hypervisors/xenserver/target/test-classes>
[INFO] 
[INFO] --- maven-surefire-plugin:2.18.1:test (default-test) @ cloud-plugin-hypervisor-xenserver
---
[INFO] Surefire report directory: <http://jenkins.buildacloud.org/job/build-master-jdk18/ws/plugins/hypervisors/xenserver/target/surefire-reports>

-------------------------------------------------------
 T E S T S
-------------------------------------------------------
Running com.cloud.hypervisor.xenserver.resource.wrapper.XenServer56FP1WrapperTest
log4j:WARN No appenders could be found for logger (com.cloud.hypervisor.xenserver.resource.XenServerConnectionPool).
log4j:WARN Please initialize the log4j system properly.
log4j:WARN See http://logging.apache.org/log4j/1.2/faq.html#noconfig for more info.
Tests run: 1, Failures: 0, Errors: 0, Skipped: 0, Time elapsed: 3.032 sec - in com.cloud.hypervisor.xenserver.resource.wrapper.XenServer56FP1WrapperTest
Running com.cloud.hypervisor.xenserver.resource.wrapper.XenServer610WrapperTest
Tests run: 9, Failures: 0, Errors: 0, Skipped: 0, Time elapsed: 0.817 sec - in com.cloud.hypervisor.xenserver.resource.wrapper.XenServer610WrapperTest
Running com.cloud.hypervisor.xenserver.resource.wrapper.XcpServerWrapperTest
Tests run: 3, Failures: 0, Errors: 0, Skipped: 0, Time elapsed: 0.168 sec - in com.cloud.hypervisor.xenserver.resource.wrapper.XcpServerWrapperTest
Running com.cloud.hypervisor.xenserver.resource.wrapper.XenServer56WrapperTest
Tests run: 7, Failures: 0, Errors: 0, Skipped: 0, Time elapsed: 0.297 sec - in com.cloud.hypervisor.xenserver.resource.wrapper.XenServer56WrapperTest
Running com.cloud.hypervisor.xenserver.resource.wrapper.XenServer620SP1WrapperTest
Tests run: 2, Failures: 0, Errors: 0, Skipped: 0, Time elapsed: 0.236 sec - in com.cloud.hypervisor.xenserver.resource.wrapper.XenServer620SP1WrapperTest
Running com.cloud.hypervisor.xenserver.resource.wrapper.XenServer620WrapperTest
Tests run: 1, Failures: 0, Errors: 0, Skipped: 0, Time elapsed: 0.02 sec - in com.cloud.hypervisor.xenserver.resource.wrapper.XenServer620WrapperTest
Running com.cloud.hypervisor.xenserver.resource.wrapper.CitrixRequestWrapperTest
Tests run: 78, Failures: 0, Errors: 1, Skipped: 0, Time elapsed: 5.645 sec <<< FAILURE!
- in com.cloud.hypervisor.xenserver.resource.wrapper.CitrixRequestWrapperTest
testCheckOnHostCommand(com.cloud.hypervisor.xenserver.resource.wrapper.CitrixRequestWrapperTest)
 Time elapsed: 0.016 sec  <<< ERROR!
java.lang.ClassCastException: com.cloud.hypervisor.xenserver.resource.CitrixResourceBase$$EnhancerByMockitoWithCGLIB$$c670ae1f
cannot be cast to com.cloud.hypervisor.xenserver.resource.XenServer56Resource
	at com.cloud.hypervisor.xenserver.resource.wrapper.xen56.XenServer56CheckOnHostCommandWrapper.execute(XenServer56CheckOnHostCommandWrapper.java:31)
	at com.cloud.hypervisor.xenserver.resource.wrapper.CitrixRequestWrapper.execute(CitrixRequestWrapper.java:122)
	at com.cloud.hypervisor.xenserver.resource.wrapper.CitrixRequestWrapperTest.testCheckOnHostCommand(CitrixRequestWrapperTest.java:668)


Results :

Tests in error: 
  CitrixRequestWrapperTest.testCheckOnHostCommand:668 ยป ClassCast com.cloud.hype...

Tests run: 101, Failures: 0, Errors: 1, Skipped: 0

[INFO] ------------------------------------------------------------------------
[INFO] Reactor Summary:
[INFO] 
[INFO] Apache CloudStack Developer Tools - Checkstyle Configuration  SUCCESS [3.452s]
[INFO] Apache CloudStack ................................. SUCCESS [2.736s]
[INFO] Apache CloudStack Maven Conventions Parent ........ SUCCESS [3.755s]
[INFO] Apache CloudStack Framework - Managed Context ..... SUCCESS [9.457s]
[INFO] Apache CloudStack Utils ........................... SUCCESS [1:00.774s]
[INFO] Apache CloudStack Framework ....................... SUCCESS [0.110s]
[INFO] Apache CloudStack Framework - Event Notification .. SUCCESS [20.997s]
[INFO] Apache CloudStack Framework - Configuration ....... SUCCESS [12.366s]
[INFO] Apache CloudStack API ............................. SUCCESS [44.212s]
[INFO] Apache CloudStack Framework - REST ................ SUCCESS [6.602s]
[INFO] Apache CloudStack Framework - IPC ................. SUCCESS [12.843s]
[INFO] Apache CloudStack Cloud Engine .................... SUCCESS [0.085s]
[INFO] Apache CloudStack Cloud Engine API ................ SUCCESS [14.430s]
[INFO] Apache CloudStack Framework - Security ............ SUCCESS [6.622s]
[INFO] Apache CloudStack Core ............................ SUCCESS [28.081s]
[INFO] Apache CloudStack Agents .......................... SUCCESS [14.450s]
[INFO] Apache CloudStack Framework - Clustering .......... SUCCESS [8.526s]
[INFO] Apache CloudStack Framework - Event Notification .. SUCCESS [4.816s]
[INFO] Apache CloudStack Cloud Engine Schema Component ... SUCCESS [39.611s]
[INFO] Apache CloudStack Framework - Jobs ................ SUCCESS [13.444s]
[INFO] Apache CloudStack Cloud Engine Internal Components API  SUCCESS [8.188s]
[INFO] Apache CloudStack Server .......................... SUCCESS [2:07.759s]
[INFO] Apache CloudStack Usage Server .................... SUCCESS [19.292s]
[INFO] Apache CloudStack Cloud Engine Orchestration Component  SUCCESS [28.047s]
[INFO] Apache CloudStack Cloud Services .................. SUCCESS [0.073s]
[INFO] Apache CloudStack Secondary Storage ............... SUCCESS [0.672s]
[INFO] Apache CloudStack Secondary Storage Service ....... SUCCESS [16.583s]
[INFO] Apache CloudStack Engine Storage Component ........ SUCCESS [22.334s]
[INFO] Apache CloudStack Engine Storage Volume Component . SUCCESS [13.375s]
[INFO] Apache CloudStack Engine Storage Image Component .. SUCCESS [7.804s]
[INFO] Apache CloudStack Engine Storage Data Motion Component  SUCCESS [7.095s]
[INFO] Apache CloudStack Engine Storage Cache Component .. SUCCESS [5.743s]
[INFO] Apache CloudStack Engine Storage Snapshot Component  SUCCESS [25.735s]
[INFO] Apache CloudStack Cloud Engine API ................ SUCCESS [4.558s]
[INFO] Apache CloudStack Cloud Engine Service ............ SUCCESS [1.628s]
[INFO] Apache CloudStack Plugin POM ...................... SUCCESS [0.831s]
[INFO] Apache CloudStack Plugin - API Rate Limit ......... SUCCESS [17.169s]
[INFO] Apache CloudStack Plugin - Storage Volume default provider  SUCCESS [6.841s]
[INFO] Apache CloudStack Plugin - Storage Volume SolidFire Provider  SUCCESS [14.531s]
[INFO] Apache CloudStack Plugin - API SolidFire .......... SUCCESS [6.528s]
[INFO] Apache CloudStack Plugin - API Discovery .......... SUCCESS [13.724s]
[INFO] Apache CloudStack Plugin - ACL Static Role Based .. SUCCESS [5.308s]
[INFO] Apache CloudStack Plugin - Host Anti-Affinity Processor  SUCCESS [5.429s]
[INFO] Apache CloudStack Plugin - Explicit Dedication Processor  SUCCESS [6.192s]
[INFO] Apache CloudStack Plugin - User Concentrated Pod Deployment Planner  SUCCESS [5.429s]
[INFO] Apache CloudStack Plugin - User Dispersing Deployment Planner  SUCCESS [6.043s]
[INFO] Apache CloudStack Plugin - Implicit Dedication Planner  SUCCESS [19.626s]
[INFO] Apache CloudStack Plugin - Skip Heurestics Planner  SUCCESS [5.175s]
[INFO] Apache CloudStack Plugin - Host Allocator Random .. SUCCESS [5.624s]
[INFO] Apache CloudStack Plugin - Dedicated Resources .... SUCCESS [19.274s]
[INFO] Apache CloudStack Plugin - Hypervisor OracleVM .... SUCCESS [9.131s]
[INFO] Apache CloudStack Plugin - Open vSwitch ........... SUCCESS [9.921s]
[INFO] Apache CloudStack Plugin - Hypervisor XenServer ... FAILURE [38.402s]
[INFO] Apache CloudStack Plugin - Hypervisor KVM ......... SKIPPED
[INFO] Apache CloudStack Plugin - RabbitMQ Event Bus ..... SKIPPED
[INFO] Apache CloudStack Plugin - In Memory Event Bus .... SKIPPED
[INFO] Apache CloudStack Plugin - Kafka Event Bus ........ SKIPPED
[INFO] Apache CloudStack Plugin - Hypervisor Baremetal ... SKIPPED
[INFO] Apache CloudStack Plugin - Hypervisor UCS ......... SKIPPED
[INFO] Apache CloudStack Plugin - Hypervisor Hyper-V ..... SKIPPED
[INFO] Apache CloudStack Plugin - Hypervisor OracleVM3 ... SKIPPED
[INFO] Apache CloudStack Plugin - Network Elastic Load Balancer  SKIPPED
[INFO] Apache CloudStack Plugin - Network Internal Load Balancer  SKIPPED
[INFO] Apache CloudStack Framework - Spring Life Cycle ... SKIPPED
[INFO] Apache CloudStack Plugin - Network Juniper Contrail  SKIPPED
[INFO] Apache CloudStack Plugin - Palo Alto .............. SKIPPED
[INFO] Apache CloudStack Plugin - Network Netscaler ...... SKIPPED
[INFO] Apache CloudStack Plugin - Network Nicira NVP ..... SKIPPED
[INFO] Apache CloudStack Plugin - BigSwitch Virtual Network Segment  SKIPPED
[INFO] Apache CloudStack Plugin - Network Brocade VCS .... SKIPPED
[INFO] Apache CloudStack Plugin - Midokura Midonet ....... SKIPPED
[INFO] Apache CloudStack Plugin - Stratosphere SSP ....... SKIPPED
[INFO] Apache CloudStack Plugin - Network Opendaylight ... SKIPPED
[INFO] Apache CloudStack Plugin - Storage Allocator Random  SKIPPED
[INFO] Apache CloudStack Plugin - User Authenticator LDAP  SKIPPED
[INFO] Apache CloudStack Plugin - User Authenticator MD5 . SKIPPED
[INFO] Apache CloudStack Plugin - User Authenticator PBKDF2-SHA-256  SKIPPED
[INFO] Apache CloudStack Plugin - User Authenticator Plain Text  SKIPPED
[INFO] Apache CloudStack Plugin - User Authenticator SAML2  SKIPPED
[INFO] Apache CloudStack Plugin - User Authenticator SHA256 Salted  SKIPPED
[INFO] Apache CloudStack Plugin - Dns Notifier Example ... SKIPPED
[INFO] Apache CloudStack Plugin - Storage Image S3 ....... SKIPPED
[INFO] Apache CloudStack Plugin - Storage Image Swift provider  SKIPPED
[INFO] Apache CloudStack Plugin - Storage Image default provider  SKIPPED
[INFO] Apache CloudStack Plugin - Storage Image sample provider  SKIPPED
[INFO] Apache CloudStack Plugin - Storage Volume Nexenta Provider  SKIPPED
[INFO] Apache CloudStack Plugin - Storage Volume CloudByte Provider  SKIPPED
[INFO] Apache CloudStack Plugin - Storage Volume sample provider  SKIPPED
[INFO] Apache CloudStack Plugin - SNMP Alerts ............ SKIPPED
[INFO] Apache CloudStack Plugin - Syslog Alerts .......... SKIPPED
[INFO] Apache CloudStack Plugin - Network VXLAN .......... SKIPPED
[INFO] Apache CloudStack Plugin - GloboDNS ............... SKIPPED
[INFO] Apache CloudStack Framework - Spring Module ....... SKIPPED
[INFO] Apache CloudStack Secondary Storage Controller .... SKIPPED
[INFO] Apache CloudStack Console Proxy - RDP Client ...... SKIPPED
[INFO] Apache CloudStack Console Proxy ................... SKIPPED
[INFO] Apache CloudStack Console Proxy - Server .......... SKIPPED
[INFO] Apache CloudStack System VM ....................... SKIPPED
[INFO] Apache CloudStack Client UI ....................... SKIPPED
[INFO] Apache CloudStack Framework - QuickCloud .......... SKIPPED
[INFO] ------------------------------------------------------------------------
[INFO] BUILD FAILURE
[INFO] ------------------------------------------------------------------------
[INFO] Total time: 13:19.944s
[INFO] Finished at: Fri May 22 12:17:10 UTC 2015
[INFO] Final Memory: 65M/360M
[INFO] ------------------------------------------------------------------------
[ERROR] Failed to execute goal org.apache.maven.plugins:maven-surefire-plugin:2.18.1:test
(default-test) on project cloud-plugin-hypervisor-xenserver: There are test failures.
[ERROR] 
[ERROR] Please refer to <http://jenkins.buildacloud.org/job/build-master-jdk18/ws/plugins/hypervisors/xenserver/target/surefire-reports>
for the individual test results.
[ERROR] -> [Help 1]
[ERROR] 
[ERROR] To see the full stack trace of the errors, re-run Maven with the -e switch.
[ERROR] Re-run Maven using the -X switch to enable full debug logging.
[ERROR] 
[ERROR] For more information about the errors and possible solutions, please read the following
articles:
[ERROR] [Help 1] http://cwiki.apache.org/confluence/display/MAVEN/MojoFailureException
[ERROR] 
[ERROR] After correcting the problems, you can resume the build with the command
[ERROR]   mvn <goals> -rf :cloud-plugin-hypervisor-xenserver
Build step 'Invoke top-level Maven targets' marked build as failure
Recording test results

Mime
View raw message