cloudstack-dev mailing list archives

Site index · List index
Message view « Date » · « Thread »
Top « Date » · « Thread »
From jenk...@cloudstack.org
Subject Build failed in Jenkins: simulator-singlerun #1126
Date Fri, 17 Apr 2015 16:12:31 GMT
See <http://jenkins.buildacloud.org/job/simulator-singlerun/1126/changes>

Changes:

[Gaurav Aradhye] CLOUDSTACK-8390: Skipping VPC tests on Hyperv

------------------------------------------
[...truncated 10507 lines...]
========> Initializing database=simulator with host=localhost port=3306 username=cloud
password=cloud
============> Running query: drop database if exists `simulator`
============> Running query: create database `simulator`
============> Running query: GRANT ALL ON simulator.* to 'cloud'@`localhost` identified
by 'cloud'
============> Running query: GRANT ALL ON simulator.* to 'cloud'@`%` identified by 'cloud'
========> Processing SQL file at <http://jenkins.buildacloud.org/job/simulator-singlerun/ws/developer/target/db/create-schema-simulator.sql>
========> Processing SQL file at <http://jenkins.buildacloud.org/job/simulator-singlerun/ws/developer/target/db/templates.simulator.sql>
========> Processing SQL file at <http://jenkins.buildacloud.org/job/simulator-singlerun/ws/developer/target/db/hypervisor_capabilities.simulator.sql>
========> Processing upgrade: com.cloud.upgrade.DatabaseUpgradeChecker
[INFO] 
[INFO] --- maven-site-plugin:3.3:attach-descriptor (attach-descriptor) @ cloud-developer ---
[INFO] 
[INFO] --- maven-install-plugin:2.3.1:install (default-install) @ cloud-developer ---
[INFO] Installing <http://jenkins.buildacloud.org/job/simulator-singlerun/ws/developer/pom.xml>
to /var/lib/jenkins/.m2/repository/org/apache/cloudstack/cloud-developer/4.6.0-SNAPSHOT/cloud-developer-4.6.0-SNAPSHOT.pom
[INFO] ------------------------------------------------------------------------
[INFO] BUILD SUCCESS
[INFO] ------------------------------------------------------------------------
[INFO] Total time: 27.311s
[INFO] Finished at: Fri Apr 17 12:07:40 EDT 2015
[INFO] Final Memory: 45M/182M
[INFO] ------------------------------------------------------------------------
[simulator-singlerun] $ /bin/bash -x /tmp/hudson4697941323495075048.sh
+ jps -l
+ grep -q Launcher
+ rm -f xunit.xml
+ echo ''
+ rm -rf /tmp/MarvinLogs
+ echo Check for initialization of the management server
Check for initialization of the management server
+ COUNTER=0
+ SERVER_PID=891
+ mvn -P systemvm,simulator -pl :cloud-client-ui jetty:run
+ '[' 0 -lt 44 ']'
+ grep -q 'Management server node 127.0.0.1 is up' jetty-output.out
+ sleep 5
+ COUNTER=1
+ '[' 1 -lt 44 ']'
+ grep -q 'Management server node 127.0.0.1 is up' jetty-output.out
+ sleep 5
+ COUNTER=2
+ '[' 2 -lt 44 ']'
+ grep -q 'Management server node 127.0.0.1 is up' jetty-output.out
+ sleep 5
+ COUNTER=3
+ '[' 3 -lt 44 ']'
+ grep -q 'Management server node 127.0.0.1 is up' jetty-output.out
+ sleep 5
+ COUNTER=4
+ '[' 4 -lt 44 ']'
+ grep -q 'Management server node 127.0.0.1 is up' jetty-output.out
+ sleep 5
+ COUNTER=5
+ '[' 5 -lt 44 ']'
+ grep -q 'Management server node 127.0.0.1 is up' jetty-output.out
+ sleep 5
+ COUNTER=6
+ '[' 6 -lt 44 ']'
+ grep -q 'Management server node 127.0.0.1 is up' jetty-output.out
+ sleep 5
+ COUNTER=7
+ '[' 7 -lt 44 ']'
+ grep -q 'Management server node 127.0.0.1 is up' jetty-output.out
+ sleep 5
+ COUNTER=8
+ '[' 8 -lt 44 ']'
+ grep -q 'Management server node 127.0.0.1 is up' jetty-output.out
+ sleep 5
+ COUNTER=9
+ '[' 9 -lt 44 ']'
+ grep -q 'Management server node 127.0.0.1 is up' jetty-output.out
+ sleep 5
+ COUNTER=10
+ '[' 10 -lt 44 ']'
+ grep -q 'Management server node 127.0.0.1 is up' jetty-output.out
+ sleep 5
+ COUNTER=11
+ '[' 11 -lt 44 ']'
+ grep -q 'Management server node 127.0.0.1 is up' jetty-output.out
+ sleep 5
+ COUNTER=12
+ '[' 12 -lt 44 ']'
+ grep -q 'Management server node 127.0.0.1 is up' jetty-output.out
+ sleep 5
+ COUNTER=13
+ '[' 13 -lt 44 ']'
+ grep -q 'Management server node 127.0.0.1 is up' jetty-output.out
+ sleep 5
+ COUNTER=14
+ '[' 14 -lt 44 ']'
+ grep -q 'Management server node 127.0.0.1 is up' jetty-output.out
+ sleep 5
+ COUNTER=15
+ '[' 15 -lt 44 ']'
+ grep -q 'Management server node 127.0.0.1 is up' jetty-output.out
+ sleep 5
+ COUNTER=16
+ '[' 16 -lt 44 ']'
+ grep -q 'Management server node 127.0.0.1 is up' jetty-output.out
+ sleep 5
+ COUNTER=17
+ '[' 17 -lt 44 ']'
+ grep -q 'Management server node 127.0.0.1 is up' jetty-output.out
+ sleep 5
+ COUNTER=18
+ '[' 18 -lt 44 ']'
+ grep -q 'Management server node 127.0.0.1 is up' jetty-output.out
+ sleep 5
+ COUNTER=19
+ '[' 19 -lt 44 ']'
+ grep -q 'Management server node 127.0.0.1 is up' jetty-output.out
+ sleep 5
+ COUNTER=20
+ '[' 20 -lt 44 ']'
+ grep -q 'Management server node 127.0.0.1 is up' jetty-output.out
+ sleep 5
+ COUNTER=21
+ '[' 21 -lt 44 ']'
+ grep -q 'Management server node 127.0.0.1 is up' jetty-output.out
+ sleep 5
+ COUNTER=22
+ '[' 22 -lt 44 ']'
+ grep -q 'Management server node 127.0.0.1 is up' jetty-output.out
+ sleep 5
+ COUNTER=23
+ '[' 23 -lt 44 ']'
+ grep -q 'Management server node 127.0.0.1 is up' jetty-output.out
+ break
+ grep -q 'Management server node 127.0.0.1 is up' jetty-output.out
+ echo Started OK pid 891
Started OK pid 891
+ sleep 20
+ export PYTHONPATH=<http://jenkins.buildacloud.org/job/simulator-singlerun/ws/tools/marvin>
+ PYTHONPATH=<http://jenkins.buildacloud.org/job/simulator-singlerun/ws/tools/marvin>
+ python2.6 tools/marvin/marvin/deployDataCenter.py -i setup/dev/advanced.cfg
/usr/lib/python2.6/site-packages/pycrypto-2.6-py2.6-linux-x86_64.egg/Crypto/Util/number.py:57:
PowmInsecureWarning: Not using mpz_powm_sec.  You should rebuild using libgmp >= 5 to avoid
timing attack vulnerability.
  _warn("Not using mpz_powm_sec.  You should rebuild using libgmp >= 5 to avoid timing
attack vulnerability.", PowmInsecureWarning)

==== Log Folder Path: /tmp//MarvinLogs//DeployDataCenter__Apr_17_2015_12_09_59_H3Q3XB. All
logs will be available here ====

==== Deploy DC Started ====

=== Data Center Settings are dumped to /tmp//MarvinLogs//DeployDataCenter__Apr_17_2015_12_09_59_H3Q3XB/dc_entries.obj===

====Deploy DC Successful=====
+ sudo /usr/local/bin/pip-2.7 install --upgrade tools/marvin/dist/Marvin-4.6.0-SNAPSHOT.tar.gz
Unpacking ./tools/marvin/dist/Marvin-4.6.0-SNAPSHOT.tar.gz
  Running setup.py egg_info for package from file://<http://jenkins.buildacloud.org/job/simulator-singlerun/ws/tools/marvin/dist/Marvin-4.6.0-SNAPSHOT.tar.gz>
    
    warning: no files found matching '*.txt' under directory 'docs'
Downloading/unpacking mysql-connector-python>=1.1.6 (from Marvin==4.6.0-SNAPSHOT)
  Running setup.py egg_info for package mysql-connector-python
    
  Requested mysql-connector-python>=1.1.6 (from Marvin==4.6.0-SNAPSHOT), but installing
version 1.0.10
Downloading/unpacking requests>=2.2.1 (from Marvin==4.6.0-SNAPSHOT)
  Running setup.py egg_info for package requests
    
  Requested requests>=2.2.1 (from Marvin==4.6.0-SNAPSHOT), but installing version 1.2.3
Downloading/unpacking paramiko>=1.13.0 (from Marvin==4.6.0-SNAPSHOT)
  Running setup.py egg_info for package paramiko
    
  Requested paramiko>=1.13.0 (from Marvin==4.6.0-SNAPSHOT), but installing version 1.11.0
Downloading/unpacking nose>=1.3.3 (from Marvin==4.6.0-SNAPSHOT)
  Running setup.py egg_info for package nose
    
    no previously-included directories found matching 'doc/.build'
  Requested nose>=1.3.3 (from Marvin==4.6.0-SNAPSHOT), but installing version 1.3.0
Requirement already up-to-date: ddt>=0.4.0 in /usr/local/lib/python2.7/site-packages (from
Marvin==4.6.0-SNAPSHOT)
Requirement already up-to-date: pyvmomi>=5.5.0 in /usr/local/lib/python2.7/site-packages
(from Marvin==4.6.0-SNAPSHOT)
Requirement already up-to-date: netaddr>=0.7.14 in /usr/local/lib/python2.7/site-packages
(from Marvin==4.6.0-SNAPSHOT)
Downloading/unpacking pycrypto>=2.1,!=2.4 from https://pypi.python.org/packages/source/p/pycrypto/pycrypto-2.6.1.tar.gz#md5=55a61a054aa66812daf5161a0d5d7eda
(from paramiko>=1.13.0->Marvin==4.6.0-SNAPSHOT)
  Running setup.py egg_info for package pycrypto
    
Requirement already up-to-date: six>=1.7.3 in /usr/local/lib/python2.7/site-packages (from
pyvmomi>=5.5.0->Marvin==4.6.0-SNAPSHOT)
Installing collected packages: mysql-connector-python, requests, paramiko, nose, Marvin, pycrypto
  Found existing installation: mysql-connector-python 1.0.10
    Uninstalling mysql-connector-python:
      Successfully uninstalled mysql-connector-python
  Running setup.py install for mysql-connector-python
    
  Found existing installation: requests 1.2.3
    Uninstalling requests:
      Successfully uninstalled requests
  Running setup.py install for requests
    
  Found existing installation: paramiko 1.11.0
    Uninstalling paramiko:
      Successfully uninstalled paramiko
  Running setup.py install for paramiko
    
  Found existing installation: nose 1.3.0
    Uninstalling nose:
      Successfully uninstalled nose
  Running setup.py install for nose
    
    no previously-included directories found matching 'doc/.build'
    Installing nosetests script to /usr/local/bin
    Installing nosetests-2.7 script to /usr/local/bin
  Found existing installation: Marvin 4.6.0-SNAPSHOT
    Uninstalling Marvin:
      Successfully uninstalled Marvin
  Running setup.py install for Marvin
    
    warning: no files found matching '*.txt' under directory 'docs'
    Installing marvincli script to /usr/local/bin
  Found existing installation: pycrypto 2.6
    Uninstalling pycrypto:
      Successfully uninstalled pycrypto
  Running setup.py install for pycrypto
    warning: GMP or MPIR library not found; Not building Crypto.PublicKey._fastmath.
    
Successfully installed mysql-connector-python requests paramiko nose Marvin pycrypto
Cleaning up...
+ sleep 60
+ /usr/local/bin/nosetests-2.7 -v --with-marvin --marvin-config=setup/dev/advanced.cfg --with-xunit
--xunit-file=xunit.xml -a tags=advanced,required_hardware=false --zone=Sandbox-simulator --hypervisor=simulator
-w test/integration/smoke
/usr/local/lib/python2.7/site-packages/nose/plugins/manager.py:395: RuntimeWarning: Unable
to load plugin marvinPlugin = marvin.marvinPlugin:MarvinPlugin: (nose 1.3.0 (/usr/local/lib/python2.7/site-packages),
Requirement.parse('nose>=1.3.3'))
  RuntimeWarning)
Usage: nosetests-2.7 [options]

nosetests-2.7: error: no such option: --with-marvin
+ mvn -P systemvm,simulator -pl :cloud-client-ui jetty:stop
[INFO] Scanning for projects...
[INFO]                                                                         
[INFO] ------------------------------------------------------------------------
[INFO] Building Apache CloudStack Client UI 4.6.0-SNAPSHOT
[INFO] ------------------------------------------------------------------------
[INFO] 
[INFO] --- maven-jetty-plugin:6.1.26:stop (default-cli) @ cloud-client-ui ---
[INFO] ------------------------------------------------------------------------
[INFO] BUILD SUCCESS
[INFO] ------------------------------------------------------------------------
[INFO] Total time: 4.738s
[INFO] Finished at: Fri Apr 17 12:14:03 EDT 2015
[INFO] Final Memory: 26M/148M
[INFO] ------------------------------------------------------------------------
+ sleep 10
+ kill -KILL 891
/tmp/hudson4697941323495075048.sh: line 45: kill: (891) - No such process
+ rm -rf '*.log.*'
[locks-and-latches] Releasing all the locks
[locks-and-latches] All the locks released
[xUnit] [INFO] - Starting to record.
[xUnit] [INFO] - Processing JUnit
[xUnit] [INFO] - [JUnit] - 1 test report file(s) were found with the pattern 'xunit.xml' relative
to '<http://jenkins.buildacloud.org/job/simulator-singlerun/ws/'> for the testing framework
'JUnit'.
[xUnit] [ERROR] - The result file '<http://jenkins.buildacloud.org/job/simulator-singlerun/ws/xunit.xml'>
for the metric 'JUnit' is not valid. The result file has been skipped.
[xUnit] [INFO] - Failing BUILD because 'set build failed if errors' option is activated.
[xUnit] [INFO] - There are errors when processing test results.
[xUnit] [INFO] - Skipping tests recording.
[xUnit] [INFO] - Stop build.
Build step 'Publish xUnit test result report' changed build result to FAILURE

Mime
View raw message