cloudstack-dev mailing list archives

Site index · List index
Message view « Date » · « Thread »
Top « Date » · « Thread »
From jenk...@cloudstack.org
Subject Build failed in Jenkins: simulator-singlerun #1122
Date Fri, 17 Apr 2015 12:27:54 GMT
See <http://jenkins.buildacloud.org/job/simulator-singlerun/1122/>

------------------------------------------
[...truncated 10795 lines...]
    from marvin.lib.common import (get_domain,
  File "<http://jenkins.buildacloud.org/job/simulator-singlerun/ws/tools/marvin/marvin/lib/common.py",>
line 91, in <module>
    from marvin.lib.vcenter import Vcenter
  File "<http://jenkins.buildacloud.org/job/simulator-singlerun/ws/tools/marvin/marvin/lib/vcenter.py",>
line 22, in <module>
    ssl._create_default_https_context = ssl._create_unverified_context
AttributeError: 'module' object has no attribute '_create_unverified_context'
Traceback (most recent call last):
  File "<http://jenkins.buildacloud.org/job/simulator-singlerun/ws/test/integration/smoke/test_network_acl.py",>
line 25, in <module>
    from marvin.lib.common import *
  File "<http://jenkins.buildacloud.org/job/simulator-singlerun/ws/tools/marvin/marvin/lib/common.py",>
line 91, in <module>
    from marvin.lib.vcenter import Vcenter
  File "<http://jenkins.buildacloud.org/job/simulator-singlerun/ws/tools/marvin/marvin/lib/vcenter.py",>
line 22, in <module>
    ssl._create_default_https_context = ssl._create_unverified_context
AttributeError: 'module' object has no attribute '_create_unverified_context'
Traceback (most recent call last):
  File "<http://jenkins.buildacloud.org/job/simulator-singlerun/ws/test/integration/smoke/test_nic.py",>
line 24, in <module>
    from marvin.lib.common import (get_zone,
  File "<http://jenkins.buildacloud.org/job/simulator-singlerun/ws/tools/marvin/marvin/lib/common.py",>
line 91, in <module>
    from marvin.lib.vcenter import Vcenter
  File "<http://jenkins.buildacloud.org/job/simulator-singlerun/ws/tools/marvin/marvin/lib/vcenter.py",>
line 22, in <module>
    ssl._create_default_https_context = ssl._create_unverified_context
AttributeError: 'module' object has no attribute '_create_unverified_context'
Traceback (most recent call last):
  File "<http://jenkins.buildacloud.org/job/simulator-singlerun/ws/test/integration/smoke/test_nic_adapter_type.py",>
line 34, in <module>
    from marvin.lib.common import (get_domain,
  File "<http://jenkins.buildacloud.org/job/simulator-singlerun/ws/tools/marvin/marvin/lib/common.py",>
line 91, in <module>
    from marvin.lib.vcenter import Vcenter
  File "<http://jenkins.buildacloud.org/job/simulator-singlerun/ws/tools/marvin/marvin/lib/vcenter.py",>
line 22, in <module>
    ssl._create_default_https_context = ssl._create_unverified_context
AttributeError: 'module' object has no attribute '_create_unverified_context'
Traceback (most recent call last):
  File "<http://jenkins.buildacloud.org/job/simulator-singlerun/ws/test/integration/smoke/test_non_contigiousvlan.py",>
line 21, in <module>
    from marvin.lib.common import setNonContiguousVlanIds, get_zone
  File "<http://jenkins.buildacloud.org/job/simulator-singlerun/ws/tools/marvin/marvin/lib/common.py",>
line 91, in <module>
    from marvin.lib.vcenter import Vcenter
  File "<http://jenkins.buildacloud.org/job/simulator-singlerun/ws/tools/marvin/marvin/lib/vcenter.py",>
line 22, in <module>
    ssl._create_default_https_context = ssl._create_unverified_context
AttributeError: 'module' object has no attribute '_create_unverified_context'
Traceback (most recent call last):
  File "<http://jenkins.buildacloud.org/job/simulator-singlerun/ws/test/integration/smoke/test_over_provisioning.py",>
line 24, in <module>
    from marvin.lib.common import *
  File "<http://jenkins.buildacloud.org/job/simulator-singlerun/ws/tools/marvin/marvin/lib/common.py",>
line 91, in <module>
    from marvin.lib.vcenter import Vcenter
  File "<http://jenkins.buildacloud.org/job/simulator-singlerun/ws/tools/marvin/marvin/lib/vcenter.py",>
line 22, in <module>
    ssl._create_default_https_context = ssl._create_unverified_context
AttributeError: 'module' object has no attribute '_create_unverified_context'
Traceback (most recent call last):
  File "<http://jenkins.buildacloud.org/job/simulator-singlerun/ws/test/integration/smoke/test_portable_publicip.py",>
line 23, in <module>
    from marvin.lib.common import *
  File "<http://jenkins.buildacloud.org/job/simulator-singlerun/ws/tools/marvin/marvin/lib/common.py",>
line 91, in <module>
    from marvin.lib.vcenter import Vcenter
  File "<http://jenkins.buildacloud.org/job/simulator-singlerun/ws/tools/marvin/marvin/lib/vcenter.py",>
line 22, in <module>
    ssl._create_default_https_context = ssl._create_unverified_context
AttributeError: 'module' object has no attribute '_create_unverified_context'
Traceback (most recent call last):
  File "<http://jenkins.buildacloud.org/job/simulator-singlerun/ws/test/integration/smoke/test_primary_storage.py",>
line 25, in <module>
    from marvin.lib.common import *
  File "<http://jenkins.buildacloud.org/job/simulator-singlerun/ws/tools/marvin/marvin/lib/common.py",>
line 91, in <module>
    from marvin.lib.vcenter import Vcenter
  File "<http://jenkins.buildacloud.org/job/simulator-singlerun/ws/tools/marvin/marvin/lib/vcenter.py",>
line 22, in <module>
    ssl._create_default_https_context = ssl._create_unverified_context
AttributeError: 'module' object has no attribute '_create_unverified_context'
Traceback (most recent call last):
  File "<http://jenkins.buildacloud.org/job/simulator-singlerun/ws/test/integration/smoke/test_privategw_acl.py",>
line 24, in <module>
    from marvin.lib.common import *
  File "<http://jenkins.buildacloud.org/job/simulator-singlerun/ws/tools/marvin/marvin/lib/common.py",>
line 91, in <module>
    from marvin.lib.vcenter import Vcenter
  File "<http://jenkins.buildacloud.org/job/simulator-singlerun/ws/tools/marvin/marvin/lib/vcenter.py",>
line 22, in <module>
    ssl._create_default_https_context = ssl._create_unverified_context
AttributeError: 'module' object has no attribute '_create_unverified_context'
Traceback (most recent call last):
  File "<http://jenkins.buildacloud.org/job/simulator-singlerun/ws/test/integration/smoke/test_public_ip_range.py",>
line 26, in <module>
    from marvin.lib.common import *
  File "<http://jenkins.buildacloud.org/job/simulator-singlerun/ws/tools/marvin/marvin/lib/common.py",>
line 91, in <module>
    from marvin.lib.vcenter import Vcenter
  File "<http://jenkins.buildacloud.org/job/simulator-singlerun/ws/tools/marvin/marvin/lib/vcenter.py",>
line 22, in <module>
    ssl._create_default_https_context = ssl._create_unverified_context
AttributeError: 'module' object has no attribute '_create_unverified_context'
Traceback (most recent call last):
  File "<http://jenkins.buildacloud.org/job/simulator-singlerun/ws/test/integration/smoke/test_pvlan.py",>
line 26, in <module>
    from marvin.lib.common import *
  File "<http://jenkins.buildacloud.org/job/simulator-singlerun/ws/tools/marvin/marvin/lib/common.py",>
line 91, in <module>
    from marvin.lib.vcenter import Vcenter
  File "<http://jenkins.buildacloud.org/job/simulator-singlerun/ws/tools/marvin/marvin/lib/vcenter.py",>
line 22, in <module>
    ssl._create_default_https_context = ssl._create_unverified_context
AttributeError: 'module' object has no attribute '_create_unverified_context'
Traceback (most recent call last):
  File "<http://jenkins.buildacloud.org/job/simulator-singlerun/ws/test/integration/smoke/test_regions.py",>
line 22, in <module>
    from marvin.lib.common import *
  File "<http://jenkins.buildacloud.org/job/simulator-singlerun/ws/tools/marvin/marvin/lib/common.py",>
line 91, in <module>
    from marvin.lib.vcenter import Vcenter
  File "<http://jenkins.buildacloud.org/job/simulator-singlerun/ws/tools/marvin/marvin/lib/vcenter.py",>
line 22, in <module>
    ssl._create_default_https_context = ssl._create_unverified_context
AttributeError: 'module' object has no attribute '_create_unverified_context'
Traceback (most recent call last):
  File "<http://jenkins.buildacloud.org/job/simulator-singlerun/ws/test/integration/smoke/test_reset_vm_on_reboot.py",>
line 26, in <module>
    from marvin.lib.common import *
  File "<http://jenkins.buildacloud.org/job/simulator-singlerun/ws/tools/marvin/marvin/lib/common.py",>
line 91, in <module>
    from marvin.lib.vcenter import Vcenter
  File "<http://jenkins.buildacloud.org/job/simulator-singlerun/ws/tools/marvin/marvin/lib/vcenter.py",>
line 22, in <module>
    ssl._create_default_https_context = ssl._create_unverified_context
AttributeError: 'module' object has no attribute '_create_unverified_context'
Traceback (most recent call last):
  File "<http://jenkins.buildacloud.org/job/simulator-singlerun/ws/test/integration/smoke/test_resource_detail.py",>
line 26, in <module>
    from marvin.lib.common import *
  File "<http://jenkins.buildacloud.org/job/simulator-singlerun/ws/tools/marvin/marvin/lib/common.py",>
line 91, in <module>
    from marvin.lib.vcenter import Vcenter
  File "<http://jenkins.buildacloud.org/job/simulator-singlerun/ws/tools/marvin/marvin/lib/vcenter.py",>
line 22, in <module>
    ssl._create_default_https_context = ssl._create_unverified_context
AttributeError: 'module' object has no attribute '_create_unverified_context'
Traceback (most recent call last):
  File "<http://jenkins.buildacloud.org/job/simulator-singlerun/ws/test/integration/smoke/test_routers.py",>
line 32, in <module>
    from marvin.lib.common import (get_domain,
  File "<http://jenkins.buildacloud.org/job/simulator-singlerun/ws/tools/marvin/marvin/lib/common.py",>
line 91, in <module>
    from marvin.lib.vcenter import Vcenter
  File "<http://jenkins.buildacloud.org/job/simulator-singlerun/ws/tools/marvin/marvin/lib/vcenter.py",>
line 22, in <module>
    ssl._create_default_https_context = ssl._create_unverified_context
AttributeError: 'module' object has no attribute '_create_unverified_context'
Traceback (most recent call last):
  File "<http://jenkins.buildacloud.org/job/simulator-singlerun/ws/test/integration/smoke/test_scale_vm.py",>
line 27, in <module>
    from marvin.lib.common import (get_zone,
  File "<http://jenkins.buildacloud.org/job/simulator-singlerun/ws/tools/marvin/marvin/lib/common.py",>
line 91, in <module>
    from marvin.lib.vcenter import Vcenter
  File "<http://jenkins.buildacloud.org/job/simulator-singlerun/ws/tools/marvin/marvin/lib/vcenter.py",>
line 22, in <module>
    ssl._create_default_https_context = ssl._create_unverified_context
AttributeError: 'module' object has no attribute '_create_unverified_context'
Traceback (most recent call last):
  File "<http://jenkins.buildacloud.org/job/simulator-singlerun/ws/test/integration/smoke/test_secondary_storage.py",>
line 25, in <module>
    from marvin.lib.common import *
  File "<http://jenkins.buildacloud.org/job/simulator-singlerun/ws/tools/marvin/marvin/lib/common.py",>
line 91, in <module>
    from marvin.lib.vcenter import Vcenter
  File "<http://jenkins.buildacloud.org/job/simulator-singlerun/ws/tools/marvin/marvin/lib/vcenter.py",>
line 22, in <module>
    ssl._create_default_https_context = ssl._create_unverified_context
AttributeError: 'module' object has no attribute '_create_unverified_context'
Traceback (most recent call last):
  File "<http://jenkins.buildacloud.org/job/simulator-singlerun/ws/test/integration/smoke/test_service_offerings.py",>
line 30, in <module>
    from marvin.lib.common import (list_service_offering,
  File "<http://jenkins.buildacloud.org/job/simulator-singlerun/ws/tools/marvin/marvin/lib/common.py",>
line 91, in <module>
    from marvin.lib.vcenter import Vcenter
  File "<http://jenkins.buildacloud.org/job/simulator-singlerun/ws/tools/marvin/marvin/lib/vcenter.py",>
line 22, in <module>
    ssl._create_default_https_context = ssl._create_unverified_context
AttributeError: 'module' object has no attribute '_create_unverified_context'
Traceback (most recent call last):
  File "<http://jenkins.buildacloud.org/job/simulator-singlerun/ws/test/integration/smoke/test_snapshots.py",>
line 24, in <module>
    from marvin.lib.common import *
  File "<http://jenkins.buildacloud.org/job/simulator-singlerun/ws/tools/marvin/marvin/lib/common.py",>
line 91, in <module>
    from marvin.lib.vcenter import Vcenter
  File "<http://jenkins.buildacloud.org/job/simulator-singlerun/ws/tools/marvin/marvin/lib/vcenter.py",>
line 22, in <module>
    ssl._create_default_https_context = ssl._create_unverified_context
AttributeError: 'module' object has no attribute '_create_unverified_context'
Traceback (most recent call last):
  File "<http://jenkins.buildacloud.org/job/simulator-singlerun/ws/test/integration/smoke/test_ssvm.py",>
line 29, in <module>
    from marvin.lib.common import (get_zone,
  File "<http://jenkins.buildacloud.org/job/simulator-singlerun/ws/tools/marvin/marvin/lib/common.py",>
line 91, in <module>
    from marvin.lib.vcenter import Vcenter
  File "<http://jenkins.buildacloud.org/job/simulator-singlerun/ws/tools/marvin/marvin/lib/vcenter.py",>
line 22, in <module>
    ssl._create_default_https_context = ssl._create_unverified_context
AttributeError: 'module' object has no attribute '_create_unverified_context'
Traceback (most recent call last):
  File "<http://jenkins.buildacloud.org/job/simulator-singlerun/ws/test/integration/smoke/test_templates.py",>
line 30, in <module>
    from marvin.lib.common import (get_domain,
  File "<http://jenkins.buildacloud.org/job/simulator-singlerun/ws/tools/marvin/marvin/lib/common.py",>
line 91, in <module>
    from marvin.lib.vcenter import Vcenter
  File "<http://jenkins.buildacloud.org/job/simulator-singlerun/ws/tools/marvin/marvin/lib/vcenter.py",>
line 22, in <module>
    ssl._create_default_https_context = ssl._create_unverified_context
AttributeError: 'module' object has no attribute '_create_unverified_context'
Traceback (most recent call last):
  File "<http://jenkins.buildacloud.org/job/simulator-singlerun/ws/test/integration/smoke/test_usage_events.py",>
line 25, in <module>
    from marvin.lib.common import (get_domain,
  File "<http://jenkins.buildacloud.org/job/simulator-singlerun/ws/tools/marvin/marvin/lib/common.py",>
line 91, in <module>
    from marvin.lib.vcenter import Vcenter
  File "<http://jenkins.buildacloud.org/job/simulator-singlerun/ws/tools/marvin/marvin/lib/vcenter.py",>
line 22, in <module>
    ssl._create_default_https_context = ssl._create_unverified_context
AttributeError: 'module' object has no attribute '_create_unverified_context'
Traceback (most recent call last):
  File "<http://jenkins.buildacloud.org/job/simulator-singlerun/ws/test/integration/smoke/test_vm_life_cycle.py",>
line 34, in <module>
    from marvin.lib.common import (get_domain,
  File "<http://jenkins.buildacloud.org/job/simulator-singlerun/ws/tools/marvin/marvin/lib/common.py",>
line 91, in <module>
    from marvin.lib.vcenter import Vcenter
  File "<http://jenkins.buildacloud.org/job/simulator-singlerun/ws/tools/marvin/marvin/lib/vcenter.py",>
line 22, in <module>
    ssl._create_default_https_context = ssl._create_unverified_context
AttributeError: 'module' object has no attribute '_create_unverified_context'
Traceback (most recent call last):
  File "<http://jenkins.buildacloud.org/job/simulator-singlerun/ws/test/integration/smoke/test_vm_snapshots.py",>
line 29, in <module>
    from marvin.lib.common import (get_zone,
  File "<http://jenkins.buildacloud.org/job/simulator-singlerun/ws/tools/marvin/marvin/lib/common.py",>
line 91, in <module>
    from marvin.lib.vcenter import Vcenter
  File "<http://jenkins.buildacloud.org/job/simulator-singlerun/ws/tools/marvin/marvin/lib/vcenter.py",>
line 22, in <module>
    ssl._create_default_https_context = ssl._create_unverified_context
AttributeError: 'module' object has no attribute '_create_unverified_context'
Traceback (most recent call last):
  File "<http://jenkins.buildacloud.org/job/simulator-singlerun/ws/test/integration/smoke/test_volumes.py",>
line 35, in <module>
    from marvin.lib.common import (get_domain,
  File "<http://jenkins.buildacloud.org/job/simulator-singlerun/ws/tools/marvin/marvin/lib/common.py",>
line 91, in <module>
    from marvin.lib.vcenter import Vcenter
  File "<http://jenkins.buildacloud.org/job/simulator-singlerun/ws/tools/marvin/marvin/lib/vcenter.py",>
line 22, in <module>
    ssl._create_default_https_context = ssl._create_unverified_context
AttributeError: 'module' object has no attribute '_create_unverified_context'
Traceback (most recent call last):
  File "<http://jenkins.buildacloud.org/job/simulator-singlerun/ws/test/integration/smoke/test_vpc_vpn.py",>
line 25, in <module>
    from marvin.lib.common import *
  File "<http://jenkins.buildacloud.org/job/simulator-singlerun/ws/tools/marvin/marvin/lib/common.py",>
line 91, in <module>
    from marvin.lib.vcenter import Vcenter
  File "<http://jenkins.buildacloud.org/job/simulator-singlerun/ws/tools/marvin/marvin/lib/vcenter.py",>
line 22, in <module>
    ssl._create_default_https_context = ssl._create_unverified_context
AttributeError: 'module' object has no attribute '_create_unverified_context'

==== Marvin Init Started ====

=== Marvin Parse Config Successful ===

=== Marvin Setting TestData Successful===

==== Log Folder Path: /tmp//MarvinLogs//Apr_17_2015_08_29_00_QWLBD0. All logs will be available
here ====

=== Marvin Init Logging Successful===

==== Marvin Init Successful ====
===final results are now copied to: /tmp//MarvinLogs//6D7XYK===
+ mvn -P systemvm,simulator -pl :cloud-client-ui jetty:stop
[INFO] Scanning for projects...
[INFO]                                                                         
[INFO] ------------------------------------------------------------------------
[INFO] Building Apache CloudStack Client UI 4.6.0-SNAPSHOT
[INFO] ------------------------------------------------------------------------
[INFO] 
[INFO] --- maven-jetty-plugin:6.1.26:stop (default-cli) @ cloud-client-ui ---
[INFO] ------------------------------------------------------------------------
[INFO] BUILD SUCCESS
[INFO] ------------------------------------------------------------------------
[INFO] Total time: 4.094s
[INFO] Finished at: Fri Apr 17 08:29:24 EDT 2015
[INFO] Final Memory: 26M/109M
[INFO] ------------------------------------------------------------------------
+ sleep 10
+ kill -KILL 27080
/tmp/hudson6137202452052375597.sh: line 45: kill: (27080) - No such process
+ rm -rf '*.log.*'
[locks-and-latches] Releasing all the locks
[locks-and-latches] All the locks released
[xUnit] [INFO] - Starting to record.
[xUnit] [INFO] - Processing JUnit
[xUnit] [INFO] - [JUnit] - 1 test report file(s) were found with the pattern 'xunit.xml' relative
to '<http://jenkins.buildacloud.org/job/simulator-singlerun/ws/'> for the testing framework
'JUnit'.
[xUnit] [INFO] - Converting '<http://jenkins.buildacloud.org/job/simulator-singlerun/ws/xunit.xml'>
.
[xUnit] [INFO] - Check 'Failed Tests' threshold.
[xUnit] [INFO] - The total number of tests for this category exceeds the specified 'failure'
threshold value.
[xUnit] [INFO] - Setting the build status to FAILURE
[xUnit] [INFO] - Stopping recording.
Build step 'Publish xUnit test result report' changed build result to FAILURE

Mime
View raw message