cloudstack-dev mailing list archives

Site index · List index
Message view « Date » · « Thread »
Top « Date » · « Thread »
From jenk...@cloudstack.org
Subject Build failed in Jenkins: simulator-singlerun #1111
Date Wed, 15 Apr 2015 16:35:59 GMT
See <http://jenkins.buildacloud.org/job/simulator-singlerun/1111/changes>

Changes:

[marcus_sorensen] CLOUDSTACK-8387 - Don't autoclose new mgmt server peer connections as soon
as they open

[marcus_sorensen] CLOUDSTACK-8387 - Close mgmt server peer socket on failure, without relying
on autoclose

------------------------------------------
[...truncated 2049 lines...]
[INFO] Copying slf4j-api-1.7.7.jar to <http://jenkins.buildacloud.org/job/simulator-singlerun/ws/usage/target/dependencies/slf4j-api-1.7.7.jar>
[INFO] Copying spring-core-3.2.12.RELEASE.jar to <http://jenkins.buildacloud.org/job/simulator-singlerun/ws/usage/target/dependencies/spring-core-3.2.12.RELEASE.jar>
[INFO] Copying aws-java-sdk-cloudsearch-1.9.8.jar to <http://jenkins.buildacloud.org/job/simulator-singlerun/ws/usage/target/dependencies/aws-java-sdk-cloudsearch-1.9.8.jar>
[INFO] Copying trilead-ssh2-1.0.0-build217.jar to <http://jenkins.buildacloud.org/job/simulator-singlerun/ws/usage/target/dependencies/trilead-ssh2-1.0.0-build217.jar>
[INFO] Copying jackson-annotations-2.4.4.jar to <http://jenkins.buildacloud.org/job/simulator-singlerun/ws/usage/target/dependencies/jackson-annotations-2.4.4.jar>
[INFO] Copying log4j-1.2.17.jar to <http://jenkins.buildacloud.org/job/simulator-singlerun/ws/usage/target/dependencies/log4j-1.2.17.jar>
[INFO] Copying aws-java-sdk-1.9.8.jar to <http://jenkins.buildacloud.org/job/simulator-singlerun/ws/usage/target/dependencies/aws-java-sdk-1.9.8.jar>
[INFO] Copying commons-digester-1.8.jar to <http://jenkins.buildacloud.org/job/simulator-singlerun/ws/usage/target/dependencies/commons-digester-1.8.jar>
[INFO] Copying apache-log4j-extras-1.2.17.jar to <http://jenkins.buildacloud.org/job/simulator-singlerun/ws/usage/target/dependencies/apache-log4j-extras-1.2.17.jar>
[INFO] Copying activation-1.1.jar to <http://jenkins.buildacloud.org/job/simulator-singlerun/ws/usage/target/dependencies/activation-1.1.jar>
[INFO] Copying aws-java-sdk-cognitosync-1.9.8.jar to <http://jenkins.buildacloud.org/job/simulator-singlerun/ws/usage/target/dependencies/aws-java-sdk-cognitosync-1.9.8.jar>
[INFO] Copying commons-net-3.3.jar to <http://jenkins.buildacloud.org/job/simulator-singlerun/ws/usage/target/dependencies/commons-net-3.3.jar>
[INFO] Copying httpcore-4.3.3.jar to <http://jenkins.buildacloud.org/job/simulator-singlerun/ws/usage/target/dependencies/httpcore-4.3.3.jar>
[INFO] Copying xalan-2.7.1.jar to <http://jenkins.buildacloud.org/job/simulator-singlerun/ws/usage/target/dependencies/xalan-2.7.1.jar>
[INFO] Copying cloud-framework-events-4.6.0-SNAPSHOT.jar to <http://jenkins.buildacloud.org/job/simulator-singlerun/ws/usage/target/dependencies/cloud-framework-events-4.6.0-SNAPSHOT.jar>
[INFO] Copying aws-java-sdk-sns-1.9.8.jar to <http://jenkins.buildacloud.org/job/simulator-singlerun/ws/usage/target/dependencies/aws-java-sdk-sns-1.9.8.jar>
[INFO] Copying jetty-io-8.1.15.v20140411.jar to <http://jenkins.buildacloud.org/job/simulator-singlerun/ws/usage/target/dependencies/jetty-io-8.1.15.v20140411.jar>
[INFO] Copying aopalliance-1.0.jar to <http://jenkins.buildacloud.org/job/simulator-singlerun/ws/usage/target/dependencies/aopalliance-1.0.jar>
[INFO] Copying aws-java-sdk-glacier-1.9.8.jar to <http://jenkins.buildacloud.org/job/simulator-singlerun/ws/usage/target/dependencies/aws-java-sdk-glacier-1.9.8.jar>
[INFO] Copying jetty-util-8.1.15.v20140411.jar to <http://jenkins.buildacloud.org/job/simulator-singlerun/ws/usage/target/dependencies/jetty-util-8.1.15.v20140411.jar>
[INFO] Copying aws-java-sdk-cloudwatch-1.9.8.jar to <http://jenkins.buildacloud.org/job/simulator-singlerun/ws/usage/target/dependencies/aws-java-sdk-cloudwatch-1.9.8.jar>
[INFO] Copying bcprov-jdk16-1.46.jar to <http://jenkins.buildacloud.org/job/simulator-singlerun/ws/usage/target/dependencies/bcprov-jdk16-1.46.jar>
[INFO] Copying nekohtml-1.9.12.jar to <http://jenkins.buildacloud.org/job/simulator-singlerun/ws/usage/target/dependencies/nekohtml-1.9.12.jar>
[INFO] Copying aws-java-sdk-cloudfront-1.9.8.jar to <http://jenkins.buildacloud.org/job/simulator-singlerun/ws/usage/target/dependencies/aws-java-sdk-cloudfront-1.9.8.jar>
[INFO] Copying aws-java-sdk-kinesis-1.9.8.jar to <http://jenkins.buildacloud.org/job/simulator-singlerun/ws/usage/target/dependencies/aws-java-sdk-kinesis-1.9.8.jar>
[INFO] Copying batik-util-1.7.jar to <http://jenkins.buildacloud.org/job/simulator-singlerun/ws/usage/target/dependencies/batik-util-1.7.jar>
[INFO] Copying xml-resolver-1.2.jar to <http://jenkins.buildacloud.org/job/simulator-singlerun/ws/usage/target/dependencies/xml-resolver-1.2.jar>
[INFO] Copying aws-java-sdk-storagegateway-1.9.8.jar to <http://jenkins.buildacloud.org/job/simulator-singlerun/ws/usage/target/dependencies/aws-java-sdk-storagegateway-1.9.8.jar>
[INFO] Copying stax2-api-3.1.4.jar to <http://jenkins.buildacloud.org/job/simulator-singlerun/ws/usage/target/dependencies/stax2-api-3.1.4.jar>
[INFO] Copying commons-fileupload-1.2.jar to <http://jenkins.buildacloud.org/job/simulator-singlerun/ws/usage/target/dependencies/commons-fileupload-1.2.jar>
[INFO] Copying aws-java-sdk-simpleworkflow-1.9.8.jar to <http://jenkins.buildacloud.org/job/simulator-singlerun/ws/usage/target/dependencies/aws-java-sdk-simpleworkflow-1.9.8.jar>
[INFO] Copying spring-beans-3.2.12.RELEASE.jar to <http://jenkins.buildacloud.org/job/simulator-singlerun/ws/usage/target/dependencies/spring-beans-3.2.12.RELEASE.jar>
[INFO] Copying slf4j-log4j12-1.7.7.jar to <http://jenkins.buildacloud.org/job/simulator-singlerun/ws/usage/target/dependencies/slf4j-log4j12-1.7.7.jar>
[INFO] Copying serializer-2.7.1.jar to <http://jenkins.buildacloud.org/job/simulator-singlerun/ws/usage/target/dependencies/serializer-2.7.1.jar>
[INFO] Copying aws-java-sdk-directconnect-1.9.8.jar to <http://jenkins.buildacloud.org/job/simulator-singlerun/ws/usage/target/dependencies/aws-java-sdk-directconnect-1.9.8.jar>
[INFO] Copying commons-validator-1.4.0.jar to <http://jenkins.buildacloud.org/job/simulator-singlerun/ws/usage/target/dependencies/commons-validator-1.4.0.jar>
[INFO] Copying jsch-0.1.51.jar to <http://jenkins.buildacloud.org/job/simulator-singlerun/ws/usage/target/dependencies/jsch-0.1.51.jar>
[INFO] Copying bsh-core-2.0b4.jar to <http://jenkins.buildacloud.org/job/simulator-singlerun/ws/usage/target/dependencies/bsh-core-2.0b4.jar>
[INFO] Copying wsdl4j-1.6.3.jar to <http://jenkins.buildacloud.org/job/simulator-singlerun/ws/usage/target/dependencies/wsdl4j-1.6.3.jar>
[INFO] Copying aws-java-sdk-sqs-1.9.8.jar to <http://jenkins.buildacloud.org/job/simulator-singlerun/ws/usage/target/dependencies/aws-java-sdk-sqs-1.9.8.jar>
[INFO] Copying geronimo-servlet_3.0_spec-1.0.jar to <http://jenkins.buildacloud.org/job/simulator-singlerun/ws/usage/target/dependencies/geronimo-servlet_3.0_spec-1.0.jar>
[INFO] Copying commons-collections-3.2.1.jar to <http://jenkins.buildacloud.org/job/simulator-singlerun/ws/usage/target/dependencies/commons-collections-3.2.1.jar>
[INFO] Copying aws-java-sdk-swf-libraries-1.9.8.jar to <http://jenkins.buildacloud.org/job/simulator-singlerun/ws/usage/target/dependencies/aws-java-sdk-swf-libraries-1.9.8.jar>
[INFO] Copying commons-codec-1.10.jar to <http://jenkins.buildacloud.org/job/simulator-singlerun/ws/usage/target/dependencies/commons-codec-1.10.jar>
[INFO] Copying spring-expression-3.2.12.RELEASE.jar to <http://jenkins.buildacloud.org/job/simulator-singlerun/ws/usage/target/dependencies/spring-expression-3.2.12.RELEASE.jar>
[INFO] Copying aws-java-sdk-cognitoidentity-1.9.8.jar to <http://jenkins.buildacloud.org/job/simulator-singlerun/ws/usage/target/dependencies/aws-java-sdk-cognitoidentity-1.9.8.jar>
[INFO] Copying jackson-databind-2.4.4.jar to <http://jenkins.buildacloud.org/job/simulator-singlerun/ws/usage/target/dependencies/jackson-databind-2.4.4.jar>
[INFO] Copying esapi-2.1.0.jar to <http://jenkins.buildacloud.org/job/simulator-singlerun/ws/usage/target/dependencies/esapi-2.1.0.jar>
[INFO] Copying jasypt-1.9.2.jar to <http://jenkins.buildacloud.org/job/simulator-singlerun/ws/usage/target/dependencies/jasypt-1.9.2.jar>
[INFO] Copying cloud-framework-security-4.6.0-SNAPSHOT.jar to <http://jenkins.buildacloud.org/job/simulator-singlerun/ws/usage/target/dependencies/cloud-framework-security-4.6.0-SNAPSHOT.jar>
[INFO] Copying javax.inject-1.jar to <http://jenkins.buildacloud.org/job/simulator-singlerun/ws/usage/target/dependencies/javax.inject-1.jar>
[INFO] Copying aws-java-sdk-simpledb-1.9.8.jar to <http://jenkins.buildacloud.org/job/simulator-singlerun/ws/usage/target/dependencies/aws-java-sdk-simpledb-1.9.8.jar>
[INFO] Copying joda-time-2.2.jar to <http://jenkins.buildacloud.org/job/simulator-singlerun/ws/usage/target/dependencies/joda-time-2.2.jar>
[INFO] Copying aws-java-sdk-redshift-1.9.8.jar to <http://jenkins.buildacloud.org/job/simulator-singlerun/ws/usage/target/dependencies/aws-java-sdk-redshift-1.9.8.jar>
[INFO] Copying aws-java-sdk-ec2-1.9.8.jar to <http://jenkins.buildacloud.org/job/simulator-singlerun/ws/usage/target/dependencies/aws-java-sdk-ec2-1.9.8.jar>
[INFO] Copying commons-pool-1.6.jar to <http://jenkins.buildacloud.org/job/simulator-singlerun/ws/usage/target/dependencies/commons-pool-1.6.jar>
[INFO] Copying aws-java-sdk-iam-1.9.8.jar to <http://jenkins.buildacloud.org/job/simulator-singlerun/ws/usage/target/dependencies/aws-java-sdk-iam-1.9.8.jar>
[INFO] Copying jackson-core-2.4.4.jar to <http://jenkins.buildacloud.org/job/simulator-singlerun/ws/usage/target/dependencies/jackson-core-2.4.4.jar>
[INFO] Copying gson-1.7.2.jar to <http://jenkins.buildacloud.org/job/simulator-singlerun/ws/usage/target/dependencies/gson-1.7.2.jar>
[INFO] Copying javax.ws.rs-api-2.0-m10.jar to <http://jenkins.buildacloud.org/job/simulator-singlerun/ws/usage/target/dependencies/javax.ws.rs-api-2.0-m10.jar>
[INFO] Copying cloud-framework-db-4.6.0-SNAPSHOT.jar to <http://jenkins.buildacloud.org/job/simulator-singlerun/ws/usage/target/dependencies/cloud-framework-db-4.6.0-SNAPSHOT.jar>
[INFO] Copying cloud-engine-components-api-4.6.0-SNAPSHOT.jar to <http://jenkins.buildacloud.org/job/simulator-singlerun/ws/usage/target/dependencies/cloud-engine-components-api-4.6.0-SNAPSHOT.jar>
[INFO] Copying aspectjweaver-1.8.4.jar to <http://jenkins.buildacloud.org/job/simulator-singlerun/ws/usage/target/dependencies/aspectjweaver-1.8.4.jar>
[INFO] Copying aws-java-sdk-route53-1.9.8.jar to <http://jenkins.buildacloud.org/job/simulator-singlerun/ws/usage/target/dependencies/aws-java-sdk-route53-1.9.8.jar>
[INFO] Copying jetty-continuation-8.1.15.v20140411.jar to <http://jenkins.buildacloud.org/job/simulator-singlerun/ws/usage/target/dependencies/jetty-continuation-8.1.15.v20140411.jar>
[INFO] Copying powermock-core-1.5.3.jar to <http://jenkins.buildacloud.org/job/simulator-singlerun/ws/usage/target/dependencies/powermock-core-1.5.3.jar>
[INFO] Copying bcprov-jdk15-1.46.jar to <http://jenkins.buildacloud.org/job/simulator-singlerun/ws/usage/target/dependencies/bcprov-jdk15-1.46.jar>
[INFO] Copying aws-java-sdk-datapipeline-1.9.8.jar to <http://jenkins.buildacloud.org/job/simulator-singlerun/ws/usage/target/dependencies/aws-java-sdk-datapipeline-1.9.8.jar>
[INFO] Copying velocity-1.7.jar to <http://jenkins.buildacloud.org/job/simulator-singlerun/ws/usage/target/dependencies/velocity-1.7.jar>
[INFO] Copying not-yet-commons-ssl-0.3.9.jar to <http://jenkins.buildacloud.org/job/simulator-singlerun/ws/usage/target/dependencies/not-yet-commons-ssl-0.3.9.jar>
[INFO] 
[INFO] --- maven-install-plugin:2.3.1:install (default-install) @ cloud-usage ---
[INFO] Installing <http://jenkins.buildacloud.org/job/simulator-singlerun/ws/usage/target/cloud-usage-4.6.0-SNAPSHOT.jar>
to /var/lib/jenkins/.m2/repository/org/apache/cloudstack/cloud-usage/4.6.0-SNAPSHOT/cloud-usage-4.6.0-SNAPSHOT.jar
[INFO] Installing <http://jenkins.buildacloud.org/job/simulator-singlerun/ws/usage/pom.xml>
to /var/lib/jenkins/.m2/repository/org/apache/cloudstack/cloud-usage/4.6.0-SNAPSHOT/cloud-usage-4.6.0-SNAPSHOT.pom
[INFO]                                                                         
[INFO] ------------------------------------------------------------------------
[INFO] Building Apache CloudStack Cloud Engine Orchestration Component 4.6.0-SNAPSHOT
[INFO] ------------------------------------------------------------------------
[INFO] 
[INFO] --- maven-clean-plugin:2.5:clean (default-clean) @ cloud-engine-orchestration ---
[INFO] Deleting <http://jenkins.buildacloud.org/job/simulator-singlerun/ws/engine/orchestration/target>
(includes = [**/*], excludes = [])
[INFO] Deleting <http://jenkins.buildacloud.org/job/simulator-singlerun/ws/engine/orchestration>
(includes = [target, dist], excludes = [])
[INFO] 
[INFO] --- maven-checkstyle-plugin:2.11:check (cloudstack-checkstyle) @ cloud-engine-orchestration
---
[INFO] Starting audit...
Audit done.

[INFO] 
[INFO] --- maven-remote-resources-plugin:1.3:process (default) @ cloud-engine-orchestration
---
[INFO] 
[INFO] --- maven-resources-plugin:2.5:resources (default-resources) @ cloud-engine-orchestration
---
[debug] execute contextualize
[INFO] Using 'UTF-8' encoding to copy filtered resources.
[INFO] Copying 1 resource
[INFO] Copying 3 resources
[INFO] 
[INFO] --- maven-compiler-plugin:3.2:compile (default-compile) @ cloud-engine-orchestration
---
[INFO] Changes detected - recompiling the module!
[INFO] Compiling 68 source files to <http://jenkins.buildacloud.org/job/simulator-singlerun/ws/engine/orchestration/target/classes>
[INFO] -------------------------------------------------------------
[ERROR] COMPILATION ERROR : 
[INFO] -------------------------------------------------------------
[ERROR] <http://jenkins.buildacloud.org/job/simulator-singlerun/ws/engine/orchestration/src/com/cloud/agent/manager/ClusteredAgentManagerImpl.java>:[527,24]
error: variable ch1 might not have been initialized
[INFO] 1 error
[INFO] -------------------------------------------------------------
[INFO] ------------------------------------------------------------------------
[INFO] Reactor Summary:
[INFO] 
[INFO] Apache CloudStack Developer Tools - Checkstyle Configuration  SUCCESS [2.971s]
[INFO] Apache CloudStack ................................. SUCCESS [2.261s]
[INFO] Apache CloudStack Maven Conventions Parent ........ SUCCESS [1.336s]
[INFO] Apache CloudStack Framework - Managed Context ..... SUCCESS [5.300s]
[INFO] Apache CloudStack Utils ........................... SUCCESS [31.451s]
[INFO] Apache CloudStack Framework ....................... SUCCESS [0.062s]
[INFO] Apache CloudStack Framework - Event Notification .. SUCCESS [10.273s]
[INFO] Apache CloudStack Framework - Configuration ....... SUCCESS [5.594s]
[INFO] Apache CloudStack API ............................. SUCCESS [23.478s]
[INFO] Apache CloudStack Framework - REST ................ SUCCESS [3.510s]
[INFO] Apache CloudStack Framework - IPC ................. SUCCESS [5.918s]
[INFO] Apache CloudStack Cloud Engine .................... SUCCESS [0.055s]
[INFO] Apache CloudStack Cloud Engine API ................ SUCCESS [6.895s]
[INFO] Apache CloudStack Framework - Security ............ SUCCESS [2.703s]
[INFO] Apache CloudStack Core ............................ SUCCESS [29.902s]
[INFO] Apache CloudStack Agents .......................... SUCCESS [9.286s]
[INFO] Apache CloudStack Framework - Clustering .......... SUCCESS [3.915s]
[INFO] Apache CloudStack Framework - Event Notification .. SUCCESS [2.463s]
[INFO] Apache CloudStack Cloud Engine Schema Component ... SUCCESS [19.490s]
[INFO] Apache CloudStack Framework - Jobs ................ SUCCESS [6.735s]
[INFO] Apache CloudStack Cloud Engine Internal Components API  SUCCESS [4.089s]
[INFO] Apache CloudStack Server .......................... SUCCESS [1:02.045s]
[INFO] Apache CloudStack Usage Server .................... SUCCESS [9.934s]
[INFO] Apache CloudStack Cloud Engine Orchestration Component  FAILURE [8.969s]
[INFO] Apache CloudStack Cloud Services .................. SKIPPED
[INFO] Apache CloudStack Secondary Storage ............... SKIPPED
[INFO] Apache CloudStack Secondary Storage Service ....... SKIPPED
[INFO] Apache CloudStack Engine Storage Component ........ SKIPPED
[INFO] Apache CloudStack Engine Storage Volume Component . SKIPPED
[INFO] Apache CloudStack Engine Storage Image Component .. SKIPPED
[INFO] Apache CloudStack Engine Storage Data Motion Component  SKIPPED
[INFO] Apache CloudStack Engine Storage Cache Component .. SKIPPED
[INFO] Apache CloudStack Engine Storage Snapshot Component  SKIPPED
[INFO] Apache CloudStack Cloud Engine API ................ SKIPPED
[INFO] Apache CloudStack Cloud Engine Service ............ SKIPPED
[INFO] Apache CloudStack Plugin POM ...................... SKIPPED
[INFO] Apache CloudStack Plugin - API Rate Limit ......... SKIPPED
[INFO] Apache CloudStack Plugin - Storage Volume default provider  SKIPPED
[INFO] Apache CloudStack Plugin - Storage Volume SolidFire Provider  SKIPPED
[INFO] Apache CloudStack Plugin - API SolidFire .......... SKIPPED
[INFO] Apache CloudStack Plugin - API Discovery .......... SKIPPED
[INFO] Apache CloudStack Plugin - ACL Static Role Based .. SKIPPED
[INFO] Apache CloudStack Plugin - Host Anti-Affinity Processor  SKIPPED
[INFO] Apache CloudStack Plugin - Explicit Dedication Processor  SKIPPED
[INFO] Apache CloudStack Plugin - User Concentrated Pod Deployment Planner  SKIPPED
[INFO] Apache CloudStack Plugin - User Dispersing Deployment Planner  SKIPPED
[INFO] Apache CloudStack Plugin - Implicit Dedication Planner  SKIPPED
[INFO] Apache CloudStack Plugin - Skip Heurestics Planner  SKIPPED
[INFO] Apache CloudStack Plugin - Host Allocator Random .. SKIPPED
[INFO] Apache CloudStack Plugin - Dedicated Resources .... SKIPPED
[INFO] Apache CloudStack Plugin - Hypervisor OracleVM .... SKIPPED
[INFO] Apache CloudStack Plugin - Open vSwitch ........... SKIPPED
[INFO] Apache CloudStack Plugin - Hypervisor XenServer ... SKIPPED
[INFO] Apache CloudStack Plugin - Hypervisor KVM ......... SKIPPED
[INFO] Apache CloudStack Plugin - RabbitMQ Event Bus ..... SKIPPED
[INFO] Apache CloudStack Plugin - In Memory Event Bus .... SKIPPED
[INFO] Apache CloudStack Plugin - Kafka Event Bus ........ SKIPPED
[INFO] Apache CloudStack Plugin - Hypervisor Baremetal ... SKIPPED
[INFO] Apache CloudStack Plugin - Hypervisor UCS ......... SKIPPED
[INFO] Apache CloudStack Plugin - Hypervisor Hyper-V ..... SKIPPED
[INFO] Apache CloudStack Plugin - Hypervisor OracleVM3 ... SKIPPED
[INFO] Apache CloudStack Plugin - Network Elastic Load Balancer  SKIPPED
[INFO] Apache CloudStack Plugin - Network Internal Load Balancer  SKIPPED
[INFO] Apache CloudStack Framework - Spring Life Cycle ... SKIPPED
[INFO] Apache CloudStack Plugin - Network Juniper Contrail  SKIPPED
[INFO] Apache CloudStack Plugin - Palo Alto .............. SKIPPED
[INFO] Apache CloudStack Plugin - Network Netscaler ...... SKIPPED
[INFO] Apache CloudStack Plugin - Network Nicira NVP ..... SKIPPED
[INFO] Apache CloudStack Plugin - BigSwitch Virtual Network Segment  SKIPPED
[INFO] Apache CloudStack Plugin - Network Brocade VCS .... SKIPPED
[INFO] Apache CloudStack Plugin - Midokura Midonet ....... SKIPPED
[INFO] Apache CloudStack Plugin - Stratosphere SSP ....... SKIPPED
[INFO] Apache CloudStack Plugin - Network Opendaylight ... SKIPPED
[INFO] Apache CloudStack Plugin - Storage Allocator Random  SKIPPED
[INFO] Apache CloudStack Plugin - User Authenticator LDAP  SKIPPED
[INFO] Apache CloudStack Plugin - User Authenticator MD5 . SKIPPED
[INFO] Apache CloudStack Plugin - User Authenticator PBKDF2-SHA-256  SKIPPED
[INFO] Apache CloudStack Plugin - User Authenticator Plain Text  SKIPPED
[INFO] Apache CloudStack Plugin - User Authenticator SAML2  SKIPPED
[INFO] Apache CloudStack Plugin - User Authenticator SHA256 Salted  SKIPPED
[INFO] Apache CloudStack Plugin - Dns Notifier Example ... SKIPPED
[INFO] Apache CloudStack Plugin - Storage Image S3 ....... SKIPPED
[INFO] Apache CloudStack Plugin - Storage Image Swift provider  SKIPPED
[INFO] Apache CloudStack Plugin - Storage Image default provider  SKIPPED
[INFO] Apache CloudStack Plugin - Storage Image sample provider  SKIPPED
[INFO] Apache CloudStack Plugin - Storage Volume Nexenta Provider  SKIPPED
[INFO] Apache CloudStack Plugin - Storage Volume CloudByte Provider  SKIPPED
[INFO] Apache CloudStack Plugin - Storage Volume sample provider  SKIPPED
[INFO] Apache CloudStack Plugin - SNMP Alerts ............ SKIPPED
[INFO] Apache CloudStack Plugin - Syslog Alerts .......... SKIPPED
[INFO] Apache CloudStack Plugin - Network VXLAN .......... SKIPPED
[INFO] Apache CloudStack Plugin - GloboDNS ............... SKIPPED
[INFO] Apache CloudStack Plugin - Hypervisor Simulator ... SKIPPED
[INFO] Apache CloudStack Framework - Spring Module ....... SKIPPED
[INFO] Apache CloudStack Secondary Storage Controller .... SKIPPED
[INFO] Apache CloudStack Console Proxy - RDP Client ...... SKIPPED
[INFO] Apache CloudStack Console Proxy ................... SKIPPED
[INFO] Apache CloudStack Console Proxy - Server .......... SKIPPED
[INFO] Apache CloudStack System VM ....................... SKIPPED
[INFO] Apache CloudStack Client UI ....................... SKIPPED
[INFO] Apache CloudStack Framework - QuickCloud .......... SKIPPED
[INFO] Apache CloudStack Test ............................ SKIPPED
[INFO] Apache CloudStack Developer Mode .................. SKIPPED
[INFO] Apache CloudStack Developer Tools ................. SKIPPED
[INFO] Apache CloudStack apidocs ......................... SKIPPED
[INFO] Apache CloudStack marvin .......................... SKIPPED
[INFO] Apache CloudStack DevCloud ........................ SKIPPED
[INFO] Apache CloudStack DevCloud4 ....................... SKIPPED
[INFO] Apache CloudStack DevCloud-KVM .................... SKIPPED
[INFO] ------------------------------------------------------------------------
[INFO] BUILD FAILURE
[INFO] ------------------------------------------------------------------------
[INFO] Total time: 4:22.532s
[INFO] Finished at: Wed Apr 15 12:37:39 EDT 2015
[INFO] Final Memory: 61M/407M
[INFO] ------------------------------------------------------------------------
[ERROR] Failed to execute goal org.apache.maven.plugins:maven-compiler-plugin:3.2:compile
(default-compile) on project cloud-engine-orchestration: Compilation failure
[ERROR] <http://jenkins.buildacloud.org/job/simulator-singlerun/ws/engine/orchestration/src/com/cloud/agent/manager/ClusteredAgentManagerImpl.java>:[527,24]
error: variable ch1 might not have been initialized
[ERROR] -> [Help 1]
[ERROR] 
[ERROR] To see the full stack trace of the errors, re-run Maven with the -e switch.
[ERROR] Re-run Maven using the -X switch to enable full debug logging.
[ERROR] 
[ERROR] For more information about the errors and possible solutions, please read the following
articles:
[ERROR] [Help 1] http://cwiki.apache.org/confluence/display/MAVEN/MojoFailureException
[ERROR] 
[ERROR] After correcting the problems, you can resume the build with the command
[ERROR]   mvn <goals> -rf :cloud-engine-orchestration
Build step 'Invoke top-level Maven targets' marked build as failure
[locks-and-latches] Releasing all the locks
[locks-and-latches] All the locks released
[xUnit] [INFO] - Starting to record.
[xUnit] [INFO] - Processing JUnit
[xUnit] [INFO] - [JUnit] - 1 test report file(s) were found with the pattern 'xunit.xml' relative
to '<http://jenkins.buildacloud.org/job/simulator-singlerun/ws/'> for the testing framework
'JUnit'.
[xUnit] [ERROR] - Test reports were found but not all of them are new. Did all the tests run?
  * <http://jenkins.buildacloud.org/job/simulator-singlerun/ws/xunit.xml> is 3 hr 53
min old

[xUnit] [INFO] - Failing BUILD.
[xUnit] [INFO] - There are errors when processing test results.
[xUnit] [INFO] - Skipping tests recording.
[xUnit] [INFO] - Stop build.

Mime
View raw message