cloudstack-dev mailing list archives

Site index · List index
Message view « Date » · « Thread »
Top « Date » · « Thread »
From jenk...@cloudstack.org
Subject Build failed in Jenkins: simulator-4.5-singlerun #210
Date Sun, 19 Apr 2015 08:39:48 GMT
See <http://jenkins.buildacloud.org/job/simulator-4.5-singlerun/210/changes>

Changes:

[milamber] Closed typo issue (from Transifex  by Atalanttore)

------------------------------------------
[...truncated 8976 lines...]
deleteVpnCustomerGateway.xml
updateServiceOffering.xml
activateProject.xml
listVPCs.xml
listNiciraNvpDevices.xml
listClusters.xml
deleteSnapshotPolicies.xml
deleteDomain.xml
deleteNetworkACL.xml
listDeploymentPlanners.xml
listVpnConnections.xml
deleteServiceOffering.xml
deleteStorageNetworkIpRange.xml
rebootVirtualMachine.xml
deleteNetworkOffering.xml
suspendProject.xml
createInstanceGroup.xml
releaseDedicatedGuestVlanRange.xml
dedicatePublicIpRange.xml
createSSHKeyPair.xml
listPrivateGateways.xml
disableAccount.xml
listProjectAccounts.xml
getCloudIdentifier.xml
updateVpnCustomerGateway.xml
deleteTrafficMonitor.xml
deleteNetworkACLList.xml
createPhysicalNetwork.xml
configurePaloAltoFirewall.xml
addResourceDetail.xml
enableAutoScaleVmGroup.xml
updateVpnConnection.xml
listEvents.xml
updateSnapshotPolicy.xml
listGuestOsMapping.xml
startSystemVm.xml
deleteEgressFirewallRule.xml
deleteCondition.xml
getVMPassword.xml
listVolumes.xml
listStorageNetworkIpRange.xml
listUcsManagers.xml
generateUsageRecords.xml
updateProjectInvitation.xml
destroySystemVm.xml
listVpnUsers.xml
addBrocadeVcsDevice.xml
detachIso.xml
removeGuestOsMapping.xml
createEgressFirewallRule.xml
listBaremetalPxeServers.xml
deleteCounter.xml
getSolidFireVolumeAccessGroupId.xml
createLBStickinessPolicy.xml
updatePhysicalNetwork.xml
listAutoScaleVmProfiles.xml
createStorageNetworkIpRange.xml
addStratosphereSsp.xml
deleteVlanIpRange.xml
addNiciraNvpDevice.xml
replaceNetworkACLList.xml
cancelHostMaintenance.xml
listStoragePools.xml
listUcsProfiles.xml
listTemplates.xml
[INFO] 
[INFO] --- maven-site-plugin:3.3:attach-descriptor (attach-descriptor) @ cloud-apidoc ---
[INFO] 
[INFO] --- exec-maven-plugin:1.2.1:exec (package) @ cloud-apidoc ---
[INFO] 
[INFO] --- maven-install-plugin:2.3.1:install (default-install) @ cloud-apidoc ---
[INFO] Installing <http://jenkins.buildacloud.org/job/simulator-4.5-singlerun/ws/tools/apidoc/pom.xml>
to /var/lib/jenkins/.m2/repository/org/apache/cloudstack/cloud-apidoc/4.5.1-SNAPSHOT/cloud-apidoc-4.5.1-SNAPSHOT.pom
[INFO]                                                                         
[INFO] ------------------------------------------------------------------------
[INFO] Building Apache CloudStack marvin 4.5.1-SNAPSHOT
[INFO] ------------------------------------------------------------------------
[INFO] 
[INFO] --- maven-clean-plugin:2.5:clean (default-clean) @ cloud-marvin ---
[INFO] Deleting <http://jenkins.buildacloud.org/job/simulator-4.5-singlerun/ws/tools/marvin/target>
(includes = [**/*], excludes = [])
[INFO] Deleting <http://jenkins.buildacloud.org/job/simulator-4.5-singlerun/ws/tools/marvin/dist>
(includes = [**/*], excludes = [])
[INFO] Deleting <http://jenkins.buildacloud.org/job/simulator-4.5-singlerun/ws/tools/marvin>
(includes = [target, dist], excludes = [])
[INFO] 
[INFO] --- maven-antrun-plugin:1.7:run (clean) @ cloud-marvin ---
[INFO] Executing tasks

main:
   [delete] Deleting directory <http://jenkins.buildacloud.org/job/simulator-4.5-singlerun/ws/tools/marvin/marvin/cloudstackAPI>
     [echo] Deleting cloud-marvin API sources
[INFO] Executed tasks
[INFO] 
[INFO] --- maven-checkstyle-plugin:2.11:check (cloudstack-checkstyle) @ cloud-marvin ---
[INFO] Starting audit...
Audit done.

[INFO] 
[INFO] --- exec-maven-plugin:1.2.1:exec (generate-sources) @ cloud-marvin ---
Traceback (most recent call last):
  File "codegenerator.py", line 24, in <module>
    import urllib2
  File "/usr/local/lib/python2.7/urllib2.py", line 94, in <module>
    import httplib
  File "/usr/local/lib/python2.7/httplib.py", line 79, in <module>
    import mimetools
  File "/usr/local/lib/python2.7/mimetools.py", line 6, in <module>
    import tempfile
  File "/usr/local/lib/python2.7/tempfile.py", line 35, in <module>
    from random import Random as _Random
  File "/usr/local/lib/python2.7/random.py", line 47, in <module>
    from os import urandom as _urandom
ImportError: cannot import name urandom
[INFO] ------------------------------------------------------------------------
[INFO] Reactor Summary:
[INFO] 
[INFO] Apache CloudStack Developer Tools - Checkstyle Configuration  SUCCESS [2.221s]
[INFO] Apache CloudStack ................................. SUCCESS [2.708s]
[INFO] Apache CloudStack Maven Conventions Parent ........ SUCCESS [1.341s]
[INFO] Apache CloudStack Framework - Managed Context ..... SUCCESS [5.800s]
[INFO] Apache CloudStack Utils ........................... SUCCESS [29.925s]
[INFO] Apache CloudStack Framework ....................... SUCCESS [0.070s]
[INFO] Apache CloudStack Framework - Event Notification .. SUCCESS [9.991s]
[INFO] Apache CloudStack Framework - Configuration ....... SUCCESS [5.495s]
[INFO] Apache CloudStack API ............................. SUCCESS [21.932s]
[INFO] Apache CloudStack Framework - REST ................ SUCCESS [3.654s]
[INFO] Apache CloudStack Framework - IPC ................. SUCCESS [5.257s]
[INFO] Apache CloudStack Cloud Engine .................... SUCCESS [0.052s]
[INFO] Apache CloudStack Cloud Engine API ................ SUCCESS [6.196s]
[INFO] Apache CloudStack Framework - Security ............ SUCCESS [3.301s]
[INFO] Apache CloudStack Core ............................ SUCCESS [37.457s]
[INFO] Apache CloudStack Agents .......................... SUCCESS [10.612s]
[INFO] Apache CloudStack Framework - Clustering .......... SUCCESS [3.945s]
[INFO] Apache CloudStack Framework - Event Notification .. SUCCESS [2.465s]
[INFO] Apache CloudStack Cloud Engine Schema Component ... SUCCESS [19.540s]
[INFO] Apache CloudStack Framework - Jobs ................ SUCCESS [8.096s]
[INFO] Apache CloudStack Cloud Engine Internal Components API  SUCCESS [4.474s]
[INFO] Apache CloudStack Server .......................... SUCCESS [1:02.799s]
[INFO] Apache CloudStack Usage Server .................... SUCCESS [9.996s]
[INFO] Apache CloudStack Cloud Engine Orchestration Component  SUCCESS [11.901s]
[INFO] Apache CloudStack Cloud Services .................. SUCCESS [0.052s]
[INFO] Apache CloudStack Secondary Storage ............... SUCCESS [0.694s]
[INFO] Apache CloudStack Secondary Storage Service ....... SUCCESS [6.520s]
[INFO] Apache CloudStack Engine Storage Component ........ SUCCESS [9.118s]
[INFO] Apache CloudStack Engine Storage Volume Component . SUCCESS [5.611s]
[INFO] Apache CloudStack Engine Storage Image Component .. SUCCESS [3.475s]
[INFO] Apache CloudStack Engine Storage Data Motion Component  SUCCESS [3.524s]
[INFO] Apache CloudStack Engine Storage Cache Component .. SUCCESS [3.206s]
[INFO] Apache CloudStack Engine Storage Snapshot Component  SUCCESS [9.320s]
[INFO] Apache CloudStack Cloud Engine API ................ SUCCESS [2.626s]
[INFO] Apache CloudStack Cloud Engine Service ............ SUCCESS [6.193s]
[INFO] Apache CloudStack Plugin POM ...................... SUCCESS [0.437s]
[INFO] Apache CloudStack Plugin - API Rate Limit ......... SUCCESS [8.506s]
[INFO] Apache CloudStack Plugin - Storage Volume default provider  SUCCESS [2.825s]
[INFO] Apache CloudStack Plugin - Storage Volume SolidFire Provider  SUCCESS [6.803s]
[INFO] Apache CloudStack Plugin - API SolidFire .......... SUCCESS [3.546s]
[INFO] Apache CloudStack Plugin - API Discovery .......... SUCCESS [5.497s]
[INFO] Apache CloudStack Plugin - ACL Static Role Based .. SUCCESS [2.890s]
[INFO] Apache CloudStack Plugin - Host Anti-Affinity Processor  SUCCESS [2.968s]
[INFO] Apache CloudStack Plugin - Explicit Dedication Processor  SUCCESS [3.113s]
[INFO] Apache CloudStack Plugin - User Concentrated Pod Deployment Planner  SUCCESS [2.721s]
[INFO] Apache CloudStack Plugin - User Dispersing Deployment Planner  SUCCESS [2.883s]
[INFO] Apache CloudStack Plugin - Implicit Dedication Planner  SUCCESS [9.934s]
[INFO] Apache CloudStack Plugin - Skip Heurestics Planner  SUCCESS [2.877s]
[INFO] Apache CloudStack Plugin - Host Allocator Random .. SUCCESS [2.742s]
[INFO] Apache CloudStack Plugin - Dedicated Resources .... SUCCESS [8.325s]
[INFO] Apache CloudStack Plugin - Hypervisor OracleVM .... SUCCESS [4.554s]
[INFO] Apache CloudStack Plugin - Open vSwitch ........... SUCCESS [4.738s]
[INFO] Apache CloudStack Plugin - Hypervisor XenServer ... SUCCESS [12.576s]
[INFO] Apache CloudStack Plugin - Hypervisor KVM ......... SUCCESS [12.641s]
[INFO] Apache CloudStack Plugin - RabbitMQ Event Bus ..... SUCCESS [3.330s]
[INFO] Apache CloudStack Plugin - In Memory Event Bus .... SUCCESS [5.380s]
[INFO] Apache CloudStack Plugin - Hypervisor Baremetal ... SUCCESS [6.250s]
[INFO] Apache CloudStack Plugin - Hypervisor UCS ......... SUCCESS [3.512s]
[INFO] Apache CloudStack Plugin - Hypervisor Hyper-V ..... SUCCESS [7.814s]
[INFO] Apache CloudStack Plugin - Network Elastic Load Balancer  SUCCESS [6.582s]
[INFO] Apache CloudStack Plugin - Network Internal Load Balancer  SUCCESS [11.648s]
[INFO] Apache CloudStack Framework - Spring Life Cycle ... SUCCESS [2.761s]
[INFO] Apache CloudStack Plugin - Network Juniper Contrail  SUCCESS [16.227s]
[INFO] Apache CloudStack Plugin - Palo Alto .............. SUCCESS [9.013s]
[INFO] Apache CloudStack Plugin - Network Netscaler ...... SUCCESS [5.975s]
[INFO] Apache CloudStack Plugin - Network Nicira NVP ..... SUCCESS [13.245s]
[INFO] Apache CloudStack Plugin - BigSwitch Virtual Network Segment  SUCCESS [7.592s]
[INFO] Apache CloudStack Plugin - Network Brocade VCS .... SUCCESS [11.070s]
[INFO] Apache CloudStack Plugin - Midokura Midonet ....... SUCCESS [8.699s]
[INFO] Apache CloudStack Plugin - Stratosphere SSP ....... SUCCESS [7.340s]
[INFO] Apache CloudStack Plugin - Network Opendaylight ... SUCCESS [8.093s]
[INFO] Apache CloudStack Plugin - Storage Allocator Random  SUCCESS [2.656s]
[INFO] Apache CloudStack Plugin - User Authenticator LDAP  SUCCESS [4.405s]
[INFO] Apache CloudStack Plugin - User Authenticator MD5 . SUCCESS [7.119s]
[INFO] Apache CloudStack Plugin - User Authenticator PBKDF2-SHA-256  SUCCESS [7.273s]
[INFO] Apache CloudStack Plugin - User Authenticator Plain Text  SUCCESS [2.998s]
[INFO] Apache CloudStack Plugin - User Authenticator SAML2  SUCCESS [32.407s]
[INFO] Apache CloudStack Plugin - User Authenticator SHA256 Salted  SUCCESS [6.225s]
[INFO] Apache CloudStack Plugin - Dns Notifier Example ... SUCCESS [2.923s]
[INFO] Apache CloudStack Plugin - Storage Image S3 ....... SUCCESS [4.580s]
[INFO] Apache CloudStack Plugin - Storage Image Swift provider  SUCCESS [4.607s]
[INFO] Apache CloudStack Plugin - Storage Image default provider  SUCCESS [2.697s]
[INFO] Apache CloudStack Plugin - Storage Image sample provider  SUCCESS [2.510s]
[INFO] Apache CloudStack Plugin - Storage Volume Nexenta Provider  SUCCESS [5.734s]
[INFO] Apache CloudStack Plugin - Storage Volume CloudByte Provider  SUCCESS [4.737s]
[INFO] Apache CloudStack Plugin - Storage Volume sample provider  SUCCESS [2.735s]
[INFO] Apache CloudStack Plugin - SNMP Alerts ............ SUCCESS [5.872s]
[INFO] Apache CloudStack Plugin - Syslog Alerts .......... SUCCESS [4.815s]
[INFO] Apache CloudStack Plugin - Network VXLAN .......... SUCCESS [5.941s]
[INFO] Apache CloudStack Plugin - GloboDNS ............... SUCCESS [10.818s]
[INFO] Apache CloudStack Plugin - Hypervisor Simulator ... SUCCESS [6.197s]
[INFO] Apache CloudStack Framework - Spring Module ....... SUCCESS [8.707s]
[INFO] Apache CloudStack Secondary Storage Controller .... SUCCESS [4.054s]
[INFO] Apache CloudStack Console Proxy - RDP Client ...... SUCCESS [12.145s]
[INFO] Apache CloudStack Console Proxy ................... SUCCESS [0.460s]
[INFO] Apache CloudStack Console Proxy - Server .......... SUCCESS [6.427s]
[INFO] Apache CloudStack System VM ....................... SUCCESS [8.875s]
[INFO] Apache CloudStack Client UI ....................... SUCCESS [18.732s]
[INFO] Apache CloudStack Framework - QuickCloud .......... SUCCESS [3.770s]
[INFO] Apache CloudStack Test ............................ SUCCESS [1.121s]
[INFO] Apache CloudStack Developer Mode .................. SUCCESS [1.005s]
[INFO] Apache CloudStack Developer Tools ................. SUCCESS [0.408s]
[INFO] Apache CloudStack apidocs ......................... SUCCESS [28.746s]
[INFO] Apache CloudStack marvin .......................... FAILURE [0.810s]
[INFO] Apache CloudStack DevCloud ........................ SKIPPED
[INFO] Apache CloudStack DevCloud-KVM .................... SKIPPED
[INFO] ------------------------------------------------------------------------
[INFO] BUILD FAILURE
[INFO] ------------------------------------------------------------------------
[INFO] Total time: 13:00.649s
[INFO] Finished at: Sun Apr 19 04:41:30 EDT 2015
[INFO] Final Memory: 83M/410M
[INFO] ------------------------------------------------------------------------
[ERROR] Failed to execute goal org.codehaus.mojo:exec-maven-plugin:1.2.1:exec (generate-sources)
on project cloud-marvin: Command execution failed. Process exited with an error: 1 (Exit value:
1) -> [Help 1]
[ERROR] 
[ERROR] To see the full stack trace of the errors, re-run Maven with the -e switch.
[ERROR] Re-run Maven using the -X switch to enable full debug logging.
[ERROR] 
[ERROR] For more information about the errors and possible solutions, please read the following
articles:
[ERROR] [Help 1] http://cwiki.apache.org/confluence/display/MAVEN/MojoExecutionException
[ERROR] 
[ERROR] After correcting the problems, you can resume the build with the command
[ERROR]   mvn <goals> -rf :cloud-marvin
Build step 'Invoke top-level Maven targets' marked build as failure
[locks-and-latches] Releasing all the locks
[locks-and-latches] All the locks released
[xUnit] [INFO] - Starting to record.
[xUnit] [INFO] - Processing JUnit
[xUnit] [INFO] - [JUnit] - 1 test report file(s) were found with the pattern 'xunit.xml' relative
to '<http://jenkins.buildacloud.org/job/simulator-4.5-singlerun/ws/'> for the testing
framework 'JUnit'.
[xUnit] [ERROR] - Test reports were found but not all of them are new. Did all the tests run?
  * <http://jenkins.buildacloud.org/job/simulator-4.5-singlerun/ws/xunit.xml> is 1 day
17 hr old

[xUnit] [INFO] - Failing BUILD.
[xUnit] [INFO] - There are errors when processing test results.
[xUnit] [INFO] - Skipping tests recording.
[xUnit] [INFO] - Stop build.

Mime
View raw message