cloudstack-dev mailing list archives

Site index · List index
Message view « Date » · « Thread »
Top « Date » · « Thread »
From jenk...@cloudstack.org
Subject Build failed in Jenkins: simulator-singlerun #1087
Date Fri, 10 Apr 2015 10:46:10 GMT
See <http://jenkins.buildacloud.org/job/simulator-singlerun/1087/changes>

Changes:

[Rohit Yadav] systemvmtemplate: install open-vm-tools from wheezy-backports, install XStools

------------------------------------------
[...truncated 3481 lines...]
[INFO] Deleting <http://jenkins.buildacloud.org/job/simulator-singlerun/ws/plugins/hypervisors/xenserver>
(includes = [target, dist], excludes = [])
[INFO] 
[INFO] --- maven-checkstyle-plugin:2.11:check (cloudstack-checkstyle) @ cloud-plugin-hypervisor-xenserver
---
[INFO] Starting audit...
Audit done.

[INFO] 
[INFO] --- maven-remote-resources-plugin:1.3:process (default) @ cloud-plugin-hypervisor-xenserver
---
[INFO] 
[INFO] --- maven-resources-plugin:2.5:resources (default-resources) @ cloud-plugin-hypervisor-xenserver
---
[debug] execute contextualize
[INFO] Using 'UTF-8' encoding to copy filtered resources.
[INFO] Copying 4 resources
[INFO] Copying 3 resources
[INFO] 
[INFO] --- maven-compiler-plugin:3.2:compile (default-compile) @ cloud-plugin-hypervisor-xenserver
---
[INFO] Changes detected - recompiling the module!
[INFO] Compiling 94 source files to <http://jenkins.buildacloud.org/job/simulator-singlerun/ws/plugins/hypervisors/xenserver/target/classes>
[INFO] 
[INFO] --- maven-resources-plugin:2.5:testResources (default-testResources) @ cloud-plugin-hypervisor-xenserver
---
[debug] execute contextualize
[INFO] Using 'UTF-8' encoding to copy filtered resources.
[INFO] skip non existing resourceDirectory <http://jenkins.buildacloud.org/job/simulator-singlerun/ws/plugins/hypervisors/xenserver/test/resources>
[INFO] Copying 3 resources
[INFO] 
[INFO] --- maven-compiler-plugin:3.2:testCompile (default-testCompile) @ cloud-plugin-hypervisor-xenserver
---
[INFO] Changes detected - recompiling the module!
[INFO] Compiling 7 source files to <http://jenkins.buildacloud.org/job/simulator-singlerun/ws/plugins/hypervisors/xenserver/target/test-classes>
[INFO] 
[INFO] --- maven-surefire-plugin:2.18.1:test (default-test) @ cloud-plugin-hypervisor-xenserver
---
[INFO] Surefire report directory: <http://jenkins.buildacloud.org/job/simulator-singlerun/ws/plugins/hypervisors/xenserver/target/surefire-reports>

-------------------------------------------------------
 T E S T S
-------------------------------------------------------
Running com.cloud.hypervisor.xenserver.resource.wrapper.XenServer56WrapperTest
log4j:WARN No appenders could be found for logger (com.cloud.hypervisor.xenserver.resource.XenServerConnectionPool).
log4j:WARN Please initialize the log4j system properly.
log4j:WARN See http://logging.apache.org/log4j/1.2/faq.html#noconfig for more info.
Tests run: 7, Failures: 0, Errors: 0, Skipped: 0, Time elapsed: 0.82 sec - in com.cloud.hypervisor.xenserver.resource.wrapper.XenServer56WrapperTest
Running com.cloud.hypervisor.xenserver.resource.wrapper.XcpServerWrapperTest
Tests run: 3, Failures: 0, Errors: 0, Skipped: 0, Time elapsed: 0.086 sec - in com.cloud.hypervisor.xenserver.resource.wrapper.XcpServerWrapperTest
Running com.cloud.hypervisor.xenserver.resource.wrapper.CitrixRequestWrapperTest
log4j:WARN No appenders could be found for logger (com.cloud.hypervisor.xenserver.resource.XenServerConnectionPool).
log4j:WARN Please initialize the log4j system properly.
log4j:WARN See http://logging.apache.org/log4j/1.2/faq.html#noconfig for more info.
Tests run: 77, Failures: 0, Errors: 0, Skipped: 0, Time elapsed: 6.257 sec - in com.cloud.hypervisor.xenserver.resource.wrapper.CitrixRequestWrapperTest
Running com.cloud.hypervisor.xenserver.resource.wrapper.XenServer620WrapperTest
Tests run: 1, Failures: 0, Errors: 0, Skipped: 0, Time elapsed: 0.005 sec - in com.cloud.hypervisor.xenserver.resource.wrapper.XenServer620WrapperTest
Running com.cloud.hypervisor.xenserver.resource.wrapper.XenServer620SP1WrapperTest
Tests run: 2, Failures: 0, Errors: 0, Skipped: 0, Time elapsed: 0.068 sec - in com.cloud.hypervisor.xenserver.resource.wrapper.XenServer620SP1WrapperTest
Running com.cloud.hypervisor.xenserver.resource.wrapper.XenServer56FP1WrapperTest
Tests run: 1, Failures: 0, Errors: 0, Skipped: 0, Time elapsed: 0.061 sec - in com.cloud.hypervisor.xenserver.resource.wrapper.XenServer56FP1WrapperTest
Running com.cloud.hypervisor.xenserver.resource.wrapper.XenServer610WrapperTest
Tests run: 9, Failures: 0, Errors: 0, Skipped: 0, Time elapsed: 0.264 sec - in com.cloud.hypervisor.xenserver.resource.wrapper.XenServer610WrapperTest

Results :

Tests run: 100, Failures: 0, Errors: 0, Skipped: 0

[INFO] 
[INFO] --- maven-jar-plugin:2.5:jar (default-jar) @ cloud-plugin-hypervisor-xenserver ---
[INFO] Building jar: <http://jenkins.buildacloud.org/job/simulator-singlerun/ws/plugins/hypervisors/xenserver/target/cloud-plugin-hypervisor-xenserver-4.6.0-SNAPSHOT.jar>
[INFO] 
[INFO] --- maven-site-plugin:3.3:attach-descriptor (attach-descriptor) @ cloud-plugin-hypervisor-xenserver
---
[INFO] 
[INFO] --- maven-install-plugin:2.3.1:install (default-install) @ cloud-plugin-hypervisor-xenserver
---
[INFO] Installing <http://jenkins.buildacloud.org/job/simulator-singlerun/ws/plugins/hypervisors/xenserver/target/cloud-plugin-hypervisor-xenserver-4.6.0-SNAPSHOT.jar>
to /var/lib/jenkins/.m2/repository/org/apache/cloudstack/cloud-plugin-hypervisor-xenserver/4.6.0-SNAPSHOT/cloud-plugin-hypervisor-xenserver-4.6.0-SNAPSHOT.jar
[INFO] Installing <http://jenkins.buildacloud.org/job/simulator-singlerun/ws/plugins/hypervisors/xenserver/pom.xml>
to /var/lib/jenkins/.m2/repository/org/apache/cloudstack/cloud-plugin-hypervisor-xenserver/4.6.0-SNAPSHOT/cloud-plugin-hypervisor-xenserver-4.6.0-SNAPSHOT.pom
[INFO]                                                                         
[INFO] ------------------------------------------------------------------------
[INFO] Building Apache CloudStack Plugin - Hypervisor KVM 4.6.0-SNAPSHOT
[INFO] ------------------------------------------------------------------------
Downloading: http://ceph.com/maven/joda-time/joda-time/maven-metadata.xml
Downloading: http://libvirt.org/maven2/joda-time/joda-time/maven-metadata.xml
            
Apr 10, 2015 6:40:22 AM org.apache.maven.wagon.providers.http.httpclient.impl.client.DefaultRequestDirector
tryConnect
INFO: I/O exception (java.net.SocketException) caught when connecting to the target host:
Network is unreachable
Apr 10, 2015 6:40:22 AM org.apache.maven.wagon.providers.http.httpclient.impl.client.DefaultRequestDirector
tryConnect
INFO: Retrying connect
Apr 10, 2015 6:41:25 AM org.apache.maven.wagon.providers.http.httpclient.impl.client.DefaultRequestDirector
tryConnect
INFO: I/O exception (java.net.SocketException) caught when connecting to the target host:
Network is unreachable
Apr 10, 2015 6:41:25 AM org.apache.maven.wagon.providers.http.httpclient.impl.client.DefaultRequestDirector
tryConnect
INFO: Retrying connect
Apr 10, 2015 6:42:28 AM org.apache.maven.wagon.providers.http.httpclient.impl.client.DefaultRequestDirector
tryConnect
INFO: I/O exception (java.net.SocketException) caught when connecting to the target host:
Network is unreachable
Apr 10, 2015 6:42:28 AM org.apache.maven.wagon.providers.http.httpclient.impl.client.DefaultRequestDirector
tryConnect
INFO: Retrying connect
            
[WARNING] Could not transfer metadata joda-time:joda-time/maven-metadata.xml from/to ceph-com
(http://ceph.com/maven): Network is unreachable
Downloading: http://libvirt.org/maven2/org/libvirt/libvirt/0.5.1/libvirt-0.5.1.pom
            
Downloading: http://ceph.com/maven/org/libvirt/libvirt/0.5.1/libvirt-0.5.1.pom
Apr 10, 2015 6:44:34 AM org.apache.maven.wagon.providers.http.httpclient.impl.client.DefaultRequestDirector
tryConnect
INFO: I/O exception (java.net.SocketException) caught when connecting to the target host:
Network is unreachable
Apr 10, 2015 6:44:34 AM org.apache.maven.wagon.providers.http.httpclient.impl.client.DefaultRequestDirector
tryConnect
INFO: Retrying connect
Apr 10, 2015 6:45:37 AM org.apache.maven.wagon.providers.http.httpclient.impl.client.DefaultRequestDirector
tryConnect
INFO: I/O exception (java.net.SocketException) caught when connecting to the target host:
Network is unreachable
Apr 10, 2015 6:45:37 AM org.apache.maven.wagon.providers.http.httpclient.impl.client.DefaultRequestDirector
tryConnect
INFO: Retrying connect
Apr 10, 2015 6:46:40 AM org.apache.maven.wagon.providers.http.httpclient.impl.client.DefaultRequestDirector
tryConnect
INFO: I/O exception (java.net.SocketException) caught when connecting to the target host:
Network is unreachable
Apr 10, 2015 6:46:40 AM org.apache.maven.wagon.providers.http.httpclient.impl.client.DefaultRequestDirector
tryConnect
INFO: Retrying connect
            
Downloading: http://repo.maven.apache.org/maven2/org/libvirt/libvirt/0.5.1/libvirt-0.5.1.pom
            
[INFO] ------------------------------------------------------------------------
[INFO] Reactor Summary:
[INFO] 
[INFO] Apache CloudStack Developer Tools - Checkstyle Configuration  SUCCESS [3.085s]
[INFO] Apache CloudStack ................................. SUCCESS [3.139s]
[INFO] Apache CloudStack Maven Conventions Parent ........ SUCCESS [1.699s]
[INFO] Apache CloudStack Framework - Managed Context ..... SUCCESS [5.577s]
[INFO] Apache CloudStack Utils ........................... SUCCESS [31.150s]
[INFO] Apache CloudStack Framework ....................... SUCCESS [0.068s]
[INFO] Apache CloudStack Framework - Event Notification .. SUCCESS [10.760s]
[INFO] Apache CloudStack Framework - Configuration ....... SUCCESS [6.297s]
[INFO] Apache CloudStack API ............................. SUCCESS [22.745s]
[INFO] Apache CloudStack Framework - REST ................ SUCCESS [3.918s]
[INFO] Apache CloudStack Framework - IPC ................. SUCCESS [6.044s]
[INFO] Apache CloudStack Cloud Engine .................... SUCCESS [0.053s]
[INFO] Apache CloudStack Cloud Engine API ................ SUCCESS [7.137s]
[INFO] Apache CloudStack Framework - Security ............ SUCCESS [3.492s]
[INFO] Apache CloudStack Core ............................ SUCCESS [32.665s]
[INFO] Apache CloudStack Agents .......................... SUCCESS [9.919s]
[INFO] Apache CloudStack Framework - Clustering .......... SUCCESS [5.582s]
[INFO] Apache CloudStack Framework - Event Notification .. SUCCESS [2.142s]
[INFO] Apache CloudStack Cloud Engine Schema Component ... SUCCESS [21.090s]
[INFO] Apache CloudStack Framework - Jobs ................ SUCCESS [6.712s]
[INFO] Apache CloudStack Cloud Engine Internal Components API  SUCCESS [3.605s]
[INFO] Apache CloudStack Server .......................... SUCCESS [1:00.853s]
[INFO] Apache CloudStack Usage Server .................... SUCCESS [10.977s]
[INFO] Apache CloudStack Cloud Engine Orchestration Component  SUCCESS [11.908s]
[INFO] Apache CloudStack Cloud Services .................. SUCCESS [0.048s]
[INFO] Apache CloudStack Secondary Storage ............... SUCCESS [0.425s]
[INFO] Apache CloudStack Secondary Storage Service ....... SUCCESS [7.169s]
[INFO] Apache CloudStack Engine Storage Component ........ SUCCESS [9.613s]
[INFO] Apache CloudStack Engine Storage Volume Component . SUCCESS [6.424s]
[INFO] Apache CloudStack Engine Storage Image Component .. SUCCESS [3.573s]
[INFO] Apache CloudStack Engine Storage Data Motion Component  SUCCESS [3.289s]
[INFO] Apache CloudStack Engine Storage Cache Component .. SUCCESS [2.726s]
[INFO] Apache CloudStack Engine Storage Snapshot Component  SUCCESS [12.061s]
[INFO] Apache CloudStack Cloud Engine API ................ SUCCESS [2.225s]
[INFO] Apache CloudStack Cloud Engine Service ............ SUCCESS [6.694s]
[INFO] Apache CloudStack Plugin POM ...................... SUCCESS [0.582s]
[INFO] Apache CloudStack Plugin - API Rate Limit ......... SUCCESS [8.752s]
[INFO] Apache CloudStack Plugin - Storage Volume default provider  SUCCESS [3.355s]
[INFO] Apache CloudStack Plugin - Storage Volume SolidFire Provider  SUCCESS [6.698s]
[INFO] Apache CloudStack Plugin - API SolidFire .......... SUCCESS [3.117s]
[INFO] Apache CloudStack Plugin - API Discovery .......... SUCCESS [5.699s]
[INFO] Apache CloudStack Plugin - ACL Static Role Based .. SUCCESS [2.838s]
[INFO] Apache CloudStack Plugin - Host Anti-Affinity Processor  SUCCESS [2.625s]
[INFO] Apache CloudStack Plugin - Explicit Dedication Processor  SUCCESS [2.870s]
[INFO] Apache CloudStack Plugin - User Concentrated Pod Deployment Planner  SUCCESS [2.454s]
[INFO] Apache CloudStack Plugin - User Dispersing Deployment Planner  SUCCESS [2.887s]
[INFO] Apache CloudStack Plugin - Implicit Dedication Planner  SUCCESS [9.468s]
[INFO] Apache CloudStack Plugin - Skip Heurestics Planner  SUCCESS [2.540s]
[INFO] Apache CloudStack Plugin - Host Allocator Random .. SUCCESS [2.685s]
[INFO] Apache CloudStack Plugin - Dedicated Resources .... SUCCESS [8.316s]
[INFO] Apache CloudStack Plugin - Hypervisor OracleVM .... SUCCESS [4.510s]
[INFO] Apache CloudStack Plugin - Open vSwitch ........... SUCCESS [4.509s]
[INFO] Apache CloudStack Plugin - Hypervisor XenServer ... SUCCESS [24.335s]
[INFO] Apache CloudStack Plugin - Hypervisor KVM ......... FAILURE [8:24.632s]
[INFO] Apache CloudStack Plugin - RabbitMQ Event Bus ..... SKIPPED
[INFO] Apache CloudStack Plugin - In Memory Event Bus .... SKIPPED
[INFO] Apache CloudStack Plugin - Kafka Event Bus ........ SKIPPED
[INFO] Apache CloudStack Plugin - Hypervisor Baremetal ... SKIPPED
[INFO] Apache CloudStack Plugin - Hypervisor UCS ......... SKIPPED
[INFO] Apache CloudStack Plugin - Hypervisor Hyper-V ..... SKIPPED
[INFO] Apache CloudStack Plugin - Hypervisor OracleVM3 ... SKIPPED
[INFO] Apache CloudStack Plugin - Network Elastic Load Balancer  SKIPPED
[INFO] Apache CloudStack Plugin - Network Internal Load Balancer  SKIPPED
[INFO] Apache CloudStack Framework - Spring Life Cycle ... SKIPPED
[INFO] Apache CloudStack Plugin - Network Juniper Contrail  SKIPPED
[INFO] Apache CloudStack Plugin - Palo Alto .............. SKIPPED
[INFO] Apache CloudStack Plugin - Network Netscaler ...... SKIPPED
[INFO] Apache CloudStack Plugin - Network Nicira NVP ..... SKIPPED
[INFO] Apache CloudStack Plugin - BigSwitch Virtual Network Segment  SKIPPED
[INFO] Apache CloudStack Plugin - Network Brocade VCS .... SKIPPED
[INFO] Apache CloudStack Plugin - Midokura Midonet ....... SKIPPED
[INFO] Apache CloudStack Plugin - Stratosphere SSP ....... SKIPPED
[INFO] Apache CloudStack Plugin - Network Opendaylight ... SKIPPED
[INFO] Apache CloudStack Plugin - Storage Allocator Random  SKIPPED
[INFO] Apache CloudStack Plugin - User Authenticator LDAP  SKIPPED
[INFO] Apache CloudStack Plugin - User Authenticator MD5 . SKIPPED
[INFO] Apache CloudStack Plugin - User Authenticator PBKDF2-SHA-256  SKIPPED
[INFO] Apache CloudStack Plugin - User Authenticator Plain Text  SKIPPED
[INFO] Apache CloudStack Plugin - User Authenticator SAML2  SKIPPED
[INFO] Apache CloudStack Plugin - User Authenticator SHA256 Salted  SKIPPED
[INFO] Apache CloudStack Plugin - Dns Notifier Example ... SKIPPED
[INFO] Apache CloudStack Plugin - Storage Image S3 ....... SKIPPED
[INFO] Apache CloudStack Plugin - Storage Image Swift provider  SKIPPED
[INFO] Apache CloudStack Plugin - Storage Image default provider  SKIPPED
[INFO] Apache CloudStack Plugin - Storage Image sample provider  SKIPPED
[INFO] Apache CloudStack Plugin - Storage Volume Nexenta Provider  SKIPPED
[INFO] Apache CloudStack Plugin - Storage Volume CloudByte Provider  SKIPPED
[INFO] Apache CloudStack Plugin - Storage Volume sample provider  SKIPPED
[INFO] Apache CloudStack Plugin - SNMP Alerts ............ SKIPPED
[INFO] Apache CloudStack Plugin - Syslog Alerts .......... SKIPPED
[INFO] Apache CloudStack Plugin - Network VXLAN .......... SKIPPED
[INFO] Apache CloudStack Plugin - GloboDNS ............... SKIPPED
[INFO] Apache CloudStack Plugin - Hypervisor Simulator ... SKIPPED
[INFO] Apache CloudStack Framework - Spring Module ....... SKIPPED
[INFO] Apache CloudStack Secondary Storage Controller .... SKIPPED
[INFO] Apache CloudStack Console Proxy - RDP Client ...... SKIPPED
[INFO] Apache CloudStack Console Proxy ................... SKIPPED
[INFO] Apache CloudStack Console Proxy - Server .......... SKIPPED
[INFO] Apache CloudStack System VM ....................... SKIPPED
[INFO] Apache CloudStack Client UI ....................... SKIPPED
[INFO] Apache CloudStack Framework - QuickCloud .......... SKIPPED
[INFO] Apache CloudStack Test ............................ SKIPPED
[INFO] Apache CloudStack Developer Mode .................. SKIPPED
[INFO] Apache CloudStack Developer Tools ................. SKIPPED
[INFO] Apache CloudStack apidocs ......................... SKIPPED
[INFO] Apache CloudStack marvin .......................... SKIPPED
[INFO] Apache CloudStack DevCloud ........................ SKIPPED
[INFO] Apache CloudStack DevCloud-KVM .................... SKIPPED
[INFO] ------------------------------------------------------------------------
[INFO] BUILD FAILURE
[INFO] ------------------------------------------------------------------------
[INFO] Total time: 15:31.817s
[INFO] Finished at: Fri Apr 10 06:47:44 EDT 2015
[INFO] Final Memory: 71M/396M
[INFO] ------------------------------------------------------------------------
[ERROR] Failed to execute goal on project cloud-plugin-hypervisor-kvm: Could not resolve dependencies
for project org.apache.cloudstack:cloud-plugin-hypervisor-kvm:jar:4.6.0-SNAPSHOT: Failed to
collect dependencies for [commons-io:commons-io:jar:2.4 (compile), org.apache.cloudstack:cloud-agent:jar:4.6.0-SNAPSHOT
(compile), org.libvirt:libvirt:jar:0.5.1 (compile), org.apache.cloudstack:cloud-plugin-network-ovs:jar:4.6.0-SNAPSHOT
(compile), com.ceph:rados:jar:0.1.4 (compile), net.java.dev.jna:jna:jar:4.0.0 (compile), org.apache.cloudstack:cloud-server:jar:4.6.0-SNAPSHOT
(compile), org.apache.cloudstack:cloud-api:jar:4.6.0-SNAPSHOT (compile), org.apache.cloudstack:cloud-utils:jar:4.6.0-SNAPSHOT
(compile), org.apache.cloudstack:cloud-framework-config:jar:4.6.0-SNAPSHOT (compile), org.apache.cloudstack:cloud-api:jar:tests:4.6.0-SNAPSHOT
(test), junit:junit:jar:4.11 (test), org.hamcrest:hamcrest-library:jar:1.3 (test), org.mockito:mockito-all:jar:1.9.5
(test), org.powermock:powermock-module-junit4:jar:1.5.3 (compile), org.powermock:powermock-api-mockito:jar:1.5.3
(test), org.springframework:spring-test:jar:3.2.12.RELEASE (test), javax.inject:javax.inject:jar:1
(compile)]: Failed to read artifact descriptor for org.libvirt:libvirt:jar:0.5.1: Could not
transfer artifact org.libvirt:libvirt:pom:0.5.1 from/to ceph-com (http://ceph.com/maven):
Network is unreachable -> [Help 1]
[ERROR] 
[ERROR] To see the full stack trace of the errors, re-run Maven with the -e switch.
[ERROR] Re-run Maven using the -X switch to enable full debug logging.
[ERROR] 
[ERROR] For more information about the errors and possible solutions, please read the following
articles:
[ERROR] [Help 1] http://cwiki.apache.org/confluence/display/MAVEN/DependencyResolutionException
[ERROR] 
[ERROR] After correcting the problems, you can resume the build with the command
[ERROR]   mvn <goals> -rf :cloud-plugin-hypervisor-kvm
Build step 'Invoke top-level Maven targets' marked build as failure
[locks-and-latches] Releasing all the locks
[locks-and-latches] All the locks released
[xUnit] [INFO] - Starting to record.
[xUnit] [INFO] - Processing JUnit
[xUnit] [INFO] - [JUnit] - 1 test report file(s) were found with the pattern 'xunit.xml' relative
to '<http://jenkins.buildacloud.org/job/simulator-singlerun/ws/'> for the testing framework
'JUnit'.
[xUnit] [ERROR] - Test reports were found but not all of them are new. Did all the tests run?
  * <http://jenkins.buildacloud.org/job/simulator-singlerun/ws/xunit.xml> is 1 day 1
hr old

[xUnit] [INFO] - Failing BUILD.
[xUnit] [INFO] - There are errors when processing test results.
[xUnit] [INFO] - Skipping tests recording.
[xUnit] [INFO] - Stop build.

Mime
View raw message