cloudstack-dev mailing list archives

Site index · List index
Message view « Date » · « Thread »
Top « Date » · « Thread »
From jenk...@cloudstack.org
Subject Build failed in Jenkins: build-master #2271
Date Mon, 02 Mar 2015 11:23:08 GMT
See <http://jenkins.buildacloud.org/job/build-master/2271/changes>

Changes:

[anshul.gangwar] CLOUDSTACK-6900: This fixes volume migration failing after that volume is
downloaded.

[laszlo.hornyak] Logical expression simplification, == true is redundant

[laszlo.hornyak] removed redundant autoboxing

[laszlo.hornyak] CLOUDSTACK-8279: test fix for java 1.8

[laszlo.hornyak] CLOUDSTACK-8279: Fix unit test for java 1.8

[laszlo.hornyak] CLOUDSTACK-8292: fix for java 1.8 compilation

[laszlo.hornyak] CLOUDSTACK-8294: fix for java 1.8 build

------------------------------------------
[...truncated 1410 lines...]
Running com.cloud.servlet.ConsoleProxyServletTest
Tests run: 1, Failures: 0, Errors: 0, Skipped: 0, Time elapsed: 0 sec - in com.cloud.servlet.ConsoleProxyServletTest
Running com.cloud.resourcelimit.ResourceLimitManagerImplTest
Tests run: 1, Failures: 0, Errors: 0, Skipped: 0, Time elapsed: 0 sec - in com.cloud.resourcelimit.ResourceLimitManagerImplTest
Running com.cloud.network.firewall.FirewallManagerTest
Tests run: 1, Failures: 0, Errors: 0, Skipped: 1, Time elapsed: 0.001 sec - in com.cloud.network.firewall.FirewallManagerTest
Running com.cloud.network.ExternalLoadBalancerDeviceManagerImplTest
Tests run: 2, Failures: 0, Errors: 0, Skipped: 0, Time elapsed: 0.486 sec - in com.cloud.network.ExternalLoadBalancerDeviceManagerImplTest
Running com.cloud.network.element.VirtualRouterElementTest
Tests run: 2, Failures: 0, Errors: 0, Skipped: 2, Time elapsed: 0.004 sec - in com.cloud.network.element.VirtualRouterElementTest
Running com.cloud.network.UpdatePhysicalNetworkTest
Tests run: 1, Failures: 0, Errors: 0, Skipped: 0, Time elapsed: 0.182 sec - in com.cloud.network.UpdatePhysicalNetworkTest
Running com.cloud.network.CreatePrivateNetworkTest
Tests run: 1, Failures: 0, Errors: 0, Skipped: 0, Time elapsed: 0.042 sec - in com.cloud.network.CreatePrivateNetworkTest
Running com.cloud.network.NetworkModelTest
Tests run: 1, Failures: 0, Errors: 0, Skipped: 0, Time elapsed: 0.035 sec - in com.cloud.network.NetworkModelTest
Running com.cloud.network.router.NetworkHelperImplTest
Tests run: 4, Failures: 0, Errors: 0, Skipped: 0, Time elapsed: 0.054 sec - in com.cloud.network.router.NetworkHelperImplTest
Running com.cloud.network.router.RouterControlHelperTest
Tests run: 2, Failures: 0, Errors: 0, Skipped: 0, Time elapsed: 0.089 sec - in com.cloud.network.router.RouterControlHelperTest
Running com.cloud.network.router.VirtualNetworkApplianceManagerImplTest
Tests run: 2, Failures: 0, Errors: 0, Skipped: 0, Time elapsed: 0.225 sec - in com.cloud.network.router.VirtualNetworkApplianceManagerImplTest
Running com.cloud.network.security.SecurityGroupManagerImplTest
Tests run: 4, Failures: 0, Errors: 0, Skipped: 0, Time elapsed: 2.841 sec - in com.cloud.network.security.SecurityGroupManagerImplTest
Running com.cloud.network.security.SecurityGroupQueueTest
Total jobs dequeued = 10, num queued=1004 queue current size=994
Num Vms= 50 Queue size = 50
Num Vms= 20000 Queue size = 20000 time=674 ms
Num Vms= 5000 Queue size = 5000 time=823 ms
Num Vms= 1 Queue size = 1 time=0 ms
Num Vms= 1000000 Queue size = 1000000 time=1210 ms
Total jobs dequeued = 10, num queued=1010 queue current size=1000
Total jobs dequeued = 1, num queued=1001 queue current size=1000
Total jobs dequeued = 10, num queued=1000 queue current size=990
Total jobs dequeued = 10, num queued=10 queue current size=0
Tests run: 4, Failures: 0, Errors: 1, Skipped: 0, Time elapsed: 3.231 sec <<< FAILURE!
- in com.cloud.network.security.SecurityGroupQueueTest
testNumJobsEqToNumVms3(com.cloud.network.security.SecurityGroupQueueTest)  Time elapsed: 3.031
sec  <<< ERROR!
java.lang.OutOfMemoryError: unable to create new native thread
	at java.lang.Thread.start0(Native Method)
	at java.lang.Thread.start(Thread.java:693)
	at com.cloud.network.security.SecurityGroupQueueTest.testNumJobsEqToNumVms2(SecurityGroupQueueTest.java:124)
	at com.cloud.network.security.SecurityGroupQueueTest.testNumJobsEqToNumVms3(SecurityGroupQueueTest.java:143)

Running com.cloud.network.vpc.VpcManagerImplTest
Tests run: 1, Failures: 0, Errors: 0, Skipped: 0, Time elapsed: 0.029 sec - in com.cloud.network.vpc.VpcManagerImplTest
Running com.cloud.network.DedicateGuestVlanRangesTest
Tests run: 2, Failures: 0, Errors: 0, Skipped: 0, Time elapsed: 0.045 sec - in com.cloud.network.DedicateGuestVlanRangesTest
Running com.cloud.network.lb.AssignLoadBalancerTest
Tests run: 4, Failures: 0, Errors: 0, Skipped: 0, Time elapsed: 0.08 sec - in com.cloud.network.lb.AssignLoadBalancerTest
Running com.cloud.network.lb.UpdateLoadBalancerTest
Tests run: 2, Failures: 0, Errors: 0, Skipped: 0, Time elapsed: 0.047 sec - in com.cloud.network.lb.UpdateLoadBalancerTest
Running com.cloud.network.dao.NetworkDaoTest
Tests run: 2, Failures: 0, Errors: 0, Skipped: 0, Time elapsed: 0 sec - in com.cloud.network.dao.NetworkDaoTest
Running com.cloud.vm.FirstFitPlannerTest
Tests run: 1, Failures: 0, Errors: 0, Skipped: 0, Time elapsed: 0.414 sec - in com.cloud.vm.FirstFitPlannerTest
Running com.cloud.vm.DeploymentPlanningManagerImplTest
Tests run: 3, Failures: 0, Errors: 0, Skipped: 0, Time elapsed: 0.693 sec - in com.cloud.vm.DeploymentPlanningManagerImplTest
Running com.cloud.vm.snapshot.VMSnapshotManagerTest
Tests run: 7, Failures: 0, Errors: 0, Skipped: 0, Time elapsed: 0.108 sec - in com.cloud.vm.snapshot.VMSnapshotManagerTest
Running com.cloud.vm.UserVmManagerTest
Tests run: 9, Failures: 0, Errors: 0, Skipped: 0, Time elapsed: 0.363 sec - in com.cloud.vm.UserVmManagerTest
Running com.cloud.configuration.ValidateIpRangeTest
Tests run: 3, Failures: 0, Errors: 0, Skipped: 0, Time elapsed: 0.011 sec - in com.cloud.configuration.ValidateIpRangeTest
Running com.cloud.configuration.ConfigurationManagerTest
Tests run: 9, Failures: 0, Errors: 0, Skipped: 0, Time elapsed: 0.052 sec - in com.cloud.configuration.ConfigurationManagerTest
Running com.cloud.server.ConfigurationServerImplTest
Tests run: 4, Failures: 0, Errors: 0, Skipped: 0, Time elapsed: 0.005 sec - in com.cloud.server.ConfigurationServerImplTest
Running com.cloud.template.TemplateManagerImplTest
Tests run: 1, Failures: 0, Errors: 0, Skipped: 0, Time elapsed: 0.008 sec - in com.cloud.template.TemplateManagerImplTest
Running com.cloud.vpc.Site2SiteVpnTest
Tests run: 1, Failures: 0, Errors: 0, Skipped: 0, Time elapsed: 2.25 sec - in com.cloud.vpc.Site2SiteVpnTest
Running com.cloud.vpc.NetworkACLServiceTest
Tests run: 5, Failures: 0, Errors: 0, Skipped: 0, Time elapsed: 0.184 sec - in com.cloud.vpc.NetworkACLServiceTest
Running com.cloud.vpc.NetworkACLManagerTest
Tests run: 6, Failures: 0, Errors: 0, Skipped: 0, Time elapsed: 0.18 sec - in com.cloud.vpc.NetworkACLManagerTest
Running com.cloud.storage.VolumeApiServiceImplTest
Tests run: 11, Failures: 0, Errors: 0, Skipped: 0, Time elapsed: 0.11 sec - in com.cloud.storage.VolumeApiServiceImplTest
Running com.cloud.user.AccountManagerImplTest
Tests run: 5, Failures: 0, Errors: 0, Skipped: 0, Time elapsed: 0.123 sec - in com.cloud.user.AccountManagerImplTest
Running com.cloud.api.ApiServletTest
Tests run: 13, Failures: 0, Errors: 0, Skipped: 0, Time elapsed: 0.065 sec - in com.cloud.api.ApiServletTest
Running com.cloud.api.ApiResponseHelperTest
Tests run: 1, Failures: 0, Errors: 0, Skipped: 0, Time elapsed: 0.026 sec - in com.cloud.api.ApiResponseHelperTest
Running com.cloud.api.dispatch.ParamGenericValidationWorkerTest
Tests run: 4, Failures: 0, Errors: 0, Skipped: 0, Time elapsed: 0.012 sec - in com.cloud.api.dispatch.ParamGenericValidationWorkerTest
Running com.cloud.api.dispatch.DispatchChainFactoryTest
Tests run: 1, Failures: 0, Errors: 0, Skipped: 0, Time elapsed: 0.005 sec - in com.cloud.api.dispatch.DispatchChainFactoryTest
Running com.cloud.api.dispatch.CommandCreationWorkerTest
Tests run: 1, Failures: 0, Errors: 0, Skipped: 0, Time elapsed: 0.005 sec - in com.cloud.api.dispatch.CommandCreationWorkerTest
Running com.cloud.api.dispatch.SpecificCmdValidationWorkerTest
Tests run: 1, Failures: 0, Errors: 0, Skipped: 0, Time elapsed: 0.003 sec - in com.cloud.api.dispatch.SpecificCmdValidationWorkerTest
Running com.cloud.api.dispatch.ParamProcessWorkerTest
Tests run: 1, Failures: 0, Errors: 0, Skipped: 0, Time elapsed: 0.002 sec - in com.cloud.api.dispatch.ParamProcessWorkerTest
Running com.cloud.ha.KVMFencerTest
Tests run: 6, Failures: 0, Errors: 0, Skipped: 0, Time elapsed: 0.014 sec - in com.cloud.ha.KVMFencerTest
Running com.cloud.ha.HighAvailabilityManagerImplTest
Tests run: 1, Failures: 0, Errors: 0, Skipped: 0, Time elapsed: 0.019 sec - in com.cloud.ha.HighAvailabilityManagerImplTest
Running org.cloud.network.router.deployment.VpcRouterDeploymentDefinitionTest
Tests run: 15, Failures: 0, Errors: 0, Skipped: 0, Time elapsed: 0.109 sec - in org.cloud.network.router.deployment.VpcRouterDeploymentDefinitionTest
Running org.cloud.network.router.deployment.RouterDeploymentDefinitionTest
Tests run: 43, Failures: 0, Errors: 0, Skipped: 0, Time elapsed: 0.195 sec - in org.cloud.network.router.deployment.RouterDeploymentDefinitionTest
Running org.apache.cloudstack.networkoffering.CreateNetworkOfferingTest
Tests run: 10, Failures: 0, Errors: 0, Skipped: 0, Time elapsed: 2.773 sec - in org.apache.cloudstack.networkoffering.CreateNetworkOfferingTest
Running org.apache.cloudstack.privategw.AclOnPrivateGwTest
Tests run: 2, Failures: 0, Errors: 0, Skipped: 0, Time elapsed: 0.263 sec - in org.apache.cloudstack.privategw.AclOnPrivateGwTest
Running org.apache.cloudstack.service.ServiceOfferingVOTest
Tests run: 2, Failures: 0, Errors: 0, Skipped: 0, Time elapsed: 0 sec - in org.apache.cloudstack.service.ServiceOfferingVOTest
Running org.apache.cloudstack.affinity.AffinityApiUnitTest
Tests run: 7, Failures: 0, Errors: 0, Skipped: 0, Time elapsed: 0.181 sec - in org.apache.cloudstack.affinity.AffinityApiUnitTest
Running org.apache.cloudstack.network.lb.ApplicationLoadBalancerTest
Tests run: 11, Failures: 0, Errors: 0, Skipped: 0, Time elapsed: 0.479 sec - in org.apache.cloudstack.network.lb.ApplicationLoadBalancerTest
Running org.apache.cloudstack.network.lb.CertServiceTest
Tests run: 14, Failures: 0, Errors: 0, Skipped: 0, Time elapsed: 0.45 sec - in org.apache.cloudstack.network.lb.CertServiceTest
Running org.apache.cloudstack.region.gslb.GlobalLoadBalancingRulesServiceImplTest
Tests run: 4, Failures: 0, Errors: 0, Skipped: 0, Time elapsed: 0.062 sec - in org.apache.cloudstack.region.gslb.GlobalLoadBalancingRulesServiceImplTest
Running org.apache.cloudstack.region.RegionManagerTest
Tests run: 2, Failures: 0, Errors: 0, Skipped: 0, Time elapsed: 0.002 sec - in org.apache.cloudstack.region.RegionManagerTest

Results :

Tests in error: 
  SecurityGroupQueueTest.testNumJobsEqToNumVms3:143->testNumJobsEqToNumVms2:124 ยป OutOfMemory

Tests run: 257, Failures: 0, Errors: 1, Skipped: 3

[INFO] ------------------------------------------------------------------------
[INFO] Reactor Summary:
[INFO] 
[INFO] Apache CloudStack Developer Tools - Checkstyle Configuration  SUCCESS [2.072s]
[INFO] Apache CloudStack ................................. SUCCESS [2.198s]
[INFO] Apache CloudStack Maven Conventions Parent ........ SUCCESS [1.889s]
[INFO] Apache CloudStack Framework - Managed Context ..... SUCCESS [5.497s]
[INFO] Apache CloudStack Utils ........................... SUCCESS [42.132s]
[INFO] Apache CloudStack Framework ....................... SUCCESS [0.061s]
[INFO] Apache CloudStack Framework - Event Notification .. SUCCESS [9.395s]
[INFO] Apache CloudStack Framework - Configuration ....... SUCCESS [6.850s]
[INFO] Apache CloudStack API ............................. SUCCESS [22.063s]
[INFO] Apache CloudStack Framework - REST ................ SUCCESS [6.377s]
[INFO] Apache CloudStack Framework - IPC ................. SUCCESS [8.428s]
[INFO] Apache CloudStack Cloud Engine .................... SUCCESS [0.037s]
[INFO] Apache CloudStack Cloud Engine API ................ SUCCESS [10.186s]
[INFO] Apache CloudStack Framework - Security ............ SUCCESS [5.657s]
[INFO] Apache CloudStack Core ............................ SUCCESS [16.866s]
[INFO] Apache CloudStack Agents .......................... SUCCESS [8.903s]
[INFO] Apache CloudStack Framework - Clustering .......... SUCCESS [3.728s]
[INFO] Apache CloudStack Framework - Event Notification .. SUCCESS [2.298s]
[INFO] Apache CloudStack Cloud Engine Schema Component ... SUCCESS [12.454s]
[INFO] Apache CloudStack Framework - Jobs ................ SUCCESS [6.098s]
[INFO] Apache CloudStack Cloud Engine Internal Components API  SUCCESS [3.149s]
[INFO] Apache CloudStack Server .......................... FAILURE [44.014s]
[INFO] Apache CloudStack Usage Server .................... SKIPPED
[INFO] Apache CloudStack Cloud Engine Orchestration Component  SKIPPED
[INFO] Apache CloudStack Cloud Services .................. SKIPPED
[INFO] Apache CloudStack Secondary Storage ............... SKIPPED
[INFO] Apache CloudStack Secondary Storage Service ....... SKIPPED
[INFO] Apache CloudStack Engine Storage Component ........ SKIPPED
[INFO] Apache CloudStack Engine Storage Volume Component . SKIPPED
[INFO] Apache CloudStack Engine Storage Image Component .. SKIPPED
[INFO] Apache CloudStack Engine Storage Data Motion Component  SKIPPED
[INFO] Apache CloudStack Engine Storage Cache Component .. SKIPPED
[INFO] Apache CloudStack Engine Storage Snapshot Component  SKIPPED
[INFO] Apache CloudStack Cloud Engine API ................ SKIPPED
[INFO] Apache CloudStack Cloud Engine Service ............ SKIPPED
[INFO] Apache CloudStack Plugin POM ...................... SKIPPED
[INFO] Apache CloudStack Plugin - API Rate Limit ......... SKIPPED
[INFO] Apache CloudStack Plugin - Storage Volume default provider  SKIPPED
[INFO] Apache CloudStack Plugin - Storage Volume SolidFire Provider  SKIPPED
[INFO] Apache CloudStack Plugin - API SolidFire .......... SKIPPED
[INFO] Apache CloudStack Plugin - API Discovery .......... SKIPPED
[INFO] Apache CloudStack Plugin - ACL Static Role Based .. SKIPPED
[INFO] Apache CloudStack Plugin - Host Anti-Affinity Processor  SKIPPED
[INFO] Apache CloudStack Plugin - Explicit Dedication Processor  SKIPPED
[INFO] Apache CloudStack Plugin - User Concentrated Pod Deployment Planner  SKIPPED
[INFO] Apache CloudStack Plugin - User Dispersing Deployment Planner  SKIPPED
[INFO] Apache CloudStack Plugin - Implicit Dedication Planner  SKIPPED
[INFO] Apache CloudStack Plugin - Skip Heurestics Planner  SKIPPED
[INFO] Apache CloudStack Plugin - Host Allocator Random .. SKIPPED
[INFO] Apache CloudStack Plugin - Dedicated Resources .... SKIPPED
[INFO] Apache CloudStack Plugin - Hypervisor OracleVM .... SKIPPED
[INFO] Apache CloudStack Plugin - Open vSwitch ........... SKIPPED
[INFO] Apache CloudStack Plugin - Hypervisor XenServer ... SKIPPED
[INFO] Apache CloudStack Plugin - Hypervisor KVM ......... SKIPPED
[INFO] Apache CloudStack Plugin - RabbitMQ Event Bus ..... SKIPPED
[INFO] Apache CloudStack Plugin - In Memory Event Bus .... SKIPPED
[INFO] Apache CloudStack Plugin - Hypervisor Baremetal ... SKIPPED
[INFO] Apache CloudStack Plugin - Hypervisor UCS ......... SKIPPED
[INFO] Apache CloudStack Plugin - Hypervisor Hyper-V ..... SKIPPED
[INFO] Apache CloudStack Plugin - Network Elastic Load Balancer  SKIPPED
[INFO] Apache CloudStack Plugin - Network Internal Load Balancer  SKIPPED
[INFO] Apache CloudStack Framework - Spring Life Cycle ... SKIPPED
[INFO] Apache CloudStack Plugin - Network Juniper Contrail  SKIPPED
[INFO] Apache CloudStack Plugin - Palo Alto .............. SKIPPED
[INFO] Apache CloudStack Plugin - Network Netscaler ...... SKIPPED
[INFO] Apache CloudStack Plugin - Network Nicira NVP ..... SKIPPED
[INFO] Apache CloudStack Plugin - BigSwitch Virtual Network Segment  SKIPPED
[INFO] Apache CloudStack Plugin - Network Brocade VCS .... SKIPPED
[INFO] Apache CloudStack Plugin - Midokura Midonet ....... SKIPPED
[INFO] Apache CloudStack Plugin - Stratosphere SSP ....... SKIPPED
[INFO] Apache CloudStack Plugin - Network Opendaylight ... SKIPPED
[INFO] Apache CloudStack Plugin - Storage Allocator Random  SKIPPED
[INFO] Apache CloudStack Plugin - User Authenticator LDAP  SKIPPED
[INFO] Apache CloudStack Plugin - User Authenticator MD5 . SKIPPED
[INFO] Apache CloudStack Plugin - User Authenticator PBKDF2-SHA-256  SKIPPED
[INFO] Apache CloudStack Plugin - User Authenticator Plain Text  SKIPPED
[INFO] Apache CloudStack Plugin - User Authenticator SAML2  SKIPPED
[INFO] Apache CloudStack Plugin - User Authenticator SHA256 Salted  SKIPPED
[INFO] Apache CloudStack Plugin - Dns Notifier Example ... SKIPPED
[INFO] Apache CloudStack Plugin - Storage Image S3 ....... SKIPPED
[INFO] Apache CloudStack Plugin - Storage Image Swift provider  SKIPPED
[INFO] Apache CloudStack Plugin - Storage Image default provider  SKIPPED
[INFO] Apache CloudStack Plugin - Storage Image sample provider  SKIPPED
[INFO] Apache CloudStack Plugin - Storage Volume Nexenta Provider  SKIPPED
[INFO] Apache CloudStack Plugin - Storage Volume CloudByte Provider  SKIPPED
[INFO] Apache CloudStack Plugin - Storage Volume sample provider  SKIPPED
[INFO] Apache CloudStack Plugin - SNMP Alerts ............ SKIPPED
[INFO] Apache CloudStack Plugin - Syslog Alerts .......... SKIPPED
[INFO] Apache CloudStack Plugin - Network VXLAN .......... SKIPPED
[INFO] Apache CloudStack Plugin - GloboDNS ............... SKIPPED
[INFO] Apache CloudStack Framework - Spring Module ....... SKIPPED
[INFO] Apache CloudStack Secondary Storage Controller .... SKIPPED
[INFO] Apache CloudStack Console Proxy - RDP Client ...... SKIPPED
[INFO] Apache CloudStack Console Proxy ................... SKIPPED
[INFO] Apache CloudStack Console Proxy - Server .......... SKIPPED
[INFO] Apache CloudStack System VM ....................... SKIPPED
[INFO] Apache CloudStack Client UI ....................... SKIPPED
[INFO] Apache CloudStack Framework - QuickCloud .......... SKIPPED
[INFO] Apache CloudStack AWS API Bridge .................. SKIPPED
[INFO] ------------------------------------------------------------------------
[INFO] BUILD FAILURE
[INFO] ------------------------------------------------------------------------
[INFO] Total time: 3:44.341s
[INFO] Finished at: Mon Mar 02 12:23:10 CET 2015
[INFO] Final Memory: 51M/370M
[INFO] ------------------------------------------------------------------------
[ERROR] Failed to execute goal org.apache.maven.plugins:maven-surefire-plugin:2.18.1:test
(default-test) on project cloud-server: There are test failures.
[ERROR] 
[ERROR] Please refer to <http://jenkins.buildacloud.org/job/build-master/ws/server/target/surefire-reports>
for the individual test results.
[ERROR] -> [Help 1]
[ERROR] 
[ERROR] To see the full stack trace of the errors, re-run Maven with the -e switch.
[ERROR] Re-run Maven using the -X switch to enable full debug logging.
[ERROR] 
[ERROR] For more information about the errors and possible solutions, please read the following
articles:
[ERROR] [Help 1] http://cwiki.apache.org/confluence/display/MAVEN/MojoFailureException
[ERROR] 
[ERROR] After correcting the problems, you can resume the build with the command
[ERROR]   mvn <goals> -rf :cloud-server
Build step 'Invoke top-level Maven targets' marked build as failure
Recording test results

Mime
View raw message