cloudstack-dev mailing list archives

Site index · List index
Message view « Date » · « Thread »
Top « Date » · « Thread »
From jenk...@cloudstack.org
Subject Build failed in Jenkins: build-master-simulator #1782
Date Mon, 09 Mar 2015 02:28:09 GMT
See <http://jenkins.buildacloud.org/job/build-master-simulator/1782/changes>

Changes:

[Pierre-Luc Dion] CLOUDSTACK-4719: update API description for details, example for xenserver
tools

------------------------------------------
[...truncated 1270 lines...]
[INFO] 
[INFO] --- maven-surefire-plugin:2.18.1:test (default-test) @ cloud-engine-components-api
---
[INFO]                                                                         
[INFO] ------------------------------------------------------------------------
[INFO] Building Apache CloudStack Server 4.6.0-SNAPSHOT
[INFO] ------------------------------------------------------------------------
[INFO] 
[INFO] --- maven-clean-plugin:2.5:clean (default-clean) @ cloud-server ---
[INFO] Deleting <http://jenkins.buildacloud.org/job/build-master-simulator/ws/server/target>
(includes = [**/*], excludes = [])
[INFO] Deleting <http://jenkins.buildacloud.org/job/build-master-simulator/ws/server>
(includes = [target, dist], excludes = [])
[INFO] 
[INFO] --- maven-checkstyle-plugin:2.11:check (cloudstack-checkstyle) @ cloud-server ---
[INFO] Starting audit...
Audit done.

[INFO] 
[INFO] --- maven-remote-resources-plugin:1.3:process (default) @ cloud-server ---
[INFO] 
[INFO] --- maven-antrun-plugin:1.8:run (generate-resource) @ cloud-server ---
[INFO] Executing tasks

main:
     [copy] Copying 3 files to <http://jenkins.buildacloud.org/job/build-master-simulator/ws/server/target/conf>
     [copy] Copying 1 file to <http://jenkins.buildacloud.org/job/build-master-simulator/ws/server/target/conf>
[INFO] Executed tasks
[INFO] 
[INFO] --- maven-resources-plugin:2.5:resources (default-resources) @ cloud-server ---
[debug] execute contextualize
[INFO] Using 'UTF-8' encoding to copy filtered resources.
[INFO] Copying 30 resources
[INFO] Copying 3 resources
[INFO] 
[INFO] --- maven-compiler-plugin:3.2:compile (default-compile) @ cloud-server ---
[INFO] Changes detected - recompiling the module!
[INFO] Compiling 403 source files to <http://jenkins.buildacloud.org/job/build-master-simulator/ws/server/target/classes>
[INFO] 
[INFO] --- maven-resources-plugin:2.5:testResources (default-testResources) @ cloud-server
---
[debug] execute contextualize
[INFO] Using 'UTF-8' encoding to copy filtered resources.
[INFO] Copying 33 resources
[INFO] Copying 3 resources
[INFO] 
[INFO] --- maven-compiler-plugin:3.2:testCompile (default-testCompile) @ cloud-server ---
[INFO] Changes detected - recompiling the module!
[INFO] Compiling 99 source files to <http://jenkins.buildacloud.org/job/build-master-simulator/ws/server/target/test-classes>
[INFO] 
[INFO] --- maven-surefire-plugin:2.18.1:test (default-test) @ cloud-server ---
[INFO] Surefire report directory: <http://jenkins.buildacloud.org/job/build-master-simulator/ws/server/target/surefire-reports>

-------------------------------------------------------
 T E S T S
-------------------------------------------------------
log4j:WARN No appenders could be found for logger (org.springframework.test.context.junit4.SpringJUnit4ClassRunner).
log4j:WARN Please initialize the log4j system properly.
log4j:WARN See http://logging.apache.org/log4j/1.2/faq.html#noconfig for more info.
Running com.cloud.event.EventControlsUnitTest
Tests run: 1, Failures: 0, Errors: 0, Skipped: 0, Time elapsed: 0.327 sec - in com.cloud.event.EventControlsUnitTest
Running com.cloud.keystore.KeystoreTest
org.apache.cloudstack.api.response.UserVmResponse/null/{"id":"3","securitygroup":[],"nic":[],"tags":[],"affinitygroup":[]}
org.apache.cloudstack.api.response.AlertResponse/null/{"id":"100","description":"Hello"}
Tests run: 1, Failures: 0, Errors: 0, Skipped: 0, Time elapsed: 0.15 sec - in com.cloud.keystore.KeystoreTest
Running com.cloud.alert.AlertControlsUnitTest
Tests run: 1, Failures: 0, Errors: 0, Skipped: 0, Time elapsed: 0.024 sec - in com.cloud.alert.AlertControlsUnitTest
Running com.cloud.capacity.CapacityManagerTest
Tests run: 1, Failures: 0, Errors: 0, Skipped: 0, Time elapsed: 0.13 sec - in com.cloud.capacity.CapacityManagerTest
Running com.cloud.servlet.StaticResourceServletTest
Tests run: 12, Failures: 0, Errors: 0, Skipped: 0, Time elapsed: 0.139 sec - in com.cloud.servlet.StaticResourceServletTest
Running com.cloud.servlet.ConsoleProxyServletTest
Tests run: 1, Failures: 0, Errors: 0, Skipped: 0, Time elapsed: 0.002 sec - in com.cloud.servlet.ConsoleProxyServletTest
Running com.cloud.resourcelimit.ResourceLimitManagerImplTest
Tests run: 1, Failures: 0, Errors: 0, Skipped: 0, Time elapsed: 0.001 sec - in com.cloud.resourcelimit.ResourceLimitManagerImplTest
Running com.cloud.network.firewall.FirewallManagerTest
Tests run: 1, Failures: 0, Errors: 0, Skipped: 1, Time elapsed: 0 sec - in com.cloud.network.firewall.FirewallManagerTest
Running com.cloud.network.ExternalLoadBalancerDeviceManagerImplTest
Tests run: 2, Failures: 0, Errors: 0, Skipped: 0, Time elapsed: 0.46 sec - in com.cloud.network.ExternalLoadBalancerDeviceManagerImplTest
Running com.cloud.network.element.VirtualRouterElementTest
Tests run: 2, Failures: 0, Errors: 0, Skipped: 2, Time elapsed: 0.005 sec - in com.cloud.network.element.VirtualRouterElementTest
Running com.cloud.network.UpdatePhysicalNetworkTest
Tests run: 1, Failures: 0, Errors: 0, Skipped: 0, Time elapsed: 0.141 sec - in com.cloud.network.UpdatePhysicalNetworkTest
Running com.cloud.network.CreatePrivateNetworkTest
Tests run: 1, Failures: 0, Errors: 0, Skipped: 0, Time elapsed: 0.035 sec - in com.cloud.network.CreatePrivateNetworkTest
Running com.cloud.network.NetworkModelTest
Tests run: 1, Failures: 0, Errors: 0, Skipped: 0, Time elapsed: 0.031 sec - in com.cloud.network.NetworkModelTest
Running com.cloud.network.router.NetworkHelperImplTest
Tests run: 4, Failures: 0, Errors: 0, Skipped: 0, Time elapsed: 0.049 sec - in com.cloud.network.router.NetworkHelperImplTest
Running com.cloud.network.router.RouterControlHelperTest
Tests run: 2, Failures: 0, Errors: 0, Skipped: 0, Time elapsed: 0.043 sec - in com.cloud.network.router.RouterControlHelperTest
Running com.cloud.network.router.VirtualNetworkApplianceManagerImplTest
Tests run: 2, Failures: 0, Errors: 0, Skipped: 0, Time elapsed: 0.212 sec - in com.cloud.network.router.VirtualNetworkApplianceManagerImplTest
Running com.cloud.network.security.SecurityGroupManagerImplTest
Tests run: 4, Failures: 0, Errors: 0, Skipped: 0, Time elapsed: 2.694 sec - in com.cloud.network.security.SecurityGroupManagerImplTest
Running com.cloud.network.security.SecurityGroupQueueTest
Total jobs dequeued = 10, num queued=1001 queue current size=991
Num Vms= 50 Queue size = 50
Num Vms= 20000 Queue size = 20000 time=875 ms
Tests run: 4, Failures: 0, Errors: 2, Skipped: 0, Time elapsed: 1.179 sec <<< FAILURE!
- in com.cloud.network.security.SecurityGroupQueueTest
testNumJobsEqToNumVms3(com.cloud.network.security.SecurityGroupQueueTest)  Time elapsed: 1.032
sec  <<< ERROR!
java.lang.OutOfMemoryError: unable to create new native thread
	at java.lang.Thread.start0(Native Method)
	at java.lang.Thread.start(Thread.java:693)
	at com.cloud.network.security.SecurityGroupQueueTest.testNumJobsEqToNumVms2(SecurityGroupQueueTest.java:124)
	at com.cloud.network.security.SecurityGroupQueueTest.testNumJobsEqToNumVms3(SecurityGroupQueueTest.java:140)

testDequeueOneJob(com.cloud.network.security.SecurityGroupQueueTest)  Time elapsed: 0.003
sec  <<< ERROR!
java.lang.OutOfMemoryError: unable to create new native thread
	at java.lang.Thread.start0(Native Method)
	at java.lang.Thread.start(Thread.java:693)
	at com.cloud.network.security.SecurityGroupQueueTest._testDequeueOneJob(SecurityGroupQueueTest.java:166)
	at com.cloud.network.security.SecurityGroupQueueTest.testDequeueOneJob(SecurityGroupQueueTest.java:213)

Running com.cloud.network.vpc.VpcManagerImplTest
Tests run: 1, Failures: 0, Errors: 0, Skipped: 0, Time elapsed: 0.016 sec - in com.cloud.network.vpc.VpcManagerImplTest
Running com.cloud.network.DedicateGuestVlanRangesTest
Tests run: 2, Failures: 0, Errors: 0, Skipped: 0, Time elapsed: 0.021 sec - in com.cloud.network.DedicateGuestVlanRangesTest
Running com.cloud.network.lb.AssignLoadBalancerTest
Tests run: 4, Failures: 0, Errors: 0, Skipped: 0, Time elapsed: 0.042 sec - in com.cloud.network.lb.AssignLoadBalancerTest
Running com.cloud.network.lb.UpdateLoadBalancerTest
Tests run: 2, Failures: 0, Errors: 0, Skipped: 0, Time elapsed: 0.043 sec - in com.cloud.network.lb.UpdateLoadBalancerTest
Running com.cloud.network.dao.NetworkDaoTest
Tests run: 2, Failures: 0, Errors: 0, Skipped: 0, Time elapsed: 0 sec - in com.cloud.network.dao.NetworkDaoTest
Running com.cloud.vm.FirstFitPlannerTest
Tests run: 1, Failures: 0, Errors: 0, Skipped: 0, Time elapsed: 0.381 sec - in com.cloud.vm.FirstFitPlannerTest
Running com.cloud.vm.DeploymentPlanningManagerImplTest
Tests run: 3, Failures: 0, Errors: 0, Skipped: 0, Time elapsed: 0.497 sec - in com.cloud.vm.DeploymentPlanningManagerImplTest
Running com.cloud.vm.snapshot.VMSnapshotManagerTest
Tests run: 7, Failures: 0, Errors: 0, Skipped: 0, Time elapsed: 0.11 sec - in com.cloud.vm.snapshot.VMSnapshotManagerTest
Running com.cloud.vm.UserVmManagerTest
Tests run: 9, Failures: 0, Errors: 0, Skipped: 0, Time elapsed: 0.192 sec - in com.cloud.vm.UserVmManagerTest
Running com.cloud.configuration.ValidateIpRangeTest
Tests run: 3, Failures: 0, Errors: 0, Skipped: 0, Time elapsed: 0.01 sec - in com.cloud.configuration.ValidateIpRangeTest
Running com.cloud.configuration.ConfigurationManagerTest
Tests run: 9, Failures: 0, Errors: 0, Skipped: 0, Time elapsed: 0.042 sec - in com.cloud.configuration.ConfigurationManagerTest
Running com.cloud.server.ConfigurationServerImplTest
Tests run: 4, Failures: 0, Errors: 0, Skipped: 0, Time elapsed: 0.004 sec - in com.cloud.server.ConfigurationServerImplTest
Running com.cloud.template.TemplateManagerImplTest
Tests run: 1, Failures: 0, Errors: 0, Skipped: 0, Time elapsed: 0.006 sec - in com.cloud.template.TemplateManagerImplTest
Running com.cloud.vpc.Site2SiteVpnTest
Tests run: 1, Failures: 0, Errors: 0, Skipped: 0, Time elapsed: 2.063 sec - in com.cloud.vpc.Site2SiteVpnTest
Running com.cloud.vpc.NetworkACLServiceTest
Tests run: 5, Failures: 0, Errors: 0, Skipped: 0, Time elapsed: 0.162 sec - in com.cloud.vpc.NetworkACLServiceTest
Running com.cloud.vpc.NetworkACLManagerTest
Tests run: 6, Failures: 0, Errors: 0, Skipped: 0, Time elapsed: 0.175 sec - in com.cloud.vpc.NetworkACLManagerTest
Running com.cloud.storage.VolumeApiServiceImplTest
Tests run: 11, Failures: 0, Errors: 0, Skipped: 0, Time elapsed: 0.109 sec - in com.cloud.storage.VolumeApiServiceImplTest
Running com.cloud.user.AccountManagerImplTest
Tests run: 5, Failures: 0, Errors: 0, Skipped: 0, Time elapsed: 0.116 sec - in com.cloud.user.AccountManagerImplTest
Running com.cloud.api.ApiServletTest
Tests run: 13, Failures: 0, Errors: 0, Skipped: 0, Time elapsed: 0.063 sec - in com.cloud.api.ApiServletTest
Running com.cloud.api.ApiResponseHelperTest
Tests run: 1, Failures: 0, Errors: 0, Skipped: 0, Time elapsed: 0.015 sec - in com.cloud.api.ApiResponseHelperTest
Running com.cloud.api.dispatch.ParamGenericValidationWorkerTest
Tests run: 4, Failures: 0, Errors: 0, Skipped: 0, Time elapsed: 0.011 sec - in com.cloud.api.dispatch.ParamGenericValidationWorkerTest
Running com.cloud.api.dispatch.DispatchChainFactoryTest
Tests run: 1, Failures: 0, Errors: 0, Skipped: 0, Time elapsed: 0.002 sec - in com.cloud.api.dispatch.DispatchChainFactoryTest
Running com.cloud.api.dispatch.CommandCreationWorkerTest
Tests run: 1, Failures: 0, Errors: 0, Skipped: 0, Time elapsed: 0.004 sec - in com.cloud.api.dispatch.CommandCreationWorkerTest
Running com.cloud.api.dispatch.SpecificCmdValidationWorkerTest
Tests run: 1, Failures: 0, Errors: 0, Skipped: 0, Time elapsed: 0.002 sec - in com.cloud.api.dispatch.SpecificCmdValidationWorkerTest
Running com.cloud.api.dispatch.ParamProcessWorkerTest
Tests run: 1, Failures: 0, Errors: 0, Skipped: 0, Time elapsed: 0.002 sec - in com.cloud.api.dispatch.ParamProcessWorkerTest
Running com.cloud.ha.KVMFencerTest
Tests run: 6, Failures: 0, Errors: 0, Skipped: 0, Time elapsed: 0.013 sec - in com.cloud.ha.KVMFencerTest
Running com.cloud.ha.HighAvailabilityManagerImplTest
Tests run: 1, Failures: 0, Errors: 0, Skipped: 0, Time elapsed: 0.016 sec - in com.cloud.ha.HighAvailabilityManagerImplTest
Running org.cloud.network.router.deployment.VpcRouterDeploymentDefinitionTest
Tests run: 15, Failures: 0, Errors: 0, Skipped: 0, Time elapsed: 0.11 sec - in org.cloud.network.router.deployment.VpcRouterDeploymentDefinitionTest
Running org.cloud.network.router.deployment.RouterDeploymentDefinitionTest
Tests run: 43, Failures: 0, Errors: 0, Skipped: 0, Time elapsed: 0.207 sec - in org.cloud.network.router.deployment.RouterDeploymentDefinitionTest
Running org.apache.cloudstack.networkoffering.CreateNetworkOfferingTest
Tests run: 10, Failures: 0, Errors: 0, Skipped: 0, Time elapsed: 2.565 sec - in org.apache.cloudstack.networkoffering.CreateNetworkOfferingTest
Running org.apache.cloudstack.privategw.AclOnPrivateGwTest
Tests run: 2, Failures: 0, Errors: 0, Skipped: 0, Time elapsed: 0.143 sec - in org.apache.cloudstack.privategw.AclOnPrivateGwTest
Running org.apache.cloudstack.service.ServiceOfferingVOTest
Tests run: 2, Failures: 0, Errors: 0, Skipped: 0, Time elapsed: 0 sec - in org.apache.cloudstack.service.ServiceOfferingVOTest
Running org.apache.cloudstack.affinity.AffinityApiUnitTest
Tests run: 7, Failures: 0, Errors: 0, Skipped: 0, Time elapsed: 0.142 sec - in org.apache.cloudstack.affinity.AffinityApiUnitTest
Running org.apache.cloudstack.network.lb.ApplicationLoadBalancerTest
Tests run: 11, Failures: 0, Errors: 0, Skipped: 0, Time elapsed: 0.284 sec - in org.apache.cloudstack.network.lb.ApplicationLoadBalancerTest
Running org.apache.cloudstack.network.lb.CertServiceTest
Tests run: 14, Failures: 0, Errors: 0, Skipped: 0, Time elapsed: 0.314 sec - in org.apache.cloudstack.network.lb.CertServiceTest
Running org.apache.cloudstack.region.gslb.GlobalLoadBalancingRulesServiceImplTest
Tests run: 4, Failures: 0, Errors: 0, Skipped: 0, Time elapsed: 0.03 sec - in org.apache.cloudstack.region.gslb.GlobalLoadBalancingRulesServiceImplTest
Running org.apache.cloudstack.region.RegionManagerTest
Tests run: 2, Failures: 0, Errors: 0, Skipped: 0, Time elapsed: 0 sec - in org.apache.cloudstack.region.RegionManagerTest

Results :

Tests in error: 
  SecurityGroupQueueTest.testDequeueOneJob:213->_testDequeueOneJob:166 » OutOfMemory
  SecurityGroupQueueTest.testNumJobsEqToNumVms3:140->testNumJobsEqToNumVms2:124 » OutOfMemory

Tests run: 257, Failures: 0, Errors: 2, Skipped: 3

[INFO] ------------------------------------------------------------------------
[INFO] Reactor Summary:
[INFO] 
[INFO] Apache CloudStack Developer Tools - Checkstyle Configuration  SUCCESS [0.780s]
[INFO] Apache CloudStack ................................. SUCCESS [0.570s]
[INFO] Apache CloudStack Maven Conventions Parent ........ SUCCESS [1.008s]
[INFO] Apache CloudStack Framework - Managed Context ..... SUCCESS [2.843s]
[INFO] Apache CloudStack Utils ........................... SUCCESS [19.145s]
[INFO] Apache CloudStack Framework ....................... SUCCESS [0.037s]
[INFO] Apache CloudStack Framework - Event Notification .. SUCCESS [6.119s]
[INFO] Apache CloudStack Framework - Configuration ....... SUCCESS [3.966s]
[INFO] Apache CloudStack API ............................. SUCCESS [11.496s]
[INFO] Apache CloudStack Framework - REST ................ SUCCESS [2.331s]
[INFO] Apache CloudStack Framework - IPC ................. SUCCESS [3.857s]
[INFO] Apache CloudStack Cloud Engine .................... SUCCESS [0.032s]
[INFO] Apache CloudStack Cloud Engine API ................ SUCCESS [4.277s]
[INFO] Apache CloudStack Framework - Security ............ SUCCESS [1.948s]
[INFO] Apache CloudStack Core ............................ SUCCESS [8.726s]
[INFO] Apache CloudStack Agents .......................... SUCCESS [5.178s]
[INFO] Apache CloudStack Framework - Clustering .......... SUCCESS [2.553s]
[INFO] Apache CloudStack Framework - Event Notification .. SUCCESS [1.513s]
[INFO] Apache CloudStack Cloud Engine Schema Component ... SUCCESS [11.037s]
[INFO] Apache CloudStack Framework - Jobs ................ SUCCESS [4.288s]
[INFO] Apache CloudStack Cloud Engine Internal Components API  SUCCESS [2.563s]
[INFO] Apache CloudStack Server .......................... FAILURE [31.950s]
[INFO] Apache CloudStack Cloud Services .................. SKIPPED
[INFO] Apache CloudStack Secondary Storage ............... SKIPPED
[INFO] Apache CloudStack Secondary Storage Service ....... SKIPPED
[INFO] Apache CloudStack Engine Storage Component ........ SKIPPED
[INFO] Apache CloudStack Engine Storage Volume Component . SKIPPED
[INFO] Apache CloudStack Engine Storage Image Component .. SKIPPED
[INFO] Apache CloudStack Engine Storage Snapshot Component  SKIPPED
[INFO] Apache CloudStack Plugin POM ...................... SKIPPED
[INFO] Apache CloudStack Plugin - Hypervisor Simulator ... SKIPPED
[INFO] ------------------------------------------------------------------------
[INFO] BUILD FAILURE
[INFO] ------------------------------------------------------------------------
[INFO] Total time: 2:07.952s
[INFO] Finished at: Mon Mar 09 03:28:01 CET 2015
[INFO] Final Memory: 60M/371M
[INFO] ------------------------------------------------------------------------
[ERROR] Failed to execute goal org.apache.maven.plugins:maven-surefire-plugin:2.18.1:test
(default-test) on project cloud-server: There are test failures.
[ERROR] 
[ERROR] Please refer to <http://jenkins.buildacloud.org/job/build-master-simulator/ws/server/target/surefire-reports>
for the individual test results.
[ERROR] -> [Help 1]
[ERROR] 
[ERROR] To see the full stack trace of the errors, re-run Maven with the -e switch.
[ERROR] Re-run Maven using the -X switch to enable full debug logging.
[ERROR] 
[ERROR] For more information about the errors and possible solutions, please read the following
articles:
[ERROR] [Help 1] http://cwiki.apache.org/confluence/display/MAVEN/MojoFailureException
[ERROR] 
[ERROR] After correcting the problems, you can resume the build with the command
[ERROR]   mvn <goals> -rf :cloud-server
Build step 'Invoke top-level Maven targets' marked build as failure
Recording test results

Mime
View raw message