cloudstack-dev mailing list archives

Site index · List index
Message view « Date » · « Thread »
Top « Date » · « Thread »
Subject Build failed in Jenkins: build-master-simulator #1807
Date Thu, 12 Mar 2015 05:55:39 GMT
See <>


[talluri] CLOUDSTACK-8290: Adding BVT to verofy product issue

Started by an SCM change
[EnvInject] - Loading node environment variables.
Building remotely on cloudstack-buildslave-centos6-9ee (cloudstack-buildslave-centos6) in
workspace <>
 > /usr/bin/git rev-parse --is-inside-work-tree # timeout=400
Fetching changes from the remote Git repository
 > /usr/bin/git config remote.origin.url
# timeout=400
Fetching upstream changes from
 > /usr/bin/git --version # timeout=400
 > /usr/bin/git fetch --tags --progress
 > /usr/bin/git rev-parse refs/remotes/origin/master^{commit} # timeout=400
 > /usr/bin/git rev-parse refs/remotes/origin/origin/master^{commit} # timeout=400
Checking out Revision ff9ab5caa96f4b3cac9eabf08034ce40c4b389be (refs/remotes/origin/master)
 > /usr/bin/git config core.sparsecheckout # timeout=400
 > /usr/bin/git checkout -f ff9ab5caa96f4b3cac9eabf08034ce40c4b389be
 > /usr/bin/git rev-list cd66844e9cbb92e4061555a7869471bd7287d61f # timeout=400
[copy-to-slave] Copying 'settings.xml', excluding nothing, from 'file:/var/lib/jenkins/userContent/'
on the master to '<'> on
[build-master-simulator] $ /jenkins/tools/hudson.tasks.Maven_MavenInstallation/maven-3.1.1/bin/mvn
-s <> -Psimulator
-pl plugins/hypervisors/simulator -am clean test
[INFO] Scanning for projects...
[INFO] ------------------------------------------------------------------------
[INFO] Reactor Build Order:
[INFO] Apache CloudStack Developer Tools - Checkstyle Configuration
[INFO] Apache CloudStack
[INFO] Apache CloudStack Maven Conventions Parent
[INFO] Apache CloudStack Framework - Managed Context
[INFO] Apache CloudStack Utils
[INFO] Apache CloudStack Framework
[INFO] Apache CloudStack Framework - Event Notification
[INFO] Apache CloudStack Framework - Configuration
[INFO] Apache CloudStack API
[INFO] Apache CloudStack Framework - REST
[INFO] Apache CloudStack Framework - IPC
[INFO] Apache CloudStack Cloud Engine
[INFO] Apache CloudStack Cloud Engine API
[INFO] Apache CloudStack Framework - Security
[INFO] Apache CloudStack Core
[INFO] Apache CloudStack Agents
[INFO] Apache CloudStack Framework - Clustering
[INFO] Apache CloudStack Framework - Event Notification
[INFO] Apache CloudStack Cloud Engine Schema Component
[INFO] Apache CloudStack Framework - Jobs
[INFO] Apache CloudStack Cloud Engine Internal Components API
[INFO] Apache CloudStack Server
[INFO] Apache CloudStack Cloud Services
[INFO] Apache CloudStack Secondary Storage
[INFO] Apache CloudStack Secondary Storage Service
[INFO] Apache CloudStack Engine Storage Component
[INFO] Apache CloudStack Engine Storage Volume Component
[INFO] Apache CloudStack Engine Storage Image Component
[INFO] Apache CloudStack Engine Storage Snapshot Component
[INFO] Apache CloudStack Plugin POM
[INFO] Apache CloudStack Plugin - Hypervisor Simulator
[INFO] ------------------------------------------------------------------------
[INFO] Building Apache CloudStack Developer Tools - Checkstyle Configuration 4.6.0-SNAPSHOT
[INFO] ------------------------------------------------------------------------
[INFO] --- maven-clean-plugin:2.5:clean (default-clean) @ checkstyle ---
[INFO] Deleting <>
[INFO] --- maven-resources-plugin:2.6:resources (default-resources) @ checkstyle ---
[WARNING] Using platform encoding (UTF-8 actually) to copy filtered resources, i.e. build
is platform dependent!
[INFO] Copying 3 resources
[INFO] --- maven-compiler-plugin:2.5.1:compile (default-compile) @ checkstyle ---
[INFO] No sources to compile
[INFO] --- maven-resources-plugin:2.6:testResources (default-testResources) @ checkstyle ---
[WARNING] Using platform encoding (UTF-8 actually) to copy filtered resources, i.e. build
is platform dependent!
[INFO] skip non existing resourceDirectory <>
[INFO] --- maven-compiler-plugin:2.5.1:testCompile (default-testCompile) @ checkstyle ---
[INFO] No sources to compile
[INFO] --- maven-surefire-plugin:2.12.4:test (default-test) @ checkstyle ---
[INFO] No tests to run.
[INFO] ------------------------------------------------------------------------
[INFO] Building Apache CloudStack 4.6.0-SNAPSHOT
[INFO] ------------------------------------------------------------------------
[INFO] --- maven-clean-plugin:2.5:clean (default-clean) @ cloudstack ---
[INFO] Deleting <> (includes
= [target, dist], excludes = [])
[INFO] --- maven-remote-resources-plugin:1.3:process (default) @ cloudstack ---
[ERROR] unable to create new native thread -> [Help 1]
[ERROR] To see the full stack trace of the errors, re-run Maven with the -e switch.
[ERROR] Re-run Maven using the -X switch to enable full debug logging.
[ERROR] For more information about the errors and possible solutions, please read the following
[ERROR] [Help 1]
Build step 'Invoke top-level Maven targets' marked build as failure
Recording test results
ERROR: Publisher hudson.tasks.junit.JUnitResultArchiver aborted due to exception
hudson.AbortException: Test reports were found but none of them are new. Did tests run? 
For example, <>
is 2 days 18 hr old

	at hudson.tasks.junit.TestResult.parse(
	at hudson.tasks.junit.TestResult.parse(
	at hudson.tasks.junit.TestResult.<init>(
	at hudson.tasks.junit.JUnitParser$ParseResultCallable.invoke(
	at hudson.tasks.junit.JUnitParser$ParseResultCallable.invoke(
	at hudson.FilePath$
	at hudson.remoting.UserRequest.perform(
	at hudson.remoting.UserRequest.perform(
	at hudson.remoting.Request$
	at hudson.remoting.InterceptingExecutorService$
	at java.util.concurrent.FutureTask$Sync.innerRun(
	at java.util.concurrent.ThreadPoolExecutor.runWorker(
	at java.util.concurrent.ThreadPoolExecutor$
	at ......remote call to cloudstack-buildslave-centos6-9ee(Native Method)
	at hudson.remoting.Channel.attachCallSiteStackTrace(
	at hudson.remoting.UserResponse.retrieve(
	at hudson.FilePath.act(
	at hudson.FilePath.act(
	at hudson.tasks.junit.JUnitParser.parseResult(
	at hudson.tasks.junit.JUnitResultArchiver.parse(
	at hudson.tasks.junit.JUnitResultArchiver.perform(
	at hudson.tasks.BuildStepCompatibilityLayer.perform(
	at hudson.tasks.BuildStepMonitor$1.perform(
	at hudson.model.AbstractBuild$AbstractBuildExecution.perform(
	at hudson.model.AbstractBuild$AbstractBuildExecution.performAllBuildSteps(
	at hudson.model.Build$BuildExecution.post2(
	at hudson.model.AbstractBuild$
	at hudson.model.Run.execute(
	at hudson.model.ResourceController.execute(

View raw message