cloudstack-dev mailing list archives

Site index · List index
Message view « Date » · « Thread »
Top « Date » · « Thread »
From jenk...@cloudstack.org
Subject Build failed in Jenkins: simulator-singlerun #1060
Date Fri, 27 Mar 2015 11:28:04 GMT
See <http://jenkins.buildacloud.org/job/simulator-singlerun/1060/changes>

Changes:

[funs] Fix paths so they also work with tests on windows.

[funs] Only one thing can come from the agent

------------------------------------------
[...truncated 3967 lines...]
[INFO] Deleting <http://jenkins.buildacloud.org/job/simulator-singlerun/ws/plugins/hypervisors/ucs/target>
(includes = [**/*], excludes = [])
[INFO] Deleting <http://jenkins.buildacloud.org/job/simulator-singlerun/ws/plugins/hypervisors/ucs>
(includes = [target, dist], excludes = [])
[INFO] 
[INFO] --- maven-checkstyle-plugin:2.11:check (cloudstack-checkstyle) @ cloud-plugin-hypervisor-ucs
---
[INFO] Starting audit...
Audit done.

[INFO] 
[INFO] --- maven-remote-resources-plugin:1.3:process (default) @ cloud-plugin-hypervisor-ucs
---
[INFO] 
[INFO] --- maven-resources-plugin:2.5:resources (default-resources) @ cloud-plugin-hypervisor-ucs
---
[debug] execute contextualize
[INFO] Using 'UTF-8' encoding to copy filtered resources.
[INFO] Copying 1 resource
[INFO] Copying 3 resources
[INFO] 
[INFO] --- maven-compiler-plugin:3.2:compile (default-compile) @ cloud-plugin-hypervisor-ucs
---
[INFO] Changes detected - recompiling the module!
[INFO] Compiling 23 source files to <http://jenkins.buildacloud.org/job/simulator-singlerun/ws/plugins/hypervisors/ucs/target/classes>
[INFO] 
[INFO] --- maven-resources-plugin:2.5:testResources (default-testResources) @ cloud-plugin-hypervisor-ucs
---
[debug] execute contextualize
[INFO] Using 'UTF-8' encoding to copy filtered resources.
[INFO] skip non existing resourceDirectory <http://jenkins.buildacloud.org/job/simulator-singlerun/ws/plugins/hypervisors/ucs/test/resources>
[INFO] Copying 3 resources
[INFO] 
[INFO] --- maven-compiler-plugin:3.2:testCompile (default-testCompile) @ cloud-plugin-hypervisor-ucs
---
[INFO] No sources to compile
[INFO] 
[INFO] --- maven-surefire-plugin:2.18.1:test (default-test) @ cloud-plugin-hypervisor-ucs
---
[INFO] 
[INFO] --- maven-jar-plugin:2.5:jar (default-jar) @ cloud-plugin-hypervisor-ucs ---
[INFO] Building jar: <http://jenkins.buildacloud.org/job/simulator-singlerun/ws/plugins/hypervisors/ucs/target/cloud-plugin-hypervisor-ucs-4.6.0-SNAPSHOT.jar>
[INFO] 
[INFO] --- maven-site-plugin:3.3:attach-descriptor (attach-descriptor) @ cloud-plugin-hypervisor-ucs
---
[INFO] 
[INFO] --- maven-install-plugin:2.3.1:install (default-install) @ cloud-plugin-hypervisor-ucs
---
[INFO] Installing <http://jenkins.buildacloud.org/job/simulator-singlerun/ws/plugins/hypervisors/ucs/target/cloud-plugin-hypervisor-ucs-4.6.0-SNAPSHOT.jar>
to /var/lib/jenkins/.m2/repository/org/apache/cloudstack/cloud-plugin-hypervisor-ucs/4.6.0-SNAPSHOT/cloud-plugin-hypervisor-ucs-4.6.0-SNAPSHOT.jar
[INFO] Installing <http://jenkins.buildacloud.org/job/simulator-singlerun/ws/plugins/hypervisors/ucs/pom.xml>
to /var/lib/jenkins/.m2/repository/org/apache/cloudstack/cloud-plugin-hypervisor-ucs/4.6.0-SNAPSHOT/cloud-plugin-hypervisor-ucs-4.6.0-SNAPSHOT.pom
[INFO]                                                                         
[INFO] ------------------------------------------------------------------------
[INFO] Building Apache CloudStack Plugin - Hypervisor Hyper-V 4.6.0-SNAPSHOT
[INFO] ------------------------------------------------------------------------
[INFO] 
[INFO] --- maven-clean-plugin:2.5:clean (default-clean) @ cloud-plugin-hypervisor-hyperv ---
[INFO] Deleting <http://jenkins.buildacloud.org/job/simulator-singlerun/ws/plugins/hypervisors/hyperv/target>
(includes = [**/*], excludes = [])
[INFO] Deleting <http://jenkins.buildacloud.org/job/simulator-singlerun/ws/plugins/hypervisors/hyperv>
(includes = [target, dist], excludes = [])
[INFO] 
[INFO] --- maven-checkstyle-plugin:2.11:check (cloudstack-checkstyle) @ cloud-plugin-hypervisor-hyperv
---
[INFO] Starting audit...
Audit done.

[INFO] 
[INFO] --- maven-remote-resources-plugin:1.3:process (default) @ cloud-plugin-hypervisor-hyperv
---
[INFO] 
[INFO] --- maven-resources-plugin:2.5:resources (default-resources) @ cloud-plugin-hypervisor-hyperv
---
[debug] execute contextualize
[INFO] Using 'UTF-8' encoding to copy filtered resources.
[INFO] Copying 5 resources
[INFO] Copying 4 resources
[INFO] Copying 3 resources
[INFO] 
[INFO] --- maven-compiler-plugin:3.2:compile (default-compile) @ cloud-plugin-hypervisor-hyperv
---
[INFO] Changes detected - recompiling the module!
[INFO] Compiling 7 source files to <http://jenkins.buildacloud.org/job/simulator-singlerun/ws/plugins/hypervisors/hyperv/target/classes>
[INFO] 
[INFO] --- maven-resources-plugin:2.5:testResources (default-testResources) @ cloud-plugin-hypervisor-hyperv
---
[debug] execute contextualize
[INFO] Using 'UTF-8' encoding to copy filtered resources.
[INFO] skip non existing resourceDirectory <http://jenkins.buildacloud.org/job/simulator-singlerun/ws/plugins/hypervisors/hyperv/test/resources>
[INFO] Copying 3 resources
[INFO] 
[INFO] --- maven-compiler-plugin:3.2:testCompile (default-testCompile) @ cloud-plugin-hypervisor-hyperv
---
[INFO] Changes detected - recompiling the module!
[INFO] Compiling 1 source file to <http://jenkins.buildacloud.org/job/simulator-singlerun/ws/plugins/hypervisors/hyperv/target/test-classes>
[INFO] 
[INFO] --- maven-surefire-plugin:2.18.1:test (default-test) @ cloud-plugin-hypervisor-hyperv
---
[INFO] 
[INFO] --- maven-jar-plugin:2.5:jar (default-jar) @ cloud-plugin-hypervisor-hyperv ---
[INFO] Building jar: <http://jenkins.buildacloud.org/job/simulator-singlerun/ws/plugins/hypervisors/hyperv/target/cloud-plugin-hypervisor-hyperv-4.6.0-SNAPSHOT.jar>
[INFO] 
[INFO] --- maven-site-plugin:3.3:attach-descriptor (attach-descriptor) @ cloud-plugin-hypervisor-hyperv
---
[INFO] 
[INFO] --- maven-jar-plugin:2.5:test-jar (default) @ cloud-plugin-hypervisor-hyperv ---
[INFO] Building jar: <http://jenkins.buildacloud.org/job/simulator-singlerun/ws/plugins/hypervisors/hyperv/target/cloud-plugin-hypervisor-hyperv-4.6.0-SNAPSHOT-tests.jar>
[INFO] 
[INFO] --- maven-install-plugin:2.3.1:install (default-install) @ cloud-plugin-hypervisor-hyperv
---
[INFO] Installing <http://jenkins.buildacloud.org/job/simulator-singlerun/ws/plugins/hypervisors/hyperv/target/cloud-plugin-hypervisor-hyperv-4.6.0-SNAPSHOT.jar>
to /var/lib/jenkins/.m2/repository/org/apache/cloudstack/cloud-plugin-hypervisor-hyperv/4.6.0-SNAPSHOT/cloud-plugin-hypervisor-hyperv-4.6.0-SNAPSHOT.jar
[INFO] Installing <http://jenkins.buildacloud.org/job/simulator-singlerun/ws/plugins/hypervisors/hyperv/pom.xml>
to /var/lib/jenkins/.m2/repository/org/apache/cloudstack/cloud-plugin-hypervisor-hyperv/4.6.0-SNAPSHOT/cloud-plugin-hypervisor-hyperv-4.6.0-SNAPSHOT.pom
[INFO] Installing <http://jenkins.buildacloud.org/job/simulator-singlerun/ws/plugins/hypervisors/hyperv/target/cloud-plugin-hypervisor-hyperv-4.6.0-SNAPSHOT-tests.jar>
to /var/lib/jenkins/.m2/repository/org/apache/cloudstack/cloud-plugin-hypervisor-hyperv/4.6.0-SNAPSHOT/cloud-plugin-hypervisor-hyperv-4.6.0-SNAPSHOT-tests.jar
[INFO]                                                                         
[INFO] ------------------------------------------------------------------------
[INFO] Building Apache CloudStack Plugin - Hypervisor OracleVM3 4.6.0-SNAPSHOT
[INFO] ------------------------------------------------------------------------
[INFO] 
[INFO] --- maven-clean-plugin:2.5:clean (default-clean) @ cloud-plugin-hypervisor-ovm3 ---
[INFO] Deleting <http://jenkins.buildacloud.org/job/simulator-singlerun/ws/plugins/hypervisors/ovm3/target>
(includes = [**/*], excludes = [])
[INFO] Deleting <http://jenkins.buildacloud.org/job/simulator-singlerun/ws/plugins/hypervisors/ovm3>
(includes = [target, dist], excludes = [])
[INFO] 
[INFO] --- maven-checkstyle-plugin:2.11:check (cloudstack-checkstyle) @ cloud-plugin-hypervisor-ovm3
---
[INFO] Starting audit...
<http://jenkins.buildacloud.org/job/simulator-singlerun/ws/plugins/hypervisors/ovm3/src/main/java/com/cloud/hypervisor/ovm3/objects/StoragePlugin.java>:20:8:
Unused import - java.io.File.
<http://jenkins.buildacloud.org/job/simulator-singlerun/ws/plugins/hypervisors/ovm3/src/main/java/com/cloud/hypervisor/ovm3/objects/Xen.java>:20:8:
Unused import - java.io.File.
<http://jenkins.buildacloud.org/job/simulator-singlerun/ws/plugins/hypervisors/ovm3/src/main/java/com/cloud/hypervisor/ovm3/resources/Ovm3StorageProcessor.java>:20:8:
Unused import - java.io.File.
<http://jenkins.buildacloud.org/job/simulator-singlerun/ws/plugins/hypervisors/ovm3/src/main/java/com/cloud/hypervisor/ovm3/resources/helpers/Ovm3VmSupport.java>:20:8:
Unused import - java.io.File.
<http://jenkins.buildacloud.org/job/simulator-singlerun/ws/plugins/hypervisors/ovm3/src/test/java/com/cloud/hypervisor/ovm3/objects/StoragePluginTest.java>:21:8:
Unused import - java.io.File.
Audit done.

[INFO] ------------------------------------------------------------------------
[INFO] Reactor Summary:
[INFO] 
[INFO] Apache CloudStack Developer Tools - Checkstyle Configuration  SUCCESS [3.060s]
[INFO] Apache CloudStack ................................. SUCCESS [1.825s]
[INFO] Apache CloudStack Maven Conventions Parent ........ SUCCESS [1.232s]
[INFO] Apache CloudStack Framework - Managed Context ..... SUCCESS [4.934s]
[INFO] Apache CloudStack Utils ........................... SUCCESS [26.689s]
[INFO] Apache CloudStack Framework ....................... SUCCESS [0.066s]
[INFO] Apache CloudStack Framework - Event Notification .. SUCCESS [10.560s]
[INFO] Apache CloudStack Framework - Configuration ....... SUCCESS [6.061s]
[INFO] Apache CloudStack API ............................. SUCCESS [22.227s]
[INFO] Apache CloudStack Framework - REST ................ SUCCESS [3.672s]
[INFO] Apache CloudStack Framework - IPC ................. SUCCESS [5.754s]
[INFO] Apache CloudStack Cloud Engine .................... SUCCESS [0.062s]
[INFO] Apache CloudStack Cloud Engine API ................ SUCCESS [7.383s]
[INFO] Apache CloudStack Framework - Security ............ SUCCESS [3.715s]
[INFO] Apache CloudStack Core ............................ SUCCESS [33.222s]
[INFO] Apache CloudStack Agents .......................... SUCCESS [9.973s]
[INFO] Apache CloudStack Framework - Clustering .......... SUCCESS [4.638s]
[INFO] Apache CloudStack Framework - Event Notification .. SUCCESS [2.419s]
[INFO] Apache CloudStack Cloud Engine Schema Component ... SUCCESS [21.694s]
[INFO] Apache CloudStack Framework - Jobs ................ SUCCESS [7.732s]
[INFO] Apache CloudStack Cloud Engine Internal Components API  SUCCESS [4.029s]
[INFO] Apache CloudStack Server .......................... SUCCESS [1:03.893s]
[INFO] Apache CloudStack Usage Server .................... SUCCESS [10.462s]
[INFO] Apache CloudStack Cloud Engine Orchestration Component  SUCCESS [12.030s]
[INFO] Apache CloudStack Cloud Services .................. SUCCESS [0.058s]
[INFO] Apache CloudStack Secondary Storage ............... SUCCESS [0.530s]
[INFO] Apache CloudStack Secondary Storage Service ....... SUCCESS [7.278s]
[INFO] Apache CloudStack Engine Storage Component ........ SUCCESS [9.778s]
[INFO] Apache CloudStack Engine Storage Volume Component . SUCCESS [5.619s]
[INFO] Apache CloudStack Engine Storage Image Component .. SUCCESS [3.519s]
[INFO] Apache CloudStack Engine Storage Data Motion Component  SUCCESS [3.467s]
[INFO] Apache CloudStack Engine Storage Cache Component .. SUCCESS [2.790s]
[INFO] Apache CloudStack Engine Storage Snapshot Component  SUCCESS [11.857s]
[INFO] Apache CloudStack Cloud Engine API ................ SUCCESS [2.318s]
[INFO] Apache CloudStack Cloud Engine Service ............ SUCCESS [6.270s]
[INFO] Apache CloudStack Plugin POM ...................... SUCCESS [0.548s]
[INFO] Apache CloudStack Plugin - API Rate Limit ......... SUCCESS [8.893s]
[INFO] Apache CloudStack Plugin - Storage Volume default provider  SUCCESS [3.108s]
[INFO] Apache CloudStack Plugin - Storage Volume SolidFire Provider  SUCCESS [6.979s]
[INFO] Apache CloudStack Plugin - API SolidFire .......... SUCCESS [3.097s]
[INFO] Apache CloudStack Plugin - API Discovery .......... SUCCESS [5.838s]
[INFO] Apache CloudStack Plugin - ACL Static Role Based .. SUCCESS [2.592s]
[INFO] Apache CloudStack Plugin - Host Anti-Affinity Processor  SUCCESS [2.772s]
[INFO] Apache CloudStack Plugin - Explicit Dedication Processor  SUCCESS [2.946s]
[INFO] Apache CloudStack Plugin - User Concentrated Pod Deployment Planner  SUCCESS [2.663s]
[INFO] Apache CloudStack Plugin - User Dispersing Deployment Planner  SUCCESS [3.098s]
[INFO] Apache CloudStack Plugin - Implicit Dedication Planner  SUCCESS [9.686s]
[INFO] Apache CloudStack Plugin - Skip Heurestics Planner  SUCCESS [3.576s]
[INFO] Apache CloudStack Plugin - Host Allocator Random .. SUCCESS [2.571s]
[INFO] Apache CloudStack Plugin - Dedicated Resources .... SUCCESS [10.534s]
[INFO] Apache CloudStack Plugin - Hypervisor OracleVM .... SUCCESS [4.402s]
[INFO] Apache CloudStack Plugin - Open vSwitch ........... SUCCESS [4.794s]
[INFO] Apache CloudStack Plugin - Hypervisor XenServer ... SUCCESS [11.560s]
[INFO] Apache CloudStack Plugin - Hypervisor KVM ......... SUCCESS [13.340s]
[INFO] Apache CloudStack Plugin - RabbitMQ Event Bus ..... SUCCESS [3.306s]
[INFO] Apache CloudStack Plugin - In Memory Event Bus .... SUCCESS [5.125s]
[INFO] Apache CloudStack Plugin - Kafka Event Bus ........ SUCCESS [3.171s]
[INFO] Apache CloudStack Plugin - Hypervisor Baremetal ... SUCCESS [5.855s]
[INFO] Apache CloudStack Plugin - Hypervisor UCS ......... SUCCESS [3.825s]
[INFO] Apache CloudStack Plugin - Hypervisor Hyper-V ..... SUCCESS [7.651s]
[INFO] Apache CloudStack Plugin - Hypervisor OracleVM3 ... FAILURE [0.578s]
[INFO] Apache CloudStack Plugin - Network Elastic Load Balancer  SKIPPED
[INFO] Apache CloudStack Plugin - Network Internal Load Balancer  SKIPPED
[INFO] Apache CloudStack Framework - Spring Life Cycle ... SKIPPED
[INFO] Apache CloudStack Plugin - Network Juniper Contrail  SKIPPED
[INFO] Apache CloudStack Plugin - Palo Alto .............. SKIPPED
[INFO] Apache CloudStack Plugin - Network Netscaler ...... SKIPPED
[INFO] Apache CloudStack Plugin - Network Nicira NVP ..... SKIPPED
[INFO] Apache CloudStack Plugin - BigSwitch Virtual Network Segment  SKIPPED
[INFO] Apache CloudStack Plugin - Network Brocade VCS .... SKIPPED
[INFO] Apache CloudStack Plugin - Midokura Midonet ....... SKIPPED
[INFO] Apache CloudStack Plugin - Stratosphere SSP ....... SKIPPED
[INFO] Apache CloudStack Plugin - Network Opendaylight ... SKIPPED
[INFO] Apache CloudStack Plugin - Storage Allocator Random  SKIPPED
[INFO] Apache CloudStack Plugin - User Authenticator LDAP  SKIPPED
[INFO] Apache CloudStack Plugin - User Authenticator MD5 . SKIPPED
[INFO] Apache CloudStack Plugin - User Authenticator PBKDF2-SHA-256  SKIPPED
[INFO] Apache CloudStack Plugin - User Authenticator Plain Text  SKIPPED
[INFO] Apache CloudStack Plugin - User Authenticator SAML2  SKIPPED
[INFO] Apache CloudStack Plugin - User Authenticator SHA256 Salted  SKIPPED
[INFO] Apache CloudStack Plugin - Dns Notifier Example ... SKIPPED
[INFO] Apache CloudStack Plugin - Storage Image S3 ....... SKIPPED
[INFO] Apache CloudStack Plugin - Storage Image Swift provider  SKIPPED
[INFO] Apache CloudStack Plugin - Storage Image default provider  SKIPPED
[INFO] Apache CloudStack Plugin - Storage Image sample provider  SKIPPED
[INFO] Apache CloudStack Plugin - Storage Volume Nexenta Provider  SKIPPED
[INFO] Apache CloudStack Plugin - Storage Volume CloudByte Provider  SKIPPED
[INFO] Apache CloudStack Plugin - Storage Volume sample provider  SKIPPED
[INFO] Apache CloudStack Plugin - SNMP Alerts ............ SKIPPED
[INFO] Apache CloudStack Plugin - Syslog Alerts .......... SKIPPED
[INFO] Apache CloudStack Plugin - Network VXLAN .......... SKIPPED
[INFO] Apache CloudStack Plugin - GloboDNS ............... SKIPPED
[INFO] Apache CloudStack Plugin - Hypervisor Simulator ... SKIPPED
[INFO] Apache CloudStack Framework - Spring Module ....... SKIPPED
[INFO] Apache CloudStack Secondary Storage Controller .... SKIPPED
[INFO] Apache CloudStack Console Proxy - RDP Client ...... SKIPPED
[INFO] Apache CloudStack Console Proxy ................... SKIPPED
[INFO] Apache CloudStack Console Proxy - Server .......... SKIPPED
[INFO] Apache CloudStack System VM ....................... SKIPPED
[INFO] Apache CloudStack Client UI ....................... SKIPPED
[INFO] Apache CloudStack Framework - QuickCloud .......... SKIPPED
[INFO] Apache CloudStack Test ............................ SKIPPED
[INFO] Apache CloudStack Developer Mode .................. SKIPPED
[INFO] Apache CloudStack Developer Tools ................. SKIPPED
[INFO] Apache CloudStack apidocs ......................... SKIPPED
[INFO] Apache CloudStack marvin .......................... SKIPPED
[INFO] Apache CloudStack DevCloud ........................ SKIPPED
[INFO] Apache CloudStack DevCloud-KVM .................... SKIPPED
[INFO] ------------------------------------------------------------------------
[INFO] BUILD FAILURE
[INFO] ------------------------------------------------------------------------
[INFO] Total time: 7:36.951s
[INFO] Finished at: Fri Mar 27 07:29:21 EDT 2015
[INFO] Final Memory: 72M/414M
[INFO] ------------------------------------------------------------------------
[ERROR] Failed to execute goal org.apache.maven.plugins:maven-checkstyle-plugin:2.11:check
(cloudstack-checkstyle) on project cloud-plugin-hypervisor-ovm3: Failed during checkstyle
execution: There are 5 checkstyle errors. -> [Help 1]
[ERROR] 
[ERROR] To see the full stack trace of the errors, re-run Maven with the -e switch.
[ERROR] Re-run Maven using the -X switch to enable full debug logging.
[ERROR] 
[ERROR] For more information about the errors and possible solutions, please read the following
articles:
[ERROR] [Help 1] http://cwiki.apache.org/confluence/display/MAVEN/MojoExecutionException
[ERROR] 
[ERROR] After correcting the problems, you can resume the build with the command
[ERROR]   mvn <goals> -rf :cloud-plugin-hypervisor-ovm3
Build step 'Invoke top-level Maven targets' marked build as failure
[locks-and-latches] Releasing all the locks
[locks-and-latches] All the locks released
[xUnit] [INFO] - Starting to record.
[xUnit] [INFO] - Processing JUnit
[xUnit] [INFO] - [JUnit] - 1 test report file(s) were found with the pattern 'xunit.xml' relative
to '<http://jenkins.buildacloud.org/job/simulator-singlerun/ws/'> for the testing framework
'JUnit'.
[xUnit] [ERROR] - Test reports were found but not all of them are new. Did all the tests run?
  * <http://jenkins.buildacloud.org/job/simulator-singlerun/ws/xunit.xml> is 6 min 2
sec old

[xUnit] [INFO] - Failing BUILD.
[xUnit] [INFO] - There are errors when processing test results.
[xUnit] [INFO] - Skipping tests recording.
[xUnit] [INFO] - Stop build.

Mime
View raw message