cloudstack-dev mailing list archives

Site index · List index
Message view « Date » · « Thread »
Top « Date » · « Thread »
From jenk...@cloudstack.org
Subject Build failed in Jenkins: build-master-noredist #4130
Date Thu, 05 Mar 2015 15:48:42 GMT
See <http://jenkins.buildacloud.org/job/build-master-noredist/4130/changes>

Changes:

[wido] Swap maven3 | maven build-dependency.

[wido] Specify maven repo location.

[wido] Convert debian/rules to short dh-style.

[wido] Add DEBHELPER tokens to maintainer script.

[wido] Use /bin/sh and set -e uniformly in maintainer scripts.

[wido] Install python files into the correct path.

[wido] Add proper python dependencies.

[wido] Add adduser dependency to cloudstack-management.

[wido] Add dependency on ${misc:Depends} to all packages.

[wido] Remove dependencies on essential packages.

[wido] Use invoke-rc.d instead of service to stop tomcat.

[wido] Register the init scripts.

[wido] Fix Python path for Debian installer

------------------------------------------
[...truncated 2563 lines...]
Running com.cloud.network.CreatePrivateNetworkTest
Tests run: 1, Failures: 0, Errors: 0, Skipped: 0, Time elapsed: 0.044 sec - in com.cloud.network.CreatePrivateNetworkTest
Running com.cloud.network.NetworkModelTest
Tests run: 1, Failures: 0, Errors: 0, Skipped: 0, Time elapsed: 0.034 sec - in com.cloud.network.NetworkModelTest
Running com.cloud.network.router.NetworkHelperImplTest
Tests run: 4, Failures: 0, Errors: 0, Skipped: 0, Time elapsed: 0.052 sec - in com.cloud.network.router.NetworkHelperImplTest
Running com.cloud.network.router.RouterControlHelperTest
Tests run: 2, Failures: 0, Errors: 0, Skipped: 0, Time elapsed: 0.048 sec - in com.cloud.network.router.RouterControlHelperTest
Running com.cloud.network.router.VirtualNetworkApplianceManagerImplTest
Tests run: 2, Failures: 0, Errors: 0, Skipped: 0, Time elapsed: 0.25 sec - in com.cloud.network.router.VirtualNetworkApplianceManagerImplTest
Running com.cloud.network.security.SecurityGroupManagerImplTest
Tests run: 4, Failures: 0, Errors: 0, Skipped: 0, Time elapsed: 3.035 sec - in com.cloud.network.security.SecurityGroupManagerImplTest
Running com.cloud.network.security.SecurityGroupQueueTest
Total jobs dequeued = 10, num queued=1002 queue current size=992
Num Vms= 50 Queue size = 50
Num Vms= 20000 Queue size = 20000 time=200 ms
Num Vms= 5000 Queue size = 5000 time=947 ms
Num Vms= 1 Queue size = 1 time=0 ms
Num Vms= 1000000 Queue size = 1000000 time=382 ms
Tests run: 4, Failures: 0, Errors: 2, Skipped: 0, Time elapsed: 2.049 sec <<< FAILURE!
- in com.cloud.network.security.SecurityGroupQueueTest
testNumJobsEqToNumVms3(com.cloud.network.security.SecurityGroupQueueTest)  Time elapsed: 1.885
sec  <<< ERROR!
java.lang.OutOfMemoryError: unable to create new native thread
	at java.lang.Thread.start0(Native Method)
	at java.lang.Thread.start(Thread.java:693)
	at com.cloud.network.security.SecurityGroupQueueTest.testNumJobsEqToNumVms2(SecurityGroupQueueTest.java:124)
	at com.cloud.network.security.SecurityGroupQueueTest.testNumJobsEqToNumVms3(SecurityGroupQueueTest.java:143)

testDequeueOneJob(com.cloud.network.security.SecurityGroupQueueTest)  Time elapsed: 0 sec
 <<< ERROR!
java.lang.OutOfMemoryError: unable to create new native thread
	at java.lang.Thread.start0(Native Method)
	at java.lang.Thread.start(Thread.java:693)
	at com.cloud.network.security.SecurityGroupQueueTest._testDequeueOneJob(SecurityGroupQueueTest.java:160)
	at com.cloud.network.security.SecurityGroupQueueTest.testDequeueOneJob(SecurityGroupQueueTest.java:213)

Running com.cloud.network.vpc.VpcManagerImplTest
Tests run: 1, Failures: 0, Errors: 0, Skipped: 0, Time elapsed: 0.013 sec - in com.cloud.network.vpc.VpcManagerImplTest
Running com.cloud.network.DedicateGuestVlanRangesTest
Tests run: 2, Failures: 0, Errors: 0, Skipped: 0, Time elapsed: 0.04 sec - in com.cloud.network.DedicateGuestVlanRangesTest
Running com.cloud.network.lb.AssignLoadBalancerTest
Tests run: 4, Failures: 0, Errors: 0, Skipped: 0, Time elapsed: 0.041 sec - in com.cloud.network.lb.AssignLoadBalancerTest
Running com.cloud.network.lb.UpdateLoadBalancerTest
Tests run: 2, Failures: 0, Errors: 0, Skipped: 0, Time elapsed: 0.049 sec - in com.cloud.network.lb.UpdateLoadBalancerTest
Running com.cloud.network.dao.NetworkDaoTest
Tests run: 2, Failures: 0, Errors: 0, Skipped: 0, Time elapsed: 0 sec - in com.cloud.network.dao.NetworkDaoTest
Running com.cloud.vm.FirstFitPlannerTest
Tests run: 1, Failures: 0, Errors: 0, Skipped: 0, Time elapsed: 0.496 sec - in com.cloud.vm.FirstFitPlannerTest
Running com.cloud.vm.DeploymentPlanningManagerImplTest
Tests run: 3, Failures: 0, Errors: 0, Skipped: 0, Time elapsed: 0.708 sec - in com.cloud.vm.DeploymentPlanningManagerImplTest
Running com.cloud.vm.snapshot.VMSnapshotManagerTest
Tests run: 7, Failures: 0, Errors: 0, Skipped: 0, Time elapsed: 0.105 sec - in com.cloud.vm.snapshot.VMSnapshotManagerTest
Running com.cloud.vm.UserVmManagerTest
Tests run: 9, Failures: 0, Errors: 0, Skipped: 0, Time elapsed: 0.218 sec - in com.cloud.vm.UserVmManagerTest
Running com.cloud.configuration.ValidateIpRangeTest
Tests run: 3, Failures: 0, Errors: 0, Skipped: 0, Time elapsed: 0.012 sec - in com.cloud.configuration.ValidateIpRangeTest
Running com.cloud.configuration.ConfigurationManagerTest
Tests run: 9, Failures: 0, Errors: 0, Skipped: 0, Time elapsed: 0.057 sec - in com.cloud.configuration.ConfigurationManagerTest
Running com.cloud.server.ConfigurationServerImplTest
Tests run: 4, Failures: 0, Errors: 0, Skipped: 0, Time elapsed: 0.007 sec - in com.cloud.server.ConfigurationServerImplTest
Running com.cloud.template.TemplateManagerImplTest
Tests run: 1, Failures: 0, Errors: 0, Skipped: 0, Time elapsed: 0.009 sec - in com.cloud.template.TemplateManagerImplTest
Running com.cloud.vpc.Site2SiteVpnTest
Tests run: 1, Failures: 0, Errors: 0, Skipped: 0, Time elapsed: 2.785 sec - in com.cloud.vpc.Site2SiteVpnTest
Running com.cloud.vpc.NetworkACLServiceTest
Tests run: 5, Failures: 0, Errors: 0, Skipped: 0, Time elapsed: 0.218 sec - in com.cloud.vpc.NetworkACLServiceTest
Running com.cloud.vpc.NetworkACLManagerTest
Tests run: 6, Failures: 0, Errors: 0, Skipped: 0, Time elapsed: 0.2 sec - in com.cloud.vpc.NetworkACLManagerTest
Running com.cloud.storage.VolumeApiServiceImplTest
Tests run: 11, Failures: 0, Errors: 0, Skipped: 0, Time elapsed: 0.164 sec - in com.cloud.storage.VolumeApiServiceImplTest
Running com.cloud.user.AccountManagerImplTest
Tests run: 5, Failures: 0, Errors: 0, Skipped: 0, Time elapsed: 0.142 sec - in com.cloud.user.AccountManagerImplTest
Running com.cloud.api.ApiServletTest
Tests run: 13, Failures: 0, Errors: 0, Skipped: 0, Time elapsed: 0.101 sec - in com.cloud.api.ApiServletTest
Running com.cloud.api.ApiResponseHelperTest
Tests run: 1, Failures: 0, Errors: 0, Skipped: 0, Time elapsed: 0.022 sec - in com.cloud.api.ApiResponseHelperTest
Running com.cloud.api.dispatch.ParamGenericValidationWorkerTest
Tests run: 4, Failures: 0, Errors: 0, Skipped: 0, Time elapsed: 0.012 sec - in com.cloud.api.dispatch.ParamGenericValidationWorkerTest
Running com.cloud.api.dispatch.DispatchChainFactoryTest
Tests run: 1, Failures: 0, Errors: 0, Skipped: 0, Time elapsed: 0.003 sec - in com.cloud.api.dispatch.DispatchChainFactoryTest
Running com.cloud.api.dispatch.CommandCreationWorkerTest
Tests run: 1, Failures: 0, Errors: 0, Skipped: 0, Time elapsed: 0.006 sec - in com.cloud.api.dispatch.CommandCreationWorkerTest
Running com.cloud.api.dispatch.SpecificCmdValidationWorkerTest
Tests run: 1, Failures: 0, Errors: 0, Skipped: 0, Time elapsed: 0.002 sec - in com.cloud.api.dispatch.SpecificCmdValidationWorkerTest
Running com.cloud.api.dispatch.ParamProcessWorkerTest
Tests run: 1, Failures: 0, Errors: 0, Skipped: 0, Time elapsed: 0.004 sec - in com.cloud.api.dispatch.ParamProcessWorkerTest
Running com.cloud.ha.KVMFencerTest
Tests run: 6, Failures: 0, Errors: 0, Skipped: 0, Time elapsed: 0.014 sec - in com.cloud.ha.KVMFencerTest
Running com.cloud.ha.HighAvailabilityManagerImplTest
Tests run: 1, Failures: 0, Errors: 0, Skipped: 0, Time elapsed: 0.019 sec - in com.cloud.ha.HighAvailabilityManagerImplTest
Running org.cloud.network.router.deployment.VpcRouterDeploymentDefinitionTest
Tests run: 15, Failures: 0, Errors: 0, Skipped: 0, Time elapsed: 0.109 sec - in org.cloud.network.router.deployment.VpcRouterDeploymentDefinitionTest
Running org.cloud.network.router.deployment.RouterDeploymentDefinitionTest
Tests run: 43, Failures: 0, Errors: 0, Skipped: 0, Time elapsed: 0.192 sec - in org.cloud.network.router.deployment.RouterDeploymentDefinitionTest
Running org.apache.cloudstack.networkoffering.CreateNetworkOfferingTest
Tests run: 10, Failures: 0, Errors: 0, Skipped: 0, Time elapsed: 3.113 sec - in org.apache.cloudstack.networkoffering.CreateNetworkOfferingTest
Running org.apache.cloudstack.privategw.AclOnPrivateGwTest
Tests run: 2, Failures: 0, Errors: 0, Skipped: 0, Time elapsed: 0.208 sec - in org.apache.cloudstack.privategw.AclOnPrivateGwTest
Running org.apache.cloudstack.service.ServiceOfferingVOTest
Tests run: 2, Failures: 0, Errors: 0, Skipped: 0, Time elapsed: 0.001 sec - in org.apache.cloudstack.service.ServiceOfferingVOTest
Running org.apache.cloudstack.affinity.AffinityApiUnitTest
Tests run: 7, Failures: 0, Errors: 0, Skipped: 0, Time elapsed: 0.189 sec - in org.apache.cloudstack.affinity.AffinityApiUnitTest
Running org.apache.cloudstack.network.lb.ApplicationLoadBalancerTest
Tests run: 11, Failures: 0, Errors: 0, Skipped: 0, Time elapsed: 0.414 sec - in org.apache.cloudstack.network.lb.ApplicationLoadBalancerTest
Running org.apache.cloudstack.network.lb.CertServiceTest
Tests run: 14, Failures: 0, Errors: 0, Skipped: 0, Time elapsed: 0.539 sec - in org.apache.cloudstack.network.lb.CertServiceTest
Running org.apache.cloudstack.region.gslb.GlobalLoadBalancingRulesServiceImplTest
Tests run: 4, Failures: 0, Errors: 0, Skipped: 0, Time elapsed: 0.039 sec - in org.apache.cloudstack.region.gslb.GlobalLoadBalancingRulesServiceImplTest
Running org.apache.cloudstack.region.RegionManagerTest
Tests run: 2, Failures: 0, Errors: 0, Skipped: 0, Time elapsed: 0.001 sec - in org.apache.cloudstack.region.RegionManagerTest

Results :

Tests in error: 
  SecurityGroupQueueTest.testDequeueOneJob:213->_testDequeueOneJob:160 » OutOfMemory
  SecurityGroupQueueTest.testNumJobsEqToNumVms3:143->testNumJobsEqToNumVms2:124 » OutOfMemory

Tests run: 257, Failures: 0, Errors: 2, Skipped: 3

[INFO] ------------------------------------------------------------------------
[INFO] Reactor Summary:
[INFO] 
[INFO] Apache CloudStack Developer Tools - Checkstyle Configuration  SUCCESS [0.800s]
[INFO] Apache CloudStack ................................. SUCCESS [1.313s]
[INFO] Apache CloudStack Maven Conventions Parent ........ SUCCESS [1.349s]
[INFO] Apache CloudStack Framework - Managed Context ..... SUCCESS [4.943s]
[INFO] Apache CloudStack Utils ........................... SUCCESS [19.156s]
[INFO] Apache CloudStack Framework ....................... SUCCESS [0.506s]
[INFO] Apache CloudStack Framework - Event Notification .. SUCCESS [12.527s]
[INFO] Apache CloudStack Framework - Configuration ....... SUCCESS [5.741s]
[INFO] Apache CloudStack API ............................. SUCCESS [15.842s]
[INFO] Apache CloudStack Framework - REST ................ SUCCESS [5.935s]
[INFO] Apache CloudStack Framework - IPC ................. SUCCESS [7.014s]
[INFO] Apache CloudStack Cloud Engine .................... SUCCESS [0.504s]
[INFO] Apache CloudStack Cloud Engine API ................ SUCCESS [5.823s]
[INFO] Apache CloudStack Framework - Security ............ SUCCESS [3.067s]
[INFO] Apache CloudStack Core ............................ SUCCESS [29.869s]
[INFO] Apache CloudStack Agents .......................... SUCCESS [9.122s]
[INFO] Apache CloudStack Framework - Clustering .......... SUCCESS [4.116s]
[INFO] Apache CloudStack Framework - Event Notification .. SUCCESS [3.191s]
[INFO] Apache CloudStack Cloud Engine Schema Component ... SUCCESS [19.386s]
[INFO] Apache CloudStack Framework - Jobs ................ SUCCESS [9.039s]
[INFO] Apache CloudStack Cloud Engine Internal Components API  SUCCESS [3.837s]
[INFO] Apache CloudStack Server .......................... FAILURE [45.739s]
[INFO] Apache CloudStack Usage Server .................... SUCCESS [11.753s]
[INFO] Apache CloudStack Cloud Engine Orchestration Component  SUCCESS [14.993s]
[INFO] Apache CloudStack Cloud Services .................. SUCCESS [0.500s]
[INFO] Apache CloudStack Secondary Storage ............... SUCCESS [3.273s]
[INFO] Apache CloudStack Secondary Storage Service ....... SKIPPED
[INFO] Apache CloudStack Engine Storage Component ........ SKIPPED
[INFO] Apache CloudStack Engine Storage Volume Component . SKIPPED
[INFO] Apache CloudStack Engine Storage Image Component .. SKIPPED
[INFO] Apache CloudStack Engine Storage Data Motion Component  SKIPPED
[INFO] Apache CloudStack Engine Storage Cache Component .. SKIPPED
[INFO] Apache CloudStack Engine Storage Snapshot Component  SKIPPED
[INFO] Apache CloudStack Cloud Engine API ................ SUCCESS [3.528s]
[INFO] Apache CloudStack Cloud Engine Service ............ SKIPPED
[INFO] Apache CloudStack Plugin POM ...................... SKIPPED
[INFO] Apache CloudStack Plugin - API Rate Limit ......... SKIPPED
[INFO] Apache CloudStack Plugin - Storage Volume default provider  SKIPPED
[INFO] Apache CloudStack Plugin - Storage Volume SolidFire Provider  SKIPPED
[INFO] Apache CloudStack Plugin - API SolidFire .......... SKIPPED
[INFO] Apache CloudStack Plugin - API Discovery .......... SKIPPED
[INFO] Apache CloudStack Plugin - ACL Static Role Based .. SKIPPED
[INFO] Apache CloudStack Plugin - Host Anti-Affinity Processor  SKIPPED
[INFO] Apache CloudStack Plugin - Explicit Dedication Processor  SKIPPED
[INFO] Apache CloudStack Plugin - User Concentrated Pod Deployment Planner  SKIPPED
[INFO] Apache CloudStack Plugin - User Dispersing Deployment Planner  SKIPPED
[INFO] Apache CloudStack Plugin - Implicit Dedication Planner  SKIPPED
[INFO] Apache CloudStack Plugin - Skip Heurestics Planner  SKIPPED
[INFO] Apache CloudStack Plugin - Host Allocator Random .. SKIPPED
[INFO] Apache CloudStack Plugin - Dedicated Resources .... SKIPPED
[INFO] Apache CloudStack Plugin - Hypervisor OracleVM .... SKIPPED
[INFO] Apache CloudStack Plugin - Open vSwitch ........... SKIPPED
[INFO] Apache CloudStack Plugin - Hypervisor XenServer ... SKIPPED
[INFO] Apache CloudStack Plugin - Hypervisor KVM ......... SKIPPED
[INFO] Apache CloudStack Plugin - RabbitMQ Event Bus ..... SKIPPED
[INFO] Apache CloudStack Plugin - In Memory Event Bus .... SKIPPED
[INFO] Apache CloudStack Plugin - Hypervisor Baremetal ... SKIPPED
[INFO] Apache CloudStack Plugin - Hypervisor UCS ......... SKIPPED
[INFO] Apache CloudStack Plugin - Hypervisor Hyper-V ..... SKIPPED
[INFO] Apache CloudStack Plugin - Network Elastic Load Balancer  SKIPPED
[INFO] Apache CloudStack Plugin - Network Internal Load Balancer  SKIPPED
[INFO] Apache CloudStack Framework - Spring Life Cycle ... SUCCESS [3.638s]
[INFO] Apache CloudStack Plugin - Network Juniper Contrail  SKIPPED
[INFO] Apache CloudStack Plugin - Palo Alto .............. SKIPPED
[INFO] Apache CloudStack Plugin - Network Netscaler ...... SKIPPED
[INFO] Apache CloudStack Plugin - Network Nicira NVP ..... SKIPPED
[INFO] Apache CloudStack Plugin - BigSwitch Virtual Network Segment  SKIPPED
[INFO] Apache CloudStack Plugin - Network Brocade VCS .... SKIPPED
[INFO] Apache CloudStack Plugin - Midokura Midonet ....... SKIPPED
[INFO] Apache CloudStack Plugin - Stratosphere SSP ....... SKIPPED
[INFO] Apache CloudStack Plugin - Network Opendaylight ... SKIPPED
[INFO] Apache CloudStack Plugin - Storage Allocator Random  SKIPPED
[INFO] Apache CloudStack Plugin - User Authenticator LDAP  SKIPPED
[INFO] Apache CloudStack Plugin - User Authenticator MD5 . SKIPPED
[INFO] Apache CloudStack Plugin - User Authenticator PBKDF2-SHA-256  SKIPPED
[INFO] Apache CloudStack Plugin - User Authenticator Plain Text  SKIPPED
[INFO] Apache CloudStack Plugin - User Authenticator SAML2  SKIPPED
[INFO] Apache CloudStack Plugin - User Authenticator SHA256 Salted  SKIPPED
[INFO] Apache CloudStack Plugin - Dns Notifier Example ... SKIPPED
[INFO] Apache CloudStack Plugin - Storage Image S3 ....... SKIPPED
[INFO] Apache CloudStack Plugin - Storage Image Swift provider  SKIPPED
[INFO] Apache CloudStack Plugin - Storage Image default provider  SKIPPED
[INFO] Apache CloudStack Plugin - Storage Image sample provider  SKIPPED
[INFO] Apache CloudStack Plugin - Storage Volume Nexenta Provider  SKIPPED
[INFO] Apache CloudStack Plugin - Storage Volume CloudByte Provider  SKIPPED
[INFO] Apache CloudStack Plugin - Storage Volume sample provider  SKIPPED
[INFO] Apache CloudStack Plugin - SNMP Alerts ............ SKIPPED
[INFO] Apache CloudStack Plugin - Syslog Alerts .......... SKIPPED
[INFO] Apache CloudStack Plugin - Network VXLAN .......... SKIPPED
[INFO] Apache CloudStack Plugin - GloboDNS ............... SKIPPED
[INFO] Apache CloudStack Plugin - NetApp File System ..... SKIPPED
[INFO] Apache CloudStack Plugin - F5 ..................... SKIPPED
[INFO] Apache CloudStack Plugin - Juniper SRX ............ SKIPPED
[INFO] Apache CloudStack Plugin - Nuage VSP .............. SKIPPED
[INFO] Apache CloudStack VMware Base ..................... SUCCESS [10.088s]
[INFO] Apache CloudStack Plugin - Hypervisor VMware ...... SKIPPED
[INFO] Apache CloudStack Plugin - Cisco VNMC ............. SKIPPED
[INFO] Apache CloudStack Plugin - MySQL HA Strategy ...... SKIPPED
[INFO] Apache CloudStack Framework - Spring Module ....... SUCCESS [11.784s]
[INFO] Apache CloudStack Secondary Storage Controller .... SKIPPED
[INFO] Apache CloudStack Console Proxy - RDP Client ...... SUCCESS [14.777s]
[INFO] Apache CloudStack Console Proxy ................... SUCCESS [3.089s]
[INFO] Apache CloudStack Console Proxy - Server .......... SUCCESS [7.226s]
[INFO] Apache CloudStack System VM ....................... SKIPPED
[INFO] Apache CloudStack Client UI ....................... SKIPPED
[INFO] Apache CloudStack Framework - QuickCloud .......... SUCCESS [1.672s]
[INFO] Apache CloudStack AWS API Bridge .................. SKIPPED
[INFO] ------------------------------------------------------------------------
[INFO] BUILD FAILURE
[INFO] ------------------------------------------------------------------------
[INFO] Total time: 2:36.394s (Wall Clock)
[INFO] Finished at: Thu Mar 05 16:47:57 CET 2015
[INFO] Final Memory: 74M/715M
[INFO] ------------------------------------------------------------------------
[ERROR] Failed to execute goal org.apache.maven.plugins:maven-surefire-plugin:2.18.1:test
(default-test) on project cloud-server: There are test failures.
[ERROR] 
[ERROR] Please refer to <http://jenkins.buildacloud.org/job/build-master-noredist/ws/server/target/surefire-reports>
for the individual test results.
[ERROR] -> [Help 1]
[ERROR] 
[ERROR] To see the full stack trace of the errors, re-run Maven with the -e switch.
[ERROR] Re-run Maven using the -X switch to enable full debug logging.
[ERROR] 
[ERROR] For more information about the errors and possible solutions, please read the following
articles:
[ERROR] [Help 1] http://cwiki.apache.org/confluence/display/MAVEN/MojoFailureException
[ERROR] 
[ERROR] After correcting the problems, you can resume the build with the command
[ERROR]   mvn <goals> -rf :cloud-server
Build step 'Invoke top-level Maven targets' marked build as failure
Archiving artifacts

Mime
View raw message