cloudstack-dev mailing list archives

Site index · List index
Message view « Date » · « Thread »
Top « Date » · « Thread »
From jenk...@cloudstack.org
Subject Build failed in Jenkins: build-4.5 #391
Date Thu, 12 Mar 2015 08:34:32 GMT
See <http://jenkins.buildacloud.org/job/build-4.5/391/changes>

Changes:

[Rohit Yadav] CLOUDSTACK-8272: Python based file-lock free password server implementation

------------------------------------------
[...truncated 2720 lines...]
[INFO] Skipping Apache CloudStack Plugin - User Authenticator SAML2
[INFO] This project has been banned from the build due to previous failures.
[INFO] ------------------------------------------------------------------------
[INFO]                                                                         
[INFO] ------------------------------------------------------------------------
[INFO] Skipping Apache CloudStack Plugin - User Authenticator SHA256 Salted
[INFO] This project has been banned from the build due to previous failures.
[INFO] ------------------------------------------------------------------------
[INFO]                                                                         
[INFO] ------------------------------------------------------------------------
[INFO] Skipping Apache CloudStack Plugin - Dns Notifier Example
[INFO] This project has been banned from the build due to previous failures.
[INFO] ------------------------------------------------------------------------
[INFO]                                                                         
[INFO] ------------------------------------------------------------------------
[INFO] Skipping Apache CloudStack Plugin - SNMP Alerts
[INFO] This project has been banned from the build due to previous failures.
[INFO] ------------------------------------------------------------------------
[INFO]                                                                         
[INFO] ------------------------------------------------------------------------
[INFO] Skipping Apache CloudStack Plugin - Syslog Alerts
[INFO] This project has been banned from the build due to previous failures.
[INFO] ------------------------------------------------------------------------
[INFO]                                                                         
[INFO] ------------------------------------------------------------------------
[INFO] Skipping Apache CloudStack Plugin - Network VXLAN
[INFO] This project has been banned from the build due to previous failures.
[INFO] ------------------------------------------------------------------------
[INFO]                                                                         
[INFO] ------------------------------------------------------------------------
[INFO] Skipping Apache CloudStack Plugin - GloboDNS
[INFO] This project has been banned from the build due to previous failures.
[INFO] ------------------------------------------------------------------------
[INFO]                                                                         
[INFO] ------------------------------------------------------------------------
[INFO] Skipping Apache CloudStack Engine Storage Component
[INFO] This project has been banned from the build due to previous failures.
[INFO] ------------------------------------------------------------------------
[INFO]                                                                         
[INFO] ------------------------------------------------------------------------
[INFO] Skipping Apache CloudStack System VM
[INFO] This project has been banned from the build due to previous failures.
[INFO] ------------------------------------------------------------------------
Running org.apache.cloudstack.implicitplanner.ImplicitPlannerTest
log4j:WARN No appenders could be found for logger (org.springframework.test.context.junit4.SpringJUnit4ClassRunner).
log4j:WARN Please initialize the log4j system properly.
[INFO] 
[INFO] --- maven-resources-plugin:2.5:testResources (default-testResources) @ cloud-mom-inmemory
---
log4j:WARN See http://logging.apache.org/log4j/1.2/faq.html#noconfig for more info.
[debug] execute contextualize
[INFO] Using 'UTF-8' encoding to copy filtered resources.
[INFO] skip non existing resourceDirectory <http://jenkins.buildacloud.org/job/build-4.5/ws/plugins/event-bus/inmemory/test/resources>
[INFO] Copying 3 resources
[INFO] 
[INFO] --- maven-compiler-plugin:2.5.1:testCompile (default-testCompile) @ cloud-mom-inmemory
---
[INFO] Compiling 1 source file to <http://jenkins.buildacloud.org/job/build-4.5/ws/plugins/event-bus/inmemory/target/test-classes>
[INFO] 
[INFO] --- maven-resources-plugin:2.5:testResources (default-testResources) @ cloud-mom-rabbitmq
---
[debug] execute contextualize
[INFO] Using 'UTF-8' encoding to copy filtered resources.
[INFO] skip non existing resourceDirectory <http://jenkins.buildacloud.org/job/build-4.5/ws/plugins/event-bus/rabbitmq/test/resources>
[INFO] Copying 3 resources
[INFO] 
[INFO] --- maven-compiler-plugin:2.5.1:testCompile (default-testCompile) @ cloud-mom-rabbitmq
---
[INFO] No sources to compile
[INFO] 
[INFO] --- maven-surefire-plugin:2.12:test (default-test) @ cloud-mom-rabbitmq ---
[INFO] Surefire report directory: <http://jenkins.buildacloud.org/job/build-4.5/ws/plugins/event-bus/rabbitmq/target/surefire-reports>

-------------------------------------------------------
 T E S T S
-------------------------------------------------------
[INFO] 
[INFO] --- maven-surefire-plugin:2.12:test (default-test) @ cloud-plugin-dedicated-resources
---
[INFO] Surefire report directory: <http://jenkins.buildacloud.org/job/build-4.5/ws/plugins/dedicated-resources/target/surefire-reports>

-------------------------------------------------------
 T E S T S
-------------------------------------------------------
[INFO] 
[INFO] --- maven-resources-plugin:2.5:testResources (default-testResources) @ cloud-plugin-hypervisor-ovm
---
[debug] execute contextualize
[INFO] Using 'UTF-8' encoding to copy filtered resources.
[INFO] skip non existing resourceDirectory <http://jenkins.buildacloud.org/job/build-4.5/ws/plugins/hypervisors/ovm/test/resources>
[INFO] Copying 3 resources
[INFO] 
[INFO] --- maven-compiler-plugin:2.5.1:testCompile (default-testCompile) @ cloud-plugin-hypervisor-ovm
---
[INFO] No sources to compile
[INFO] 
[INFO] --- maven-surefire-plugin:2.12:test (default-test) @ cloud-plugin-hypervisor-ovm ---
[INFO] Surefire report directory: <http://jenkins.buildacloud.org/job/build-4.5/ws/plugins/hypervisors/ovm/target/surefire-reports>

-------------------------------------------------------
 T E S T S
-------------------------------------------------------

Results :

Tests run: 0, Failures: 0, Errors: 0, Skipped: 0


Results :

Tests run: 0, Failures: 0, Errors: 0, Skipped: 0

Running org.apache.cloudstack.dedicated.manager.DedicatedApiUnitTest
[INFO] 
[INFO] --- maven-resources-plugin:2.5:testResources (default-testResources) @ cloud-plugin-network-ovs
---
[debug] execute contextualize
[INFO] Using 'UTF-8' encoding to copy filtered resources.
[INFO] skip non existing resourceDirectory <http://jenkins.buildacloud.org/job/build-4.5/ws/plugins/network-elements/ovs/test/resources>
[INFO] Copying 3 resources
[INFO] 
[INFO] --- maven-compiler-plugin:2.5.1:testCompile (default-testCompile) @ cloud-plugin-network-ovs
---
[INFO] No sources to compile
[INFO] 
[INFO] --- maven-surefire-plugin:2.12:test (default-test) @ cloud-plugin-network-ovs ---
[INFO] Surefire report directory: <http://jenkins.buildacloud.org/job/build-4.5/ws/plugins/network-elements/ovs/target/surefire-reports>

-------------------------------------------------------
 T E S T S
-------------------------------------------------------
[INFO] ------------------------------------------------------------------------
[INFO] Reactor Summary:
[INFO] 
[INFO] Apache CloudStack Developer Tools - Checkstyle Configuration  SUCCESS [0.868s]
[INFO] Apache CloudStack ................................. SUCCESS [0.727s]
[INFO] Apache CloudStack Maven Conventions Parent ........ SUCCESS [1.586s]
[INFO] Apache CloudStack Framework - Managed Context ..... SUCCESS [3.669s]
[INFO] Apache CloudStack Utils ........................... SUCCESS [22.140s]
[INFO] Apache CloudStack Framework ....................... SUCCESS [0.229s]
[INFO] Apache CloudStack Framework - Event Notification .. SUCCESS [9.724s]
[INFO] Apache CloudStack Framework - Configuration ....... SUCCESS [4.311s]
[INFO] Apache CloudStack API ............................. SUCCESS [13.173s]
[INFO] Apache CloudStack Framework - REST ................ SUCCESS [5.323s]
[INFO] Apache CloudStack Framework - IPC ................. SUCCESS [4.443s]
[INFO] Apache CloudStack Cloud Engine .................... SUCCESS [0.127s]
[INFO] Apache CloudStack Cloud Engine API ................ SUCCESS [4.675s]
[INFO] Apache CloudStack Framework - Security ............ SUCCESS [2.716s]
[INFO] Apache CloudStack Core ............................ SUCCESS [10.662s]
[INFO] Apache CloudStack Agents .......................... SUCCESS [5.331s]
[INFO] Apache CloudStack Framework - Clustering .......... SUCCESS [3.423s]
[INFO] Apache CloudStack Framework - Event Notification .. SUCCESS [2.800s]
[INFO] Apache CloudStack Cloud Engine Schema Component ... SUCCESS [13.817s]
[INFO] Apache CloudStack Framework - Jobs ................ SUCCESS [4.819s]
[INFO] Apache CloudStack Cloud Engine Internal Components API  SUCCESS [2.743s]
[INFO] Apache CloudStack Server .......................... SUCCESS [38.157s]
[INFO] Apache CloudStack Usage Server .................... SUCCESS [8.359s]
[INFO] Apache CloudStack Cloud Engine Orchestration Component  SUCCESS [10.187s]
[INFO] Apache CloudStack Cloud Services .................. SUCCESS [0.188s]
[INFO] Apache CloudStack Secondary Storage ............... SUCCESS [3.001s]
[INFO] Apache CloudStack Secondary Storage Service ....... SUCCESS [14.692s]
[INFO] Apache CloudStack Engine Storage Component ........ SKIPPED
[INFO] Apache CloudStack Engine Storage Volume Component . SKIPPED
[INFO] Apache CloudStack Engine Storage Image Component .. SKIPPED
[INFO] Apache CloudStack Engine Storage Data Motion Component  SKIPPED
[INFO] Apache CloudStack Engine Storage Cache Component .. SKIPPED
[INFO] Apache CloudStack Engine Storage Snapshot Component  SKIPPED
[INFO] Apache CloudStack Cloud Engine API ................ SUCCESS [2.592s]
[INFO] Apache CloudStack Cloud Engine Service ............ SKIPPED
[INFO] Apache CloudStack Plugin POM ...................... SUCCESS [0.333s]
[INFO] Apache CloudStack Plugin - API Rate Limit ......... FAILURE [19.339s]
[INFO] Apache CloudStack Plugin - Storage Volume default provider  SKIPPED
[INFO] Apache CloudStack Plugin - Storage Volume SolidFire Provider  SKIPPED
[INFO] Apache CloudStack Plugin - API SolidFire .......... SKIPPED
[INFO] Apache CloudStack Plugin - API Discovery .......... SUCCESS [14.384s]
[INFO] Apache CloudStack Plugin - ACL Static Role Based .. SUCCESS [7.547s]
[INFO] Apache CloudStack Plugin - Host Anti-Affinity Processor  SUCCESS [8.640s]
[INFO] Apache CloudStack Plugin - Explicit Dedication Processor  SUCCESS [8.008s]
[INFO] Apache CloudStack Plugin - User Concentrated Pod Deployment Planner  SUCCESS [8.352s]
[INFO] Apache CloudStack Plugin - User Dispersing Deployment Planner  SUCCESS [7.627s]
[INFO] Apache CloudStack Plugin - Implicit Dedication Planner  SKIPPED
[INFO] Apache CloudStack Plugin - Skip Heurestics Planner  SUCCESS [6.919s]
[INFO] Apache CloudStack Plugin - Host Allocator Random .. SUCCESS [7.243s]
[INFO] Apache CloudStack Plugin - Dedicated Resources .... SKIPPED
[INFO] Apache CloudStack Plugin - Hypervisor OracleVM .... SUCCESS [9.119s]
[INFO] Apache CloudStack Plugin - Open vSwitch ........... SKIPPED
[INFO] Apache CloudStack Plugin - Hypervisor XenServer ... SKIPPED
[INFO] Apache CloudStack Plugin - Hypervisor KVM ......... SKIPPED
[INFO] Apache CloudStack Plugin - RabbitMQ Event Bus ..... SUCCESS [7.901s]
[INFO] Apache CloudStack Plugin - In Memory Event Bus .... SKIPPED
[INFO] Apache CloudStack Plugin - Hypervisor Baremetal ... SKIPPED
[INFO] Apache CloudStack Plugin - Hypervisor UCS ......... SKIPPED
[INFO] Apache CloudStack Plugin - Hypervisor Hyper-V ..... SKIPPED
[INFO] Apache CloudStack Plugin - Network Elastic Load Balancer  SKIPPED
[INFO] Apache CloudStack Plugin - Network Internal Load Balancer  SKIPPED
[INFO] Apache CloudStack Framework - Spring Life Cycle ... SUCCESS [3.224s]
[INFO] Apache CloudStack Plugin - Network Juniper Contrail  SKIPPED
[INFO] Apache CloudStack Plugin - Palo Alto .............. SKIPPED
[INFO] Apache CloudStack Plugin - Network Netscaler ...... SKIPPED
[INFO] Apache CloudStack Plugin - Network Nicira NVP ..... SKIPPED
[INFO] Apache CloudStack Plugin - BigSwitch Virtual Network Segment  SKIPPED
[INFO] Apache CloudStack Plugin - Network Brocade VCS .... SKIPPED
[INFO] Apache CloudStack Plugin - Midokura Midonet ....... SKIPPED
[INFO] Apache CloudStack Plugin - Stratosphere SSP ....... SKIPPED
[INFO] Apache CloudStack Plugin - Network Opendaylight ... SKIPPED
[INFO] Apache CloudStack Plugin - Storage Allocator Random  SKIPPED
[INFO] Apache CloudStack Plugin - User Authenticator LDAP  SKIPPED
[INFO] Apache CloudStack Plugin - User Authenticator MD5 . SKIPPED
[INFO] Apache CloudStack Plugin - User Authenticator PBKDF2-SHA-256  SKIPPED
[INFO] Apache CloudStack Plugin - User Authenticator Plain Text  SKIPPED
[INFO] Apache CloudStack Plugin - User Authenticator SAML2  SKIPPED
[INFO] Apache CloudStack Plugin - User Authenticator SHA256 Salted  SKIPPED
[INFO] Apache CloudStack Plugin - Dns Notifier Example ... SKIPPED
[INFO] Apache CloudStack Plugin - Storage Image S3 ....... SKIPPED
[INFO] Apache CloudStack Plugin - Storage Image Swift provider  SKIPPED
[INFO] Apache CloudStack Plugin - Storage Image default provider  SKIPPED
[INFO] Apache CloudStack Plugin - Storage Image sample provider  SKIPPED
[INFO] Apache CloudStack Plugin - Storage Volume Nexenta Provider  SKIPPED
[INFO] Apache CloudStack Plugin - Storage Volume CloudByte Provider  SKIPPED
[INFO] Apache CloudStack Plugin - Storage Volume sample provider  SKIPPED
[INFO] Apache CloudStack Plugin - SNMP Alerts ............ SKIPPED
[INFO] Apache CloudStack Plugin - Syslog Alerts .......... SKIPPED
[INFO] Apache CloudStack Plugin - Network VXLAN .......... SKIPPED
[INFO] Apache CloudStack Plugin - GloboDNS ............... SKIPPED
[INFO] Apache CloudStack Framework - Spring Module ....... SUCCESS [9.441s]
[INFO] Apache CloudStack Secondary Storage Controller .... SUCCESS [8.687s]
[INFO] Apache CloudStack Console Proxy - RDP Client ...... SUCCESS [11.697s]
[INFO] Apache CloudStack Console Proxy ................... SUCCESS [3.028s]
[INFO] Apache CloudStack Console Proxy - Server .......... SUCCESS [5.541s]
[INFO] Apache CloudStack System VM ....................... SKIPPED
[INFO] Apache CloudStack Client UI ....................... SKIPPED
[INFO] Apache CloudStack Framework - QuickCloud .......... SUCCESS [1.336s]
[INFO] Apache CloudStack AWS API Bridge .................. SKIPPED
[INFO] ------------------------------------------------------------------------
[INFO] BUILD FAILURE
[INFO] ------------------------------------------------------------------------
[INFO] Total time: 2:31.973s (Wall Clock)
[INFO] Finished at: Thu Mar 12 09:34:46 CET 2015
log4j:WARN No appenders could be found for logger (org.springframework.test.context.junit4.SpringJUnit4ClassRunner).
log4j:WARN Please initialize the log4j system properly.
log4j:WARN See http://logging.apache.org/log4j/1.2/faq.html#noconfig for more info.
[INFO] Final Memory: 59M/341M
[INFO] ------------------------------------------------------------------------
[ERROR] Failed to execute goal org.apache.maven.plugins:maven-surefire-plugin:2.12:test (default-test)
on project cloud-plugin-api-limit-account-based: There are test failures.
[ERROR] 
[ERROR] Please refer to <http://jenkins.buildacloud.org/job/build-4.5/ws/plugins/api/rate-limit/target/surefire-reports>
for the individual test results.
[ERROR] -> [Help 1]
[ERROR] 
[ERROR] To see the full stack trace of the errors, re-run Maven with the -e switch.
[ERROR] Re-run Maven using the -X switch to enable full debug logging.
[ERROR] 
[ERROR] For more information about the errors and possible solutions, please read the following
articles:
[ERROR] [Help 1] http://cwiki.apache.org/confluence/display/MAVEN/MojoFailureException
[ERROR] 
[ERROR] After correcting the problems, you can resume the build with the command
[ERROR]   mvn <goals> -rf :cloud-plugin-api-limit-account-based
Build step 'Invoke top-level Maven targets' marked build as failure
Recording test results

Mime
View raw message