cloudstack-dev mailing list archives

Site index · List index
Message view « Date » · « Thread »
Top « Date » · « Thread »
From jenk...@cloudstack.org
Subject Build failed in Jenkins: build-master-simulator #1823
Date Fri, 13 Mar 2015 09:35:32 GMT
See <http://jenkins.buildacloud.org/job/build-master-simulator/1823/changes>

Changes:

[sanjay.tripathi] Fixed simulator and vmware NPE issue.

[Rohit Yadav] Fix encoding for user account label in header

[Rohit Yadav] Error message exposes domain Id when deployVirtualMachine() is attempted on
a shared network to which the user doesnot have access to.

[Rohit Yadav] CS-20680: The user's secret key is not encrypted in the UserCredentialsVO class

[Rohit Yadav] CS-19734:Session cookie is exposed to scripts.

[Rohit Yadav] CS-18149: UI - no longer store sessionKey in cookie. After

[Rohit Yadav] CS-17504: Weak SSL ciphers supported by the management server

[Rohit Yadav] Avoid distributing private key for realhostip.com

[Rohit Yadav] Avoid logging password when adding srx device

[Rohit Yadav] ui: if session cookie exists, use it to set global session holder and invalidate
it

------------------------------------------
Started by an SCM change
[EnvInject] - Loading node environment variables.
Building remotely on cloudstack-buildslave-centos6-9ee (cloudstack-buildslave-centos6) in
workspace <http://jenkins.buildacloud.org/job/build-master-simulator/ws/>
 > /usr/bin/git rev-parse --is-inside-work-tree # timeout=400
Fetching changes from the remote Git repository
 > /usr/bin/git config remote.origin.url https://git-wip-us.apache.org/repos/asf/cloudstack.git
# timeout=400
Fetching upstream changes from https://git-wip-us.apache.org/repos/asf/cloudstack.git
 > /usr/bin/git --version # timeout=400
 > /usr/bin/git fetch --tags --progress https://git-wip-us.apache.org/repos/asf/cloudstack.git
+refs/heads/*:refs/remotes/origin/*
 > /usr/bin/git rev-parse refs/remotes/origin/master^{commit} # timeout=400
 > /usr/bin/git rev-parse refs/remotes/origin/origin/master^{commit} # timeout=400
Checking out Revision 6c71d3bae1a3a72a9fa4004decdba4a7174f6913 (refs/remotes/origin/master)
 > /usr/bin/git config core.sparsecheckout # timeout=400
 > /usr/bin/git checkout -f 6c71d3bae1a3a72a9fa4004decdba4a7174f6913
 > /usr/bin/git rev-list 602fafd0a14a2ba41f8b8ed9a7ebb4d6c96c1087 # timeout=400
[copy-to-slave] Copying 'settings.xml', excluding nothing, from 'file:/var/lib/jenkins/userContent/'
on the master to '<http://jenkins.buildacloud.org/job/build-master-simulator/ws/'> on
'cloudstack-buildslave-centos6-9ee'.
[build-master-simulator] $ /jenkins/tools/hudson.tasks.Maven_MavenInstallation/maven-3.1.1/bin/mvn
-s <http://jenkins.buildacloud.org/job/build-master-simulator/ws/settings.xml> -Psimulator
-pl plugins/hypervisors/simulator -am clean test
[INFO] Scanning for projects...
[INFO] ------------------------------------------------------------------------
[INFO] Reactor Build Order:
[INFO] 
[INFO] Apache CloudStack Developer Tools - Checkstyle Configuration
[INFO] Apache CloudStack
[INFO] Apache CloudStack Maven Conventions Parent
[INFO] Apache CloudStack Framework - Managed Context
[INFO] Apache CloudStack Utils
[INFO] Apache CloudStack Framework
[INFO] Apache CloudStack Framework - Event Notification
[INFO] Apache CloudStack Framework - Configuration
[INFO] Apache CloudStack API
[INFO] Apache CloudStack Framework - REST
[INFO] Apache CloudStack Framework - IPC
[INFO] Apache CloudStack Cloud Engine
[INFO] Apache CloudStack Cloud Engine API
[INFO] Apache CloudStack Framework - Security
[INFO] Apache CloudStack Core
[INFO] Apache CloudStack Agents
[INFO] Apache CloudStack Framework - Clustering
[INFO] Apache CloudStack Framework - Event Notification
[INFO] Apache CloudStack Cloud Engine Schema Component
[INFO] Apache CloudStack Framework - Jobs
[INFO] Apache CloudStack Cloud Engine Internal Components API
[INFO] Apache CloudStack Server
[INFO] Apache CloudStack Cloud Services
[INFO] Apache CloudStack Secondary Storage
[INFO] Apache CloudStack Secondary Storage Service
[INFO] Apache CloudStack Engine Storage Component
[INFO] Apache CloudStack Engine Storage Volume Component
[INFO] Apache CloudStack Engine Storage Image Component
[INFO] Apache CloudStack Engine Storage Snapshot Component
[INFO] Apache CloudStack Plugin POM
[INFO] Apache CloudStack Plugin - Hypervisor Simulator
[INFO]                                                                         
[INFO] ------------------------------------------------------------------------
[INFO] Building Apache CloudStack Developer Tools - Checkstyle Configuration 4.6.0-SNAPSHOT
[INFO] ------------------------------------------------------------------------
[INFO] 
[INFO] --- maven-clean-plugin:2.5:clean (default-clean) @ checkstyle ---
[INFO] Deleting <http://jenkins.buildacloud.org/job/build-master-simulator/ws/tools/checkstyle/target>
[INFO] 
[INFO] --- maven-resources-plugin:2.6:resources (default-resources) @ checkstyle ---
[WARNING] Using platform encoding (UTF-8 actually) to copy filtered resources, i.e. build
is platform dependent!
[INFO] Copying 3 resources
[INFO] 
[INFO] --- maven-compiler-plugin:2.5.1:compile (default-compile) @ checkstyle ---
[INFO] No sources to compile
[INFO] 
[INFO] --- maven-resources-plugin:2.6:testResources (default-testResources) @ checkstyle ---
[WARNING] Using platform encoding (UTF-8 actually) to copy filtered resources, i.e. build
is platform dependent!
[INFO] skip non existing resourceDirectory <http://jenkins.buildacloud.org/job/build-master-simulator/ws/tools/checkstyle/src/test/resources>
[INFO] 
[INFO] --- maven-compiler-plugin:2.5.1:testCompile (default-testCompile) @ checkstyle ---
[INFO] No sources to compile
[INFO] 
[INFO] --- maven-surefire-plugin:2.12.4:test (default-test) @ checkstyle ---
[INFO] No tests to run.
[INFO]                                                                         
[INFO] ------------------------------------------------------------------------
[INFO] Building Apache CloudStack 4.6.0-SNAPSHOT
[INFO] ------------------------------------------------------------------------
[INFO] 
[INFO] --- maven-clean-plugin:2.5:clean (default-clean) @ cloudstack ---
[INFO] Deleting <http://jenkins.buildacloud.org/job/build-master-simulator/ws/target>
(includes = [**/*], excludes = [])
[INFO] Deleting <http://jenkins.buildacloud.org/job/build-master-simulator/ws/> (includes
= [target, dist], excludes = [])
[INFO] 
[INFO] --- maven-remote-resources-plugin:1.3:process (default) @ cloudstack ---
[INFO]                                                                         
[INFO] ------------------------------------------------------------------------
[INFO] Building Apache CloudStack Maven Conventions Parent 4.6.0-SNAPSHOT
[INFO] ------------------------------------------------------------------------
[INFO] 
[INFO] --- maven-clean-plugin:2.5:clean (default-clean) @ cloud-maven-standard ---
[INFO] Deleting <http://jenkins.buildacloud.org/job/build-master-simulator/ws/maven-standard/target>
(includes = [**/*], excludes = [])
[INFO] Deleting <http://jenkins.buildacloud.org/job/build-master-simulator/ws/maven-standard>
(includes = [target, dist], excludes = [])
[INFO] 
[INFO] --- maven-checkstyle-plugin:2.11:check (cloudstack-checkstyle) @ cloud-maven-standard
---
[INFO] Starting audit...
Audit done.

[INFO] 
[INFO] --- maven-remote-resources-plugin:1.3:process (default) @ cloud-maven-standard ---
[INFO]                                                                         
[INFO] ------------------------------------------------------------------------
[INFO] Building Apache CloudStack Framework - Managed Context 4.6.0-SNAPSHOT
[INFO] ------------------------------------------------------------------------
[INFO] 
[INFO] --- maven-clean-plugin:2.5:clean (default-clean) @ cloud-framework-managed-context
---
[INFO] Deleting <http://jenkins.buildacloud.org/job/build-master-simulator/ws/framework/managed-context/target>
(includes = [**/*], excludes = [])
[INFO] Deleting <http://jenkins.buildacloud.org/job/build-master-simulator/ws/framework/managed-context>
(includes = [target, dist], excludes = [])
[INFO] 
[INFO] --- maven-checkstyle-plugin:2.11:check (cloudstack-checkstyle) @ cloud-framework-managed-context
---
[INFO] Starting audit...
Audit done.

[INFO] 
[INFO] --- maven-remote-resources-plugin:1.3:process (default) @ cloud-framework-managed-context
---
[INFO] 
[INFO] --- maven-resources-plugin:2.5:resources (default-resources) @ cloud-framework-managed-context
---
[debug] execute contextualize
[INFO] Using 'UTF-8' encoding to copy filtered resources.
[INFO] skip non existing resourceDirectory <http://jenkins.buildacloud.org/job/build-master-simulator/ws/framework/managed-context/src/main/resources>
[INFO] Copying 3 resources
[INFO] 
[INFO] --- maven-compiler-plugin:3.2:compile (default-compile) @ cloud-framework-managed-context
---
[INFO] Changes detected - recompiling the module!
[INFO] Compiling 8 source files to <http://jenkins.buildacloud.org/job/build-master-simulator/ws/framework/managed-context/target/classes>
[INFO] 
[INFO] --- maven-resources-plugin:2.5:testResources (default-testResources) @ cloud-framework-managed-context
---
[debug] execute contextualize
[INFO] Using 'UTF-8' encoding to copy filtered resources.
[INFO] skip non existing resourceDirectory <http://jenkins.buildacloud.org/job/build-master-simulator/ws/framework/managed-context/src/test/resources>
[INFO] Copying 3 resources
[INFO] 
[INFO] --- maven-compiler-plugin:3.2:testCompile (default-testCompile) @ cloud-framework-managed-context
---
[INFO] Changes detected - recompiling the module!
[INFO] Compiling 1 source file to <http://jenkins.buildacloud.org/job/build-master-simulator/ws/framework/managed-context/target/test-classes>
[INFO] 
[INFO] --- maven-surefire-plugin:2.18.1:test (default-test) @ cloud-framework-managed-context
---
[INFO] Surefire report directory: <http://jenkins.buildacloud.org/job/build-master-simulator/ws/framework/managed-context/target/surefire-reports>

-------------------------------------------------------
 T E S T S
-------------------------------------------------------
Running org.apache.cloudstack.managed.context.impl.DefaultManagedContextTest
SLF4J: Failed to load class "org.slf4j.impl.StaticLoggerBinder".
SLF4J: Defaulting to no-operation (NOP) logger implementation
SLF4J: See http://www.slf4j.org/codes.html#StaticLoggerBinder for further details.
Tests run: 6, Failures: 0, Errors: 0, Skipped: 0, Time elapsed: 0.022 sec - in org.apache.cloudstack.managed.context.impl.DefaultManagedContextTest
java.lang.OutOfMemoryError: unable to create new native thread
	at java.lang.Thread.start0(Native Method)
	at java.lang.Thread.start(Thread.java:693)
	at org.apache.maven.surefire.booter.ForkedBooter.launchLastDitchDaemonShutdownThread(ForkedBooter.java:184)
	at org.apache.maven.surefire.booter.ForkedBooter.exit(ForkedBooter.java:143)
	at org.apache.maven.surefire.booter.ForkedBooter.main(ForkedBooter.java:127)
Exception in thread "main" java.lang.OutOfMemoryError: unable to create new native thread
	at java.lang.Thread.start0(Native Method)
	at java.lang.Thread.start(Thread.java:693)
	at org.apache.maven.surefire.booter.ForkedBooter.launchLastDitchDaemonShutdownThread(ForkedBooter.java:184)
	at org.apache.maven.surefire.booter.ForkedBooter.exit(ForkedBooter.java:143)
	at org.apache.maven.surefire.booter.ForkedBooter.main(ForkedBooter.java:135)

Results :

Tests run: 6, Failures: 0, Errors: 0, Skipped: 0

[INFO] ------------------------------------------------------------------------
[INFO] Reactor Summary:
[INFO] 
[INFO] Apache CloudStack Developer Tools - Checkstyle Configuration  SUCCESS [0.700s]
[INFO] Apache CloudStack ................................. SUCCESS [0.566s]
[INFO] Apache CloudStack Maven Conventions Parent ........ SUCCESS [0.997s]
[INFO] Apache CloudStack Framework - Managed Context ..... FAILURE [2.928s]
[INFO] Apache CloudStack Utils ........................... SKIPPED
[INFO] Apache CloudStack Framework ....................... SKIPPED
[INFO] Apache CloudStack Framework - Event Notification .. SKIPPED
[INFO] Apache CloudStack Framework - Configuration ....... SKIPPED
[INFO] Apache CloudStack API ............................. SKIPPED
[INFO] Apache CloudStack Framework - REST ................ SKIPPED
[INFO] Apache CloudStack Framework - IPC ................. SKIPPED
[INFO] Apache CloudStack Cloud Engine .................... SKIPPED
[INFO] Apache CloudStack Cloud Engine API ................ SKIPPED
[INFO] Apache CloudStack Framework - Security ............ SKIPPED
[INFO] Apache CloudStack Core ............................ SKIPPED
[INFO] Apache CloudStack Agents .......................... SKIPPED
[INFO] Apache CloudStack Framework - Clustering .......... SKIPPED
[INFO] Apache CloudStack Framework - Event Notification .. SKIPPED
[INFO] Apache CloudStack Cloud Engine Schema Component ... SKIPPED
[INFO] Apache CloudStack Framework - Jobs ................ SKIPPED
[INFO] Apache CloudStack Cloud Engine Internal Components API  SKIPPED
[INFO] Apache CloudStack Server .......................... SKIPPED
[INFO] Apache CloudStack Cloud Services .................. SKIPPED
[INFO] Apache CloudStack Secondary Storage ............... SKIPPED
[INFO] Apache CloudStack Secondary Storage Service ....... SKIPPED
[INFO] Apache CloudStack Engine Storage Component ........ SKIPPED
[INFO] Apache CloudStack Engine Storage Volume Component . SKIPPED
[INFO] Apache CloudStack Engine Storage Image Component .. SKIPPED
[INFO] Apache CloudStack Engine Storage Snapshot Component  SKIPPED
[INFO] Apache CloudStack Plugin POM ...................... SKIPPED
[INFO] Apache CloudStack Plugin - Hypervisor Simulator ... SKIPPED
[INFO] ------------------------------------------------------------------------
[INFO] BUILD FAILURE
[INFO] ------------------------------------------------------------------------
[INFO] Total time: 6.809s
[INFO] Finished at: Fri Mar 13 10:35:43 CET 2015
[INFO] Final Memory: 52M/258M
[INFO] ------------------------------------------------------------------------
[ERROR] Failed to execute goal org.apache.maven.plugins:maven-surefire-plugin:2.18.1:test
(default-test) on project cloud-framework-managed-context: Error occurred in starting fork,
check output in log -> [Help 1]
[ERROR] 
[ERROR] To see the full stack trace of the errors, re-run Maven with the -e switch.
[ERROR] Re-run Maven using the -X switch to enable full debug logging.
[ERROR] 
[ERROR] For more information about the errors and possible solutions, please read the following
articles:
[ERROR] [Help 1] http://cwiki.apache.org/confluence/display/MAVEN/MojoFailureException
[ERROR] 
[ERROR] After correcting the problems, you can resume the build with the command
[ERROR]   mvn <goals> -rf :cloud-framework-managed-context
Build step 'Invoke top-level Maven targets' marked build as failure
Recording test results

Mime
View raw message