cloudstack-dev mailing list archives

Site index · List index
Message view « Date » · « Thread »
Top « Date » · « Thread »
From jenk...@cloudstack.org
Subject Build failed in Jenkins: build-master-noredist #4124
Date Wed, 04 Mar 2015 12:18:02 GMT
See <http://jenkins.buildacloud.org/job/build-master-noredist/4124/changes>

Changes:

[runseb] Fix RAT issues due to new Dockerfile

------------------------------------------
[...truncated 3559 lines...]
	at java.util.concurrent.ThreadPoolExecutor.addWorker(ThreadPoolExecutor.java:949)
	at java.util.concurrent.ThreadPoolExecutor.execute(ThreadPoolExecutor.java:1360)
	at org.apache.cloudstack.ratelimit.ApiRateLimitTest.multipleClientsCanAccessWithoutBlocking(ApiRateLimitTest.java:168)


Results :

Tests in error: 
  ApiRateLimitTest.multipleClientsCanAccessWithoutBlocking:168 ยป OutOfMemory una...

Tests run: 7, Failures: 0, Errors: 1, Skipped: 0

[INFO] 
[INFO] --- maven-resources-plugin:2.5:testResources (default-testResources) @ cloud-mom-rabbitmq
---
[debug] execute contextualize
[INFO] Using 'UTF-8' encoding to copy filtered resources.
[INFO] skip non existing resourceDirectory <http://jenkins.buildacloud.org/job/build-master-noredist/ws/plugins/event-bus/rabbitmq/test/resources>
[INFO] Copying 3 resources
[INFO] 
[INFO] --- maven-compiler-plugin:3.2:testCompile (default-testCompile) @ cloud-mom-rabbitmq
---
[INFO] No sources to compile
[INFO] 
[INFO] --- maven-surefire-plugin:2.18.1:test (default-test) @ cloud-mom-rabbitmq ---
[INFO] 
[INFO] --- maven-jar-plugin:2.5:jar (default-jar) @ cloud-mom-rabbitmq ---
[INFO] Building jar: <http://jenkins.buildacloud.org/job/build-master-noredist/ws/plugins/event-bus/rabbitmq/target/cloud-mom-rabbitmq-4.6.0-SNAPSHOT.jar>
[INFO] 
[INFO] --- maven-site-plugin:3.3:attach-descriptor (attach-descriptor) @ cloud-mom-rabbitmq
---
[INFO] 
[INFO] --- maven-install-plugin:2.3.1:install (default-install) @ cloud-mom-rabbitmq ---
[INFO] Installing <http://jenkins.buildacloud.org/job/build-master-noredist/ws/plugins/event-bus/rabbitmq/target/cloud-mom-rabbitmq-4.6.0-SNAPSHOT.jar>
to /jenkins/.m2/repository/org/apache/cloudstack/cloud-mom-rabbitmq/4.6.0-SNAPSHOT/cloud-mom-rabbitmq-4.6.0-SNAPSHOT.jar
[INFO] Installing <http://jenkins.buildacloud.org/job/build-master-noredist/ws/plugins/event-bus/rabbitmq/pom.xml>
to /jenkins/.m2/repository/org/apache/cloudstack/cloud-mom-rabbitmq/4.6.0-SNAPSHOT/cloud-mom-rabbitmq-4.6.0-SNAPSHOT.pom
[INFO] 
[INFO] --- maven-resources-plugin:2.5:testResources (default-testResources) @ cloud-mom-inmemory
---
[debug] execute contextualize
[INFO] Using 'UTF-8' encoding to copy filtered resources.
[INFO] skip non existing resourceDirectory <http://jenkins.buildacloud.org/job/build-master-noredist/ws/plugins/event-bus/inmemory/test/resources>
[INFO] Copying 3 resources
[INFO] 
[INFO] --- maven-compiler-plugin:3.2:testCompile (default-testCompile) @ cloud-mom-inmemory
---
[INFO] Changes detected - recompiling the module!
[INFO] Compiling 1 source file to <http://jenkins.buildacloud.org/job/build-master-noredist/ws/plugins/event-bus/inmemory/target/test-classes>
[INFO] 
[INFO] --- maven-surefire-plugin:2.18.1:test (default-test) @ cloud-plugin-dedicated-resources
---
[INFO] Surefire report directory: <http://jenkins.buildacloud.org/job/build-master-noredist/ws/plugins/dedicated-resources/target/surefire-reports>

-------------------------------------------------------
 T E S T S
-------------------------------------------------------
[INFO] 
[INFO] --- maven-resources-plugin:2.5:testResources (default-testResources) @ cloud-plugin-hypervisor-ovm
---
[debug] execute contextualize
[INFO] Using 'UTF-8' encoding to copy filtered resources.
[INFO] skip non existing resourceDirectory <http://jenkins.buildacloud.org/job/build-master-noredist/ws/plugins/hypervisors/ovm/test/resources>
[INFO] Copying 3 resources
[INFO] 
[INFO] --- maven-compiler-plugin:3.2:testCompile (default-testCompile) @ cloud-plugin-hypervisor-ovm
---
[INFO] No sources to compile
[INFO] 
[INFO] --- maven-surefire-plugin:2.18.1:test (default-test) @ cloud-plugin-hypervisor-ovm
---
[INFO] 
[INFO] --- maven-jar-plugin:2.5:jar (default-jar) @ cloud-plugin-hypervisor-ovm ---
[INFO] Building jar: <http://jenkins.buildacloud.org/job/build-master-noredist/ws/plugins/hypervisors/ovm/target/cloud-plugin-hypervisor-ovm-4.6.0-SNAPSHOT.jar>
[INFO] 
[INFO] --- maven-site-plugin:3.3:attach-descriptor (attach-descriptor) @ cloud-plugin-hypervisor-ovm
---
[INFO] 
[INFO] --- maven-install-plugin:2.3.1:install (default-install) @ cloud-plugin-hypervisor-ovm
---
[INFO] Installing <http://jenkins.buildacloud.org/job/build-master-noredist/ws/plugins/hypervisors/ovm/target/cloud-plugin-hypervisor-ovm-4.6.0-SNAPSHOT.jar>
to /jenkins/.m2/repository/org/apache/cloudstack/cloud-plugin-hypervisor-ovm/4.6.0-SNAPSHOT/cloud-plugin-hypervisor-ovm-4.6.0-SNAPSHOT.jar
[INFO] Installing <http://jenkins.buildacloud.org/job/build-master-noredist/ws/plugins/hypervisors/ovm/pom.xml>
to /jenkins/.m2/repository/org/apache/cloudstack/cloud-plugin-hypervisor-ovm/4.6.0-SNAPSHOT/cloud-plugin-hypervisor-ovm-4.6.0-SNAPSHOT.pom
log4j:WARN No appenders could be found for logger (org.springframework.test.context.junit4.SpringJUnit4ClassRunner).
log4j:WARN Please initialize the log4j system properly.
log4j:WARN See http://logging.apache.org/log4j/1.2/faq.html#noconfig for more info.
Running org.apache.cloudstack.dedicated.manager.DedicatedApiUnitTest
[INFO] 
[INFO] --- maven-resources-plugin:2.5:testResources (default-testResources) @ cloud-plugin-network-ovs
---
[debug] execute contextualize
[INFO] Using 'UTF-8' encoding to copy filtered resources.
[INFO] skip non existing resourceDirectory <http://jenkins.buildacloud.org/job/build-master-noredist/ws/plugins/network-elements/ovs/test/resources>
[INFO] Copying 3 resources
[INFO] 
[INFO] --- maven-compiler-plugin:3.2:testCompile (default-testCompile) @ cloud-plugin-network-ovs
---
[INFO] No sources to compile
[INFO] 
[INFO] --- maven-surefire-plugin:2.18.1:test (default-test) @ cloud-plugin-network-ovs ---
[INFO] 
[INFO] --- maven-jar-plugin:2.5:jar (default-jar) @ cloud-plugin-network-ovs ---
[INFO] Building jar: <http://jenkins.buildacloud.org/job/build-master-noredist/ws/plugins/network-elements/ovs/target/cloud-plugin-network-ovs-4.6.0-SNAPSHOT.jar>
[INFO] 
[INFO] --- maven-site-plugin:3.3:attach-descriptor (attach-descriptor) @ cloud-plugin-network-ovs
---
[INFO] 
[INFO] --- maven-install-plugin:2.3.1:install (default-install) @ cloud-plugin-network-ovs
---
[INFO] Installing <http://jenkins.buildacloud.org/job/build-master-noredist/ws/plugins/network-elements/ovs/target/cloud-plugin-network-ovs-4.6.0-SNAPSHOT.jar>
to /jenkins/.m2/repository/org/apache/cloudstack/cloud-plugin-network-ovs/4.6.0-SNAPSHOT/cloud-plugin-network-ovs-4.6.0-SNAPSHOT.jar
[INFO] Installing <http://jenkins.buildacloud.org/job/build-master-noredist/ws/plugins/network-elements/ovs/pom.xml>
to /jenkins/.m2/repository/org/apache/cloudstack/cloud-plugin-network-ovs/4.6.0-SNAPSHOT/cloud-plugin-network-ovs-4.6.0-SNAPSHOT.pom
[INFO] 
[INFO] --- maven-surefire-plugin:2.18.1:test (default-test) @ cloud-mom-inmemory ---
[INFO] Surefire report directory: <http://jenkins.buildacloud.org/job/build-master-noredist/ws/plugins/event-bus/inmemory/target/surefire-reports>

-------------------------------------------------------
 T E S T S
-------------------------------------------------------
Running org.apache.cloudstack.mom.inmemory.InMemoryEventBusTest
[INFO] ------------------------------------------------------------------------
[INFO] Reactor Summary:
[INFO] 
[INFO] Apache CloudStack Developer Tools - Checkstyle Configuration  SUCCESS [0.852s]
[INFO] Apache CloudStack ................................. SUCCESS [1.318s]
[INFO] Apache CloudStack Maven Conventions Parent ........ SUCCESS [1.137s]
[INFO] Apache CloudStack Framework - Managed Context ..... SUCCESS [3.866s]
[INFO] Apache CloudStack Utils ........................... SUCCESS [19.381s]
[INFO] Apache CloudStack Framework ....................... SUCCESS [0.453s]
[INFO] Apache CloudStack Framework - Event Notification .. SUCCESS [10.114s]
[INFO] Apache CloudStack Framework - Configuration ....... SUCCESS [4.506s]
[INFO] Apache CloudStack API ............................. SUCCESS [14.247s]
[INFO] Apache CloudStack Framework - REST ................ SUCCESS [4.618s]
[INFO] Apache CloudStack Framework - IPC ................. SUCCESS [5.268s]
[INFO] Apache CloudStack Cloud Engine .................... SUCCESS [0.464s]
[INFO] Apache CloudStack Cloud Engine API ................ SUCCESS [5.000s]
[INFO] Apache CloudStack Framework - Security ............ SUCCESS [2.545s]
[INFO] Apache CloudStack Core ............................ SUCCESS [22.551s]
[INFO] Apache CloudStack Agents .......................... SUCCESS [9.346s]
[INFO] Apache CloudStack Framework - Clustering .......... SUCCESS [3.806s]
[INFO] Apache CloudStack Framework - Event Notification .. SUCCESS [2.821s]
[INFO] Apache CloudStack Cloud Engine Schema Component ... SUCCESS [15.603s]
[INFO] Apache CloudStack Framework - Jobs ................ SUCCESS [6.781s]
[INFO] Apache CloudStack Cloud Engine Internal Components API  SUCCESS [3.159s]
[INFO] Apache CloudStack Server .......................... SUCCESS [38.515s]
[INFO] Apache CloudStack Usage Server .................... SUCCESS [9.779s]
[INFO] Apache CloudStack Cloud Engine Orchestration Component  SUCCESS [11.546s]
[INFO] Apache CloudStack Cloud Services .................. SUCCESS [0.463s]
[INFO] Apache CloudStack Secondary Storage ............... SUCCESS [2.604s]
[INFO] Apache CloudStack Secondary Storage Service ....... SUCCESS [14.571s]
[INFO] Apache CloudStack Engine Storage Component ........ SKIPPED
[INFO] Apache CloudStack Engine Storage Volume Component . SKIPPED
[INFO] Apache CloudStack Engine Storage Image Component .. SKIPPED
[INFO] Apache CloudStack Engine Storage Data Motion Component  SKIPPED
[INFO] Apache CloudStack Engine Storage Cache Component .. SKIPPED
[INFO] Apache CloudStack Engine Storage Snapshot Component  SKIPPED
[INFO] Apache CloudStack Cloud Engine API ................ SUCCESS [3.048s]
[INFO] Apache CloudStack Cloud Engine Service ............ SKIPPED
[INFO] Apache CloudStack Plugin POM ...................... SUCCESS [0.709s]
[INFO] Apache CloudStack Plugin - API Rate Limit ......... FAILURE [18.783s]
[INFO] Apache CloudStack Plugin - Storage Volume default provider  SKIPPED
[INFO] Apache CloudStack Plugin - Storage Volume SolidFire Provider  SKIPPED
[INFO] Apache CloudStack Plugin - API SolidFire .......... SKIPPED
[INFO] Apache CloudStack Plugin - API Discovery .......... SUCCESS [14.596s]
[INFO] Apache CloudStack Plugin - ACL Static Role Based .. SUCCESS [7.218s]
[INFO] Apache CloudStack Plugin - Host Anti-Affinity Processor  SUCCESS [7.167s]
[INFO] Apache CloudStack Plugin - Explicit Dedication Processor  SUCCESS [7.489s]
[INFO] Apache CloudStack Plugin - User Concentrated Pod Deployment Planner  SUCCESS [6.842s]
[INFO] Apache CloudStack Plugin - User Dispersing Deployment Planner  SUCCESS [6.435s]
[INFO] Apache CloudStack Plugin - Implicit Dedication Planner  FAILURE [10.899s]
[INFO] Apache CloudStack Plugin - Skip Heurestics Planner  SUCCESS [6.258s]
[INFO] Apache CloudStack Plugin - Host Allocator Random .. SUCCESS [6.504s]
[INFO] Apache CloudStack Plugin - Dedicated Resources .... SKIPPED
[INFO] Apache CloudStack Plugin - Hypervisor OracleVM .... SUCCESS [8.638s]
[INFO] Apache CloudStack Plugin - Open vSwitch ........... SUCCESS [8.134s]
[INFO] Apache CloudStack Plugin - Hypervisor XenServer ... SKIPPED
[INFO] Apache CloudStack Plugin - Hypervisor KVM ......... SKIPPED
[INFO] Apache CloudStack Plugin - RabbitMQ Event Bus ..... SUCCESS [5.443s]
[INFO] Apache CloudStack Plugin - In Memory Event Bus .... SKIPPED
[INFO] Apache CloudStack Plugin - Hypervisor Baremetal ... SKIPPED
[INFO] Apache CloudStack Plugin - Hypervisor UCS ......... SKIPPED
[INFO] Apache CloudStack Plugin - Hypervisor Hyper-V ..... SKIPPED
[INFO] Apache CloudStack Plugin - Network Elastic Load Balancer  SKIPPED
[INFO] Apache CloudStack Plugin - Network Internal Load Balancer  SKIPPED
[INFO] Apache CloudStack Framework - Spring Life Cycle ... SUCCESS [2.767s]
[INFO] Apache CloudStack Plugin - Network Juniper Contrail  SKIPPED
[INFO] Apache CloudStack Plugin - Palo Alto .............. SKIPPED
[INFO] Apache CloudStack Plugin - Network Netscaler ...... SKIPPED
[INFO] Apache CloudStack Plugin - Network Nicira NVP ..... SKIPPED
[INFO] Apache CloudStack Plugin - BigSwitch Virtual Network Segment  SKIPPED
[INFO] Apache CloudStack Plugin - Network Brocade VCS .... SKIPPED
[INFO] Apache CloudStack Plugin - Midokura Midonet ....... SKIPPED
[INFO] Apache CloudStack Plugin - Stratosphere SSP ....... SKIPPED
[INFO] Apache CloudStack Plugin - Network Opendaylight ... SKIPPED
[INFO] Apache CloudStack Plugin - Storage Allocator Random  SKIPPED
[INFO] Apache CloudStack Plugin - User Authenticator LDAP  SKIPPED
[INFO] Apache CloudStack Plugin - User Authenticator MD5 . SKIPPED
[INFO] Apache CloudStack Plugin - User Authenticator PBKDF2-SHA-256  SKIPPED
[INFO] Apache CloudStack Plugin - User Authenticator Plain Text  SKIPPED
[INFO] Apache CloudStack Plugin - User Authenticator SAML2  SKIPPED
[INFO] Apache CloudStack Plugin - User Authenticator SHA256 Salted  SKIPPED
[INFO] Apache CloudStack Plugin - Dns Notifier Example ... SKIPPED
[INFO] Apache CloudStack Plugin - Storage Image S3 ....... SKIPPED
[INFO] Apache CloudStack Plugin - Storage Image Swift provider  SKIPPED
[INFO] Apache CloudStack Plugin - Storage Image default provider  SKIPPED
[INFO] Apache CloudStack Plugin - Storage Image sample provider  SKIPPED
[INFO] Apache CloudStack Plugin - Storage Volume Nexenta Provider  SKIPPED
[INFO] Apache CloudStack Plugin - Storage Volume CloudByte Provider  SKIPPED
[INFO] Apache CloudStack Plugin - Storage Volume sample provider  SKIPPED
[INFO] Apache CloudStack Plugin - SNMP Alerts ............ SKIPPED
[INFO] Apache CloudStack Plugin - Syslog Alerts .......... SKIPPED
[INFO] Apache CloudStack Plugin - Network VXLAN .......... SKIPPED
[INFO] Apache CloudStack Plugin - GloboDNS ............... SKIPPED
[INFO] Apache CloudStack Plugin - NetApp File System ..... SKIPPED
[INFO] Apache CloudStack Plugin - F5 ..................... SKIPPED
[INFO] Apache CloudStack Plugin - Juniper SRX ............ SKIPPED
[INFO] Apache CloudStack Plugin - Nuage VSP .............. SKIPPED
[INFO] Apache CloudStack VMware Base ..................... SUCCESS [7.424s]
[INFO] Apache CloudStack Plugin - Hypervisor VMware ...... SKIPPED
[INFO] Apache CloudStack Plugin - Cisco VNMC ............. SKIPPED
[INFO] Apache CloudStack Plugin - MySQL HA Strategy ...... SKIPPED
[INFO] Apache CloudStack Framework - Spring Module ....... SUCCESS [9.564s]
[INFO] Apache CloudStack Secondary Storage Controller .... SUCCESS [6.145s]
[INFO] Apache CloudStack Console Proxy - RDP Client ...... SUCCESS [12.005s]
[INFO] Apache CloudStack Console Proxy ................... SUCCESS [2.544s]
[INFO] Apache CloudStack Console Proxy - Server .......... SUCCESS [5.468s]
[INFO] Apache CloudStack System VM ....................... SKIPPED
[INFO] Apache CloudStack Client UI ....................... SKIPPED
[INFO] Apache CloudStack Framework - QuickCloud .......... SUCCESS [1.663s]
[INFO] Apache CloudStack AWS API Bridge .................. SKIPPED
[INFO] ------------------------------------------------------------------------
[INFO] BUILD FAILURE
[INFO] ------------------------------------------------------------------------
[INFO] Total time: 2:35.667s (Wall Clock)
[INFO] Finished at: Wed Mar 04 13:17:14 CET 2015
Tests run: 10, Failures: 0, Errors: 0, Skipped: 0, Time elapsed: 0.645 sec - in org.apache.cloudstack.mom.inmemory.InMemoryEventBusTest
[INFO] Final Memory: 79M/726M
[INFO] ------------------------------------------------------------------------

Results :

Tests run: 10, Failures: 0, Errors: 0, Skipped: 0

[INFO] 
[INFO] --- maven-jar-plugin:2.5:jar (default-jar) @ cloud-mom-inmemory ---
[ERROR] Failed to execute goal org.apache.maven.plugins:maven-surefire-plugin:2.18.1:test
(default-test) on project cloud-plugin-planner-implicit-dedication: Execution default-test
of goal org.apache.maven.plugins:maven-surefire-plugin:2.18.1:test failed: The forked VM terminated
without properly saying goodbye. VM crash or System.exit called?
[ERROR] Command was /bin/sh -c cd <http://jenkins.buildacloud.org/job/build-master-noredist/ws/plugins/deployment-planners/implicit-dedication>
&& /usr/lib/jvm/java-1.7.0-openjdk-1.7.0.25.x86_64/jre/bin/java -jar <http://jenkins.buildacloud.org/job/build-master-noredist/ws/plugins/deployment-planners/implicit-dedication/target/surefire/surefirebooter2132214028871008804.jar>
<http://jenkins.buildacloud.org/job/build-master-noredist/ws/plugins/deployment-planners/implicit-dedication/target/surefire/surefire3782881496990878161tmp>
<http://jenkins.buildacloud.org/job/build-master-noredist/ws/plugins/deployment-planners/implicit-dedication/target/surefire/surefire_181388029989714559256tmp>
[ERROR] -> [Help 1]
[ERROR] Failed to execute goal org.apache.maven.plugins:maven-surefire-plugin:2.18.1:test
(default-test) on project cloud-plugin-api-limit-account-based: There are test failures.
[ERROR] 
[ERROR] Please refer to <http://jenkins.buildacloud.org/job/build-master-noredist/ws/plugins/api/rate-limit/target/surefire-reports>
for the individual test results.
[ERROR] -> [Help 2]
[ERROR] 
[ERROR] To see the full stack trace of the errors, re-run Maven with the -e switch.
[ERROR] Re-run Maven using the -X switch to enable full debug logging.
[ERROR] 
[ERROR] For more information about the errors and possible solutions, please read the following
articles:
[ERROR] [Help 1] http://cwiki.apache.org/confluence/display/MAVEN/PluginExecutionException
[ERROR] [Help 2] http://cwiki.apache.org/confluence/display/MAVEN/MojoFailureException
[ERROR] 
[ERROR] After correcting the problems, you can resume the build with the command
[ERROR]   mvn <goals> -rf :cloud-plugin-planner-implicit-dedication
[INFO] Building jar: <http://jenkins.buildacloud.org/job/build-master-noredist/ws/plugins/event-bus/inmemory/target/cloud-mom-inmemory-4.6.0-SNAPSHOT.jar>
Destroying 1 processes
Destroying process..
Destroyed 1 processes
Build step 'Invoke top-level Maven targets' marked build as failure
Archiving artifacts

Mime
View raw message