cloudstack-dev mailing list archives

Site index · List index
Message view « Date » · « Thread »
Top « Date » · « Thread »
From jenk...@cloudstack.org
Subject Build failed in Jenkins: build-master-noredist #4115
Date Tue, 03 Mar 2015 08:02:12 GMT
See <http://jenkins.buildacloud.org/job/build-master-noredist/4115/changes>

Changes:

[sanjay.tripathi] CLOUDSTACK-8296 VMs cannot be migrated with XenMotion as network is not
available.

------------------------------------------
[...truncated 3569 lines...]
 T E S T S
-------------------------------------------------------
Tests run: 7, Failures: 0, Errors: 0, Skipped: 0, Time elapsed: 6.669 sec - in org.apache.cloudstack.ratelimit.ApiRateLimitTest

Results :

Tests run: 7, Failures: 0, Errors: 0, Skipped: 0

[INFO] 
[INFO] --- maven-jar-plugin:2.5:jar (default-jar) @ cloud-plugin-api-limit-account-based ---
[INFO] Building jar: <http://jenkins.buildacloud.org/job/build-master-noredist/ws/plugins/api/rate-limit/target/cloud-plugin-api-limit-account-based-4.6.0-SNAPSHOT.jar>
[INFO] 
[INFO] --- maven-site-plugin:3.3:attach-descriptor (attach-descriptor) @ cloud-plugin-api-limit-account-based
---
[INFO] 
[INFO] --- maven-install-plugin:2.3.1:install (default-install) @ cloud-plugin-api-limit-account-based
---
[INFO] Installing <http://jenkins.buildacloud.org/job/build-master-noredist/ws/plugins/api/rate-limit/target/cloud-plugin-api-limit-account-based-4.6.0-SNAPSHOT.jar>
to /jenkins/.m2/repository/org/apache/cloudstack/cloud-plugin-api-limit-account-based/4.6.0-SNAPSHOT/cloud-plugin-api-limit-account-based-4.6.0-SNAPSHOT.jar
[INFO] 
[INFO] --- maven-resources-plugin:2.5:testResources (default-testResources) @ cloud-plugin-hypervisor-ovm
---
[debug] execute contextualize
[INFO] Using 'UTF-8' encoding to copy filtered resources.
[INFO] skip non existing resourceDirectory <http://jenkins.buildacloud.org/job/build-master-noredist/ws/plugins/hypervisors/ovm/test/resources>
[INFO] Copying 3 resources
[INFO] 
[INFO] --- maven-compiler-plugin:3.2:testCompile (default-testCompile) @ cloud-plugin-hypervisor-ovm
---
[INFO] No sources to compile
[INFO] 
[INFO] --- maven-surefire-plugin:2.18.1:test (default-test) @ cloud-plugin-hypervisor-ovm
---
[INFO] 
[INFO] --- maven-jar-plugin:2.5:jar (default-jar) @ cloud-plugin-hypervisor-ovm ---
[INFO] Building jar: <http://jenkins.buildacloud.org/job/build-master-noredist/ws/plugins/hypervisors/ovm/target/cloud-plugin-hypervisor-ovm-4.6.0-SNAPSHOT.jar>
[INFO] Installing <http://jenkins.buildacloud.org/job/build-master-noredist/ws/plugins/api/rate-limit/pom.xml>
to /jenkins/.m2/repository/org/apache/cloudstack/cloud-plugin-api-limit-account-based/4.6.0-SNAPSHOT/cloud-plugin-api-limit-account-based-4.6.0-SNAPSHOT.pom
[INFO] 
[INFO] --- maven-site-plugin:3.3:attach-descriptor (attach-descriptor) @ cloud-plugin-hypervisor-ovm
---
[INFO] 
[INFO] --- maven-install-plugin:2.3.1:install (default-install) @ cloud-plugin-hypervisor-ovm
---
[INFO] Installing <http://jenkins.buildacloud.org/job/build-master-noredist/ws/plugins/hypervisors/ovm/target/cloud-plugin-hypervisor-ovm-4.6.0-SNAPSHOT.jar>
to /jenkins/.m2/repository/org/apache/cloudstack/cloud-plugin-hypervisor-ovm/4.6.0-SNAPSHOT/cloud-plugin-hypervisor-ovm-4.6.0-SNAPSHOT.jar
[INFO] Installing <http://jenkins.buildacloud.org/job/build-master-noredist/ws/plugins/hypervisors/ovm/pom.xml>
to /jenkins/.m2/repository/org/apache/cloudstack/cloud-plugin-hypervisor-ovm/4.6.0-SNAPSHOT/cloud-plugin-hypervisor-ovm-4.6.0-SNAPSHOT.pom
[INFO] 
[INFO] --- maven-resources-plugin:2.5:testResources (default-testResources) @ cloud-mom-rabbitmq
---
[debug] execute contextualize
[INFO] Using 'UTF-8' encoding to copy filtered resources.
[INFO] skip non existing resourceDirectory <http://jenkins.buildacloud.org/job/build-master-noredist/ws/plugins/event-bus/rabbitmq/test/resources>
[INFO] Copying 3 resources
[INFO] 
[INFO] --- maven-compiler-plugin:3.2:testCompile (default-testCompile) @ cloud-mom-rabbitmq
---
[INFO] No sources to compile
[INFO] 
[INFO] --- maven-surefire-plugin:2.18.1:test (default-test) @ cloud-mom-rabbitmq ---
[INFO] 
[INFO] --- maven-jar-plugin:2.5:jar (default-jar) @ cloud-mom-rabbitmq ---
[INFO] Building jar: <http://jenkins.buildacloud.org/job/build-master-noredist/ws/plugins/event-bus/rabbitmq/target/cloud-mom-rabbitmq-4.6.0-SNAPSHOT.jar>
[INFO] 
[INFO] --- maven-site-plugin:3.3:attach-descriptor (attach-descriptor) @ cloud-mom-rabbitmq
---
[INFO] 
[INFO] --- maven-install-plugin:2.3.1:install (default-install) @ cloud-mom-rabbitmq ---
[INFO] Installing <http://jenkins.buildacloud.org/job/build-master-noredist/ws/plugins/event-bus/rabbitmq/target/cloud-mom-rabbitmq-4.6.0-SNAPSHOT.jar>
to /jenkins/.m2/repository/org/apache/cloudstack/cloud-mom-rabbitmq/4.6.0-SNAPSHOT/cloud-mom-rabbitmq-4.6.0-SNAPSHOT.jar
[INFO] Installing <http://jenkins.buildacloud.org/job/build-master-noredist/ws/plugins/event-bus/rabbitmq/pom.xml>
to /jenkins/.m2/repository/org/apache/cloudstack/cloud-mom-rabbitmq/4.6.0-SNAPSHOT/cloud-mom-rabbitmq-4.6.0-SNAPSHOT.pom
[INFO] 
[INFO] --- maven-resources-plugin:2.5:testResources (default-testResources) @ cloud-plugin-network-ovs
---
[debug] execute contextualize
[INFO] Using 'UTF-8' encoding to copy filtered resources.
[INFO] skip non existing resourceDirectory <http://jenkins.buildacloud.org/job/build-master-noredist/ws/plugins/network-elements/ovs/test/resources>
[INFO] Copying 3 resources
[INFO] 
[INFO] --- maven-compiler-plugin:3.2:testCompile (default-testCompile) @ cloud-plugin-network-ovs
---
[INFO] No sources to compile
[INFO] 
[INFO] --- maven-surefire-plugin:2.18.1:test (default-test) @ cloud-plugin-network-ovs ---
[INFO] 
[INFO] --- maven-jar-plugin:2.5:jar (default-jar) @ cloud-plugin-network-ovs ---
[INFO] Building jar: <http://jenkins.buildacloud.org/job/build-master-noredist/ws/plugins/network-elements/ovs/target/cloud-plugin-network-ovs-4.6.0-SNAPSHOT.jar>
[INFO] 
[INFO] --- maven-site-plugin:3.3:attach-descriptor (attach-descriptor) @ cloud-plugin-network-ovs
---
[INFO] 
[INFO] --- maven-install-plugin:2.3.1:install (default-install) @ cloud-plugin-network-ovs
---
[INFO] Installing <http://jenkins.buildacloud.org/job/build-master-noredist/ws/plugins/network-elements/ovs/target/cloud-plugin-network-ovs-4.6.0-SNAPSHOT.jar>
to /jenkins/.m2/repository/org/apache/cloudstack/cloud-plugin-network-ovs/4.6.0-SNAPSHOT/cloud-plugin-network-ovs-4.6.0-SNAPSHOT.jar
[INFO] Installing <http://jenkins.buildacloud.org/job/build-master-noredist/ws/plugins/network-elements/ovs/pom.xml>
to /jenkins/.m2/repository/org/apache/cloudstack/cloud-plugin-network-ovs/4.6.0-SNAPSHOT/cloud-plugin-network-ovs-4.6.0-SNAPSHOT.pom
log4j:WARN No appenders could be found for logger (org.springframework.test.context.junit4.SpringJUnit4ClassRunner).
log4j:WARN Please initialize the log4j system properly.
log4j:WARN See http://logging.apache.org/log4j/1.2/faq.html#noconfig for more info.
Running org.apache.cloudstack.dedicated.manager.DedicatedApiUnitTest
[INFO] 
[INFO] --- maven-resources-plugin:2.5:testResources (default-testResources) @ cloud-plugin-hypervisor-baremetal
---
[debug] execute contextualize
[INFO] Using 'UTF-8' encoding to copy filtered resources.
[INFO] skip non existing resourceDirectory <http://jenkins.buildacloud.org/job/build-master-noredist/ws/plugins/hypervisors/baremetal/test/resources>
[INFO] Copying 3 resources
[INFO] 
[INFO] --- maven-compiler-plugin:3.2:testCompile (default-testCompile) @ cloud-plugin-hypervisor-baremetal
---
[INFO] No sources to compile
[INFO] 
[INFO] --- maven-surefire-plugin:2.18.1:test (default-test) @ cloud-plugin-hypervisor-baremetal
---
[INFO] 
[INFO] --- maven-jar-plugin:2.5:jar (default-jar) @ cloud-plugin-hypervisor-baremetal ---
[INFO] Building jar: <http://jenkins.buildacloud.org/job/build-master-noredist/ws/plugins/hypervisors/baremetal/target/cloud-plugin-hypervisor-baremetal-4.6.0-SNAPSHOT.jar>
[INFO] 
[INFO] --- maven-site-plugin:3.3:attach-descriptor (attach-descriptor) @ cloud-plugin-hypervisor-baremetal
---
[INFO] 
[INFO] --- maven-install-plugin:2.3.1:install (default-install) @ cloud-plugin-hypervisor-baremetal
---
[INFO] Installing <http://jenkins.buildacloud.org/job/build-master-noredist/ws/plugins/hypervisors/baremetal/target/cloud-plugin-hypervisor-baremetal-4.6.0-SNAPSHOT.jar>
to /jenkins/.m2/repository/org/apache/cloudstack/cloud-plugin-hypervisor-baremetal/4.6.0-SNAPSHOT/cloud-plugin-hypervisor-baremetal-4.6.0-SNAPSHOT.jar
[INFO] Installing <http://jenkins.buildacloud.org/job/build-master-noredist/ws/plugins/hypervisors/baremetal/pom.xml>
to /jenkins/.m2/repository/org/apache/cloudstack/cloud-plugin-hypervisor-baremetal/4.6.0-SNAPSHOT/cloud-plugin-hypervisor-baremetal-4.6.0-SNAPSHOT.pom
Tests run: 10, Failures: 0, Errors: 0, Skipped: 0, Time elapsed: 1.527 sec - in org.apache.cloudstack.dedicated.manager.DedicatedApiUnitTest

Results :

Tests run: 10, Failures: 0, Errors: 0, Skipped: 0

[INFO] 
[INFO] --- maven-jar-plugin:2.5:jar (default-jar) @ cloud-plugin-dedicated-resources ---
[INFO] Building jar: <http://jenkins.buildacloud.org/job/build-master-noredist/ws/plugins/dedicated-resources/target/cloud-plugin-dedicated-resources-4.6.0-SNAPSHOT.jar>
[INFO] 
[INFO] --- maven-site-plugin:3.3:attach-descriptor (attach-descriptor) @ cloud-plugin-dedicated-resources
---
[INFO] 
[INFO] --- maven-install-plugin:2.3.1:install (default-install) @ cloud-plugin-dedicated-resources
---
[INFO] Installing <http://jenkins.buildacloud.org/job/build-master-noredist/ws/plugins/dedicated-resources/target/cloud-plugin-dedicated-resources-4.6.0-SNAPSHOT.jar>
to /jenkins/.m2/repository/org/apache/cloudstack/cloud-plugin-dedicated-resources/4.6.0-SNAPSHOT/cloud-plugin-dedicated-resources-4.6.0-SNAPSHOT.jar
[INFO] Installing <http://jenkins.buildacloud.org/job/build-master-noredist/ws/plugins/dedicated-resources/pom.xml>
to /jenkins/.m2/repository/org/apache/cloudstack/cloud-plugin-dedicated-resources/4.6.0-SNAPSHOT/cloud-plugin-dedicated-resources-4.6.0-SNAPSHOT.pom
[INFO] ------------------------------------------------------------------------
[INFO] Reactor Summary:
[INFO] 
[INFO] Apache CloudStack Developer Tools - Checkstyle Configuration  SUCCESS [1.453s]
[INFO] Apache CloudStack ................................. SUCCESS [1.935s]
[INFO] Apache CloudStack Maven Conventions Parent ........ SUCCESS [1.542s]
[INFO] Apache CloudStack Framework - Managed Context ..... SUCCESS [4.773s]
[INFO] Apache CloudStack Utils ........................... SUCCESS [24.122s]
[INFO] Apache CloudStack Framework ....................... SUCCESS [0.518s]
[INFO] Apache CloudStack Framework - Event Notification .. SUCCESS [13.755s]
[INFO] Apache CloudStack Framework - Configuration ....... SUCCESS [6.259s]
[INFO] Apache CloudStack API ............................. SUCCESS [15.589s]
[INFO] Apache CloudStack Framework - REST ................ SUCCESS [5.906s]
[INFO] Apache CloudStack Framework - IPC ................. SUCCESS [6.742s]
[INFO] Apache CloudStack Cloud Engine .................... SUCCESS [0.518s]
[INFO] Apache CloudStack Cloud Engine API ................ SUCCESS [6.464s]
[INFO] Apache CloudStack Framework - Security ............ SUCCESS [3.800s]
[INFO] Apache CloudStack Core ............................ SUCCESS [29.917s]
[INFO] Apache CloudStack Agents .......................... SUCCESS [10.540s]
[INFO] Apache CloudStack Framework - Clustering .......... SUCCESS [4.454s]
[INFO] Apache CloudStack Framework - Event Notification .. SUCCESS [3.779s]
[INFO] Apache CloudStack Cloud Engine Schema Component ... SUCCESS [18.996s]
[INFO] Apache CloudStack Framework - Jobs ................ SUCCESS [9.215s]
[INFO] Apache CloudStack Cloud Engine Internal Components API  SUCCESS [4.283s]
[INFO] Apache CloudStack Server .......................... SUCCESS [46.908s]
[INFO] Apache CloudStack Usage Server .................... SUCCESS [11.964s]
[INFO] Apache CloudStack Cloud Engine Orchestration Component  SUCCESS [15.208s]
[INFO] Apache CloudStack Cloud Services .................. SUCCESS [0.519s]
[INFO] Apache CloudStack Secondary Storage ............... SUCCESS [3.368s]
[INFO] Apache CloudStack Secondary Storage Service ....... SUCCESS [14.877s]
[INFO] Apache CloudStack Engine Storage Component ........ SKIPPED
[INFO] Apache CloudStack Engine Storage Volume Component . SKIPPED
[INFO] Apache CloudStack Engine Storage Image Component .. SKIPPED
[INFO] Apache CloudStack Engine Storage Data Motion Component  SKIPPED
[INFO] Apache CloudStack Engine Storage Cache Component .. SKIPPED
[INFO] Apache CloudStack Engine Storage Snapshot Component  SKIPPED
[INFO] Apache CloudStack Cloud Engine API ................ SUCCESS [4.013s]
[INFO] Apache CloudStack Cloud Engine Service ............ SKIPPED
[INFO] Apache CloudStack Plugin POM ...................... SUCCESS [0.468s]
[INFO] Apache CloudStack Plugin - API Rate Limit ......... SUCCESS [24.055s]
[INFO] Apache CloudStack Plugin - Storage Volume default provider  SKIPPED
[INFO] Apache CloudStack Plugin - Storage Volume SolidFire Provider  SKIPPED
[INFO] Apache CloudStack Plugin - API SolidFire .......... SKIPPED
[INFO] Apache CloudStack Plugin - API Discovery .......... SUCCESS [16.730s]
[INFO] Apache CloudStack Plugin - ACL Static Role Based .. SUCCESS [9.356s]
[INFO] Apache CloudStack Plugin - Host Anti-Affinity Processor  SUCCESS [8.537s]
[INFO] Apache CloudStack Plugin - Explicit Dedication Processor  SUCCESS [9.366s]
[INFO] Apache CloudStack Plugin - User Concentrated Pod Deployment Planner  SUCCESS [9.381s]
[INFO] Apache CloudStack Plugin - User Dispersing Deployment Planner  SUCCESS [7.826s]
[INFO] Apache CloudStack Plugin - Implicit Dedication Planner  FAILURE [14.439s]
[INFO] Apache CloudStack Plugin - Skip Heurestics Planner  SUCCESS [7.286s]
[INFO] Apache CloudStack Plugin - Host Allocator Random .. SUCCESS [7.612s]
[INFO] Apache CloudStack Plugin - Dedicated Resources .... SUCCESS [16.996s]
[INFO] Apache CloudStack Plugin - Hypervisor OracleVM .... SUCCESS [9.875s]
[INFO] Apache CloudStack Plugin - Open vSwitch ........... SUCCESS [10.216s]
[INFO] Apache CloudStack Plugin - Hypervisor XenServer ... SKIPPED
[INFO] Apache CloudStack Plugin - Hypervisor KVM ......... SKIPPED
[INFO] Apache CloudStack Plugin - RabbitMQ Event Bus ..... SUCCESS [7.503s]
[INFO] Apache CloudStack Plugin - In Memory Event Bus .... FAILURE [6.246s]
[INFO] Apache CloudStack Plugin - Hypervisor Baremetal ... SUCCESS [9.048s]
[INFO] Apache CloudStack Plugin - Hypervisor UCS ......... SKIPPED
[INFO] Apache CloudStack Plugin - Hypervisor Hyper-V ..... SKIPPED
[INFO] Apache CloudStack Plugin - Network Elastic Load Balancer  SKIPPED
[INFO] Apache CloudStack Plugin - Network Internal Load Balancer  SKIPPED
[INFO] Apache CloudStack Framework - Spring Life Cycle ... SUCCESS [3.657s]
[INFO] Apache CloudStack Plugin - Network Juniper Contrail  SKIPPED
[INFO] Apache CloudStack Plugin - Palo Alto .............. SKIPPED
[INFO] Apache CloudStack Plugin - Network Netscaler ...... SKIPPED
[INFO] Apache CloudStack Plugin - Network Nicira NVP ..... SKIPPED
[INFO] Apache CloudStack Plugin - BigSwitch Virtual Network Segment  SKIPPED
[INFO] Apache CloudStack Plugin - Network Brocade VCS .... SKIPPED
[INFO] Apache CloudStack Plugin - Midokura Midonet ....... SKIPPED
[INFO] Apache CloudStack Plugin - Stratosphere SSP ....... SKIPPED
[INFO] Apache CloudStack Plugin - Network Opendaylight ... SKIPPED
[INFO] Apache CloudStack Plugin - Storage Allocator Random  SKIPPED
[INFO] Apache CloudStack Plugin - User Authenticator LDAP  SKIPPED
[INFO] Apache CloudStack Plugin - User Authenticator MD5 . SKIPPED
[INFO] Apache CloudStack Plugin - User Authenticator PBKDF2-SHA-256  SKIPPED
[INFO] Apache CloudStack Plugin - User Authenticator Plain Text  SKIPPED
[INFO] Apache CloudStack Plugin - User Authenticator SAML2  SKIPPED
[INFO] Apache CloudStack Plugin - User Authenticator SHA256 Salted  SKIPPED
[INFO] Apache CloudStack Plugin - Dns Notifier Example ... SKIPPED
[INFO] Apache CloudStack Plugin - Storage Image S3 ....... SKIPPED
[INFO] Apache CloudStack Plugin - Storage Image Swift provider  SKIPPED
[INFO] Apache CloudStack Plugin - Storage Image default provider  SKIPPED
[INFO] Apache CloudStack Plugin - Storage Image sample provider  SKIPPED
[INFO] Apache CloudStack Plugin - Storage Volume Nexenta Provider  SKIPPED
[INFO] Apache CloudStack Plugin - Storage Volume CloudByte Provider  SKIPPED
[INFO] Apache CloudStack Plugin - Storage Volume sample provider  SKIPPED
[INFO] Apache CloudStack Plugin - SNMP Alerts ............ SKIPPED
[INFO] Apache CloudStack Plugin - Syslog Alerts .......... SKIPPED
[INFO] Apache CloudStack Plugin - Network VXLAN .......... SKIPPED
[INFO] Apache CloudStack Plugin - GloboDNS ............... SKIPPED
[INFO] Apache CloudStack Plugin - NetApp File System ..... SKIPPED
[INFO] Apache CloudStack Plugin - F5 ..................... SKIPPED
[INFO] Apache CloudStack Plugin - Juniper SRX ............ SKIPPED
[INFO] Apache CloudStack Plugin - Nuage VSP .............. SKIPPED
[INFO] Apache CloudStack VMware Base ..................... SUCCESS [10.228s]
[INFO] Apache CloudStack Plugin - Hypervisor VMware ...... SKIPPED
[INFO] Apache CloudStack Plugin - Cisco VNMC ............. SKIPPED
[INFO] Apache CloudStack Plugin - MySQL HA Strategy ...... SKIPPED
[INFO] Apache CloudStack Framework - Spring Module ....... SUCCESS [12.627s]
[INFO] Apache CloudStack Secondary Storage Controller .... SUCCESS [6.851s]
[INFO] Apache CloudStack Console Proxy - RDP Client ...... SUCCESS [15.324s]
[INFO] Apache CloudStack Console Proxy ................... SUCCESS [3.389s]
[INFO] Apache CloudStack Console Proxy - Server .......... SUCCESS [7.863s]
[INFO] Apache CloudStack System VM ....................... SKIPPED
[INFO] Apache CloudStack Client UI ....................... SKIPPED
[INFO] Apache CloudStack Framework - QuickCloud .......... SUCCESS [1.960s]
[INFO] Apache CloudStack AWS API Bridge .................. SKIPPED
[INFO] ------------------------------------------------------------------------
[INFO] BUILD FAILURE
[INFO] ------------------------------------------------------------------------
[INFO] Total time: 3:13.350s (Wall Clock)
[INFO] Finished at: Tue Mar 03 08:58:03 CET 2015
[INFO] Final Memory: 77M/401M
[INFO] ------------------------------------------------------------------------
[ERROR] Failed to execute goal org.apache.maven.plugins:maven-compiler-plugin:3.2:testCompile
(default-testCompile) on project cloud-mom-inmemory: Compilation failure -> [Help 1]
[ERROR] Failed to execute goal org.apache.maven.plugins:maven-surefire-plugin:2.18.1:test
(default-test) on project cloud-plugin-planner-implicit-dedication: Execution default-test
of goal org.apache.maven.plugins:maven-surefire-plugin:2.18.1:test failed: The forked VM terminated
without properly saying goodbye. VM crash or System.exit called?
[ERROR] Command was /bin/sh -c cd <http://jenkins.buildacloud.org/job/build-master-noredist/ws/plugins/deployment-planners/implicit-dedication>
&& /usr/lib/jvm/java-1.7.0-openjdk-1.7.0.25.x86_64/jre/bin/java -jar <http://jenkins.buildacloud.org/job/build-master-noredist/ws/plugins/deployment-planners/implicit-dedication/target/surefire/surefirebooter7732594806375211916.jar>
<http://jenkins.buildacloud.org/job/build-master-noredist/ws/plugins/deployment-planners/implicit-dedication/target/surefire/surefire3228738361725273402tmp>
<http://jenkins.buildacloud.org/job/build-master-noredist/ws/plugins/deployment-planners/implicit-dedication/target/surefire/surefire_182308284253660899604tmp>
[ERROR] -> [Help 2]
[ERROR] 
[ERROR] To see the full stack trace of the errors, re-run Maven with the -e switch.
[ERROR] Re-run Maven using the -X switch to enable full debug logging.
[ERROR] 
[ERROR] For more information about the errors and possible solutions, please read the following
articles:
[ERROR] [Help 1] http://cwiki.apache.org/confluence/display/MAVEN/MojoFailureException
[ERROR] [Help 2] http://cwiki.apache.org/confluence/display/MAVEN/PluginExecutionException
[ERROR] 
[ERROR] After correcting the problems, you can resume the build with the command
[ERROR]   mvn <goals> -rf :cloud-mom-inmemory
Build step 'Invoke top-level Maven targets' marked build as failure
Archiving artifacts

Mime
View raw message