cloudstack-dev mailing list archives

Site index · List index
Message view « Date » · « Thread »
Top « Date » · « Thread »
From jenk...@cloudstack.org
Subject Build failed in Jenkins: build-master-simulator #1799
Date Wed, 11 Mar 2015 04:05:45 GMT
See <http://jenkins.buildacloud.org/job/build-master-simulator/1799/changes>

Changes:

[Rajani Karuturi] fix yum install require java => 1.7.0 when build management agent and
usage rpm package

------------------------------------------
Started by an SCM change
[EnvInject] - Loading node environment variables.
Building remotely on cloudstack-buildslave-centos6-9ee (cloudstack-buildslave-centos6) in
workspace <http://jenkins.buildacloud.org/job/build-master-simulator/ws/>
 > /usr/bin/git rev-parse --is-inside-work-tree # timeout=400
Fetching changes from the remote Git repository
 > /usr/bin/git config remote.origin.url https://git-wip-us.apache.org/repos/asf/cloudstack.git
# timeout=400
Fetching upstream changes from https://git-wip-us.apache.org/repos/asf/cloudstack.git
 > /usr/bin/git --version # timeout=400
 > /usr/bin/git fetch --tags --progress https://git-wip-us.apache.org/repos/asf/cloudstack.git
+refs/heads/*:refs/remotes/origin/*
 > /usr/bin/git rev-parse refs/remotes/origin/master^{commit} # timeout=400
 > /usr/bin/git rev-parse refs/remotes/origin/origin/master^{commit} # timeout=400
Checking out Revision 555c4329462ac632890c7cde3bac8db8b6e8a682 (refs/remotes/origin/master)
 > /usr/bin/git config core.sparsecheckout # timeout=400
 > /usr/bin/git checkout -f 555c4329462ac632890c7cde3bac8db8b6e8a682
 > /usr/bin/git rev-list 9a38b2f7de79888cdbbb2dca2305d6ec10f81ee0 # timeout=400
[copy-to-slave] Copying 'settings.xml', excluding nothing, from 'file:/var/lib/jenkins/userContent/'
on the master to '<http://jenkins.buildacloud.org/job/build-master-simulator/ws/'> on
'cloudstack-buildslave-centos6-9ee'.
[build-master-simulator] $ /jenkins/tools/hudson.tasks.Maven_MavenInstallation/maven-3.1.1/bin/mvn
-s <http://jenkins.buildacloud.org/job/build-master-simulator/ws/settings.xml> -Psimulator
-pl plugins/hypervisors/simulator -am clean test
[INFO] Scanning for projects...
[INFO] ------------------------------------------------------------------------
[INFO] Reactor Build Order:
[INFO] 
[INFO] Apache CloudStack Developer Tools - Checkstyle Configuration
[INFO] Apache CloudStack
[INFO] Apache CloudStack Maven Conventions Parent
[INFO] Apache CloudStack Framework - Managed Context
[INFO] Apache CloudStack Utils
[INFO] Apache CloudStack Framework
[INFO] Apache CloudStack Framework - Event Notification
[INFO] Apache CloudStack Framework - Configuration
[INFO] Apache CloudStack API
[INFO] Apache CloudStack Framework - REST
[INFO] Apache CloudStack Framework - IPC
[INFO] Apache CloudStack Cloud Engine
[INFO] Apache CloudStack Cloud Engine API
[INFO] Apache CloudStack Framework - Security
[INFO] Apache CloudStack Core
[INFO] Apache CloudStack Agents
[INFO] Apache CloudStack Framework - Clustering
[INFO] Apache CloudStack Framework - Event Notification
[INFO] Apache CloudStack Cloud Engine Schema Component
[INFO] Apache CloudStack Framework - Jobs
[INFO] Apache CloudStack Cloud Engine Internal Components API
[INFO] Apache CloudStack Server
[INFO] Apache CloudStack Cloud Services
[INFO] Apache CloudStack Secondary Storage
[INFO] Apache CloudStack Secondary Storage Service
[INFO] Apache CloudStack Engine Storage Component
[INFO] Apache CloudStack Engine Storage Volume Component
[INFO] Apache CloudStack Engine Storage Image Component
[INFO] Apache CloudStack Engine Storage Snapshot Component
[INFO] Apache CloudStack Plugin POM
[INFO] Apache CloudStack Plugin - Hypervisor Simulator
[INFO]                                                                         
[INFO] ------------------------------------------------------------------------
[INFO] Building Apache CloudStack Developer Tools - Checkstyle Configuration 4.6.0-SNAPSHOT
[INFO] ------------------------------------------------------------------------
[INFO] 
[INFO] --- maven-clean-plugin:2.5:clean (default-clean) @ checkstyle ---
[INFO] Deleting <http://jenkins.buildacloud.org/job/build-master-simulator/ws/tools/checkstyle/target>
[INFO] 
[INFO] --- maven-resources-plugin:2.6:resources (default-resources) @ checkstyle ---
[WARNING] Using platform encoding (UTF-8 actually) to copy filtered resources, i.e. build
is platform dependent!
[INFO] Copying 3 resources
[INFO] 
[INFO] --- maven-compiler-plugin:2.5.1:compile (default-compile) @ checkstyle ---
[INFO] No sources to compile
[INFO] 
[INFO] --- maven-resources-plugin:2.6:testResources (default-testResources) @ checkstyle ---
[WARNING] Using platform encoding (UTF-8 actually) to copy filtered resources, i.e. build
is platform dependent!
[INFO] skip non existing resourceDirectory <http://jenkins.buildacloud.org/job/build-master-simulator/ws/tools/checkstyle/src/test/resources>
[INFO] 
[INFO] --- maven-compiler-plugin:2.5.1:testCompile (default-testCompile) @ checkstyle ---
[INFO] No sources to compile
[INFO] 
[INFO] --- maven-surefire-plugin:2.12.4:test (default-test) @ checkstyle ---
[INFO] No tests to run.
[INFO]                                                                         
[INFO] ------------------------------------------------------------------------
[INFO] Building Apache CloudStack 4.6.0-SNAPSHOT
[INFO] ------------------------------------------------------------------------
[INFO] 
[INFO] --- maven-clean-plugin:2.5:clean (default-clean) @ cloudstack ---
[INFO] Deleting <http://jenkins.buildacloud.org/job/build-master-simulator/ws/> (includes
= [target, dist], excludes = [])
[INFO] 
[INFO] --- maven-remote-resources-plugin:1.3:process (default) @ cloudstack ---
[INFO]                                                                         
[INFO] ------------------------------------------------------------------------
[INFO] Building Apache CloudStack Maven Conventions Parent 4.6.0-SNAPSHOT
[INFO] ------------------------------------------------------------------------
[INFO] 
[INFO] --- maven-clean-plugin:2.5:clean (default-clean) @ cloud-maven-standard ---
[INFO] Deleting <http://jenkins.buildacloud.org/job/build-master-simulator/ws/maven-standard/target>
(includes = [**/*], excludes = [])
[INFO] Deleting <http://jenkins.buildacloud.org/job/build-master-simulator/ws/maven-standard>
(includes = [target, dist], excludes = [])
[INFO] 
[INFO] --- maven-checkstyle-plugin:2.11:check (cloudstack-checkstyle) @ cloud-maven-standard
---
[INFO] Starting audit...
Audit done.

[INFO] 
[INFO] --- maven-remote-resources-plugin:1.3:process (default) @ cloud-maven-standard ---
[INFO]                                                                         
[INFO] ------------------------------------------------------------------------
[INFO] Building Apache CloudStack Framework - Managed Context 4.6.0-SNAPSHOT
[INFO] ------------------------------------------------------------------------
[INFO] 
[INFO] --- maven-clean-plugin:2.5:clean (default-clean) @ cloud-framework-managed-context
---
[INFO] Deleting <http://jenkins.buildacloud.org/job/build-master-simulator/ws/framework/managed-context/target>
(includes = [**/*], excludes = [])
[INFO] Deleting <http://jenkins.buildacloud.org/job/build-master-simulator/ws/framework/managed-context>
(includes = [target, dist], excludes = [])
[INFO] 
[INFO] --- maven-checkstyle-plugin:2.11:check (cloudstack-checkstyle) @ cloud-framework-managed-context
---
[INFO] Starting audit...
Audit done.

[INFO] 
[INFO] --- maven-remote-resources-plugin:1.3:process (default) @ cloud-framework-managed-context
---
[INFO] 
[INFO] --- maven-resources-plugin:2.5:resources (default-resources) @ cloud-framework-managed-context
---
[debug] execute contextualize
[INFO] Using 'UTF-8' encoding to copy filtered resources.
[INFO] skip non existing resourceDirectory <http://jenkins.buildacloud.org/job/build-master-simulator/ws/framework/managed-context/src/main/resources>
[INFO] Copying 3 resources
[INFO] 
[INFO] --- maven-compiler-plugin:3.2:compile (default-compile) @ cloud-framework-managed-context
---
[INFO] Changes detected - recompiling the module!
[INFO] Compiling 8 source files to <http://jenkins.buildacloud.org/job/build-master-simulator/ws/framework/managed-context/target/classes>
[ERROR] unable to create new native thread -> [Help 1]
[ERROR] 
[ERROR] To see the full stack trace of the errors, re-run Maven with the -e switch.
[ERROR] Re-run Maven using the -X switch to enable full debug logging.
[ERROR] 
[ERROR] For more information about the errors and possible solutions, please read the following
articles:
[ERROR] [Help 1] http://cwiki.apache.org/confluence/display/MAVEN/OutOfMemoryError
Build step 'Invoke top-level Maven targets' marked build as failure
Recording test results
ERROR: Publisher hudson.tasks.junit.JUnitResultArchiver aborted due to exception
hudson.AbortException: Test reports were found but none of them are new. Did tests run? 
For example, <http://jenkins.buildacloud.org/job/build-master-simulator/ws/agent/target/surefire-reports/TEST-com.cloud.agent.AgentShellTest.xml>
is 1 day 16 hr old

	at hudson.tasks.junit.TestResult.parse(TestResult.java:178)
	at hudson.tasks.junit.TestResult.parse(TestResult.java:146)
	at hudson.tasks.junit.TestResult.<init>(TestResult.java:122)
	at hudson.tasks.junit.JUnitParser$ParseResultCallable.invoke(JUnitParser.java:119)
	at hudson.tasks.junit.JUnitParser$ParseResultCallable.invoke(JUnitParser.java:93)
	at hudson.FilePath$FileCallableWrapper.call(FilePath.java:2665)
	at hudson.remoting.UserRequest.perform(UserRequest.java:121)
	at hudson.remoting.UserRequest.perform(UserRequest.java:49)
	at hudson.remoting.Request$2.run(Request.java:324)
	at hudson.remoting.InterceptingExecutorService$1.call(InterceptingExecutorService.java:68)
	at java.util.concurrent.FutureTask$Sync.innerRun(FutureTask.java:334)
	at java.util.concurrent.FutureTask.run(FutureTask.java:166)
	at java.util.concurrent.ThreadPoolExecutor.runWorker(ThreadPoolExecutor.java:1146)
	at java.util.concurrent.ThreadPoolExecutor$Worker.run(ThreadPoolExecutor.java:615)
	at java.lang.Thread.run(Thread.java:701)
	at ......remote call to cloudstack-buildslave-centos6-9ee(Native Method)
	at hudson.remoting.Channel.attachCallSiteStackTrace(Channel.java:1356)
	at hudson.remoting.UserResponse.retrieve(UserRequest.java:221)
	at hudson.remoting.Channel.call(Channel.java:752)
	at hudson.FilePath.act(FilePath.java:970)
	at hudson.FilePath.act(FilePath.java:959)
	at hudson.tasks.junit.JUnitParser.parseResult(JUnitParser.java:90)
	at hudson.tasks.junit.JUnitResultArchiver.parse(JUnitResultArchiver.java:120)
	at hudson.tasks.junit.JUnitResultArchiver.perform(JUnitResultArchiver.java:137)
	at hudson.tasks.BuildStepCompatibilityLayer.perform(BuildStepCompatibilityLayer.java:74)
	at hudson.tasks.BuildStepMonitor$1.perform(BuildStepMonitor.java:20)
	at hudson.model.AbstractBuild$AbstractBuildExecution.perform(AbstractBuild.java:770)
	at hudson.model.AbstractBuild$AbstractBuildExecution.performAllBuildSteps(AbstractBuild.java:734)
	at hudson.model.Build$BuildExecution.post2(Build.java:183)
	at hudson.model.AbstractBuild$AbstractBuildExecution.post(AbstractBuild.java:683)
	at hudson.model.Run.execute(Run.java:1784)
	at hudson.model.FreeStyleBuild.run(FreeStyleBuild.java:43)
	at hudson.model.ResourceController.execute(ResourceController.java:89)
	at hudson.model.Executor.run(Executor.java:240)

Mime
View raw message