cloudstack-dev mailing list archives

Site index · List index
Message view « Date » · « Thread »
Top « Date » · « Thread »
From jenk...@cloudstack.org
Subject Build failed in Jenkins: build-master-simulator #1750
Date Wed, 04 Mar 2015 07:25:43 GMT
See <http://jenkins.buildacloud.org/job/build-master-simulator/1750/changes>

Changes:

[Rajani Karuturi] listDirectory method updated to use ObjectListing.isTruncated().

------------------------------------------
Started by an SCM change
[EnvInject] - Loading node environment variables.
Building remotely on cloudstack-buildslave-centos6-9ee (cloudstack-buildslave-centos6) in
workspace <http://jenkins.buildacloud.org/job/build-master-simulator/ws/>
 > /usr/bin/git rev-parse --is-inside-work-tree # timeout=400
Fetching changes from the remote Git repository
 > /usr/bin/git config remote.origin.url https://git-wip-us.apache.org/repos/asf/cloudstack.git
# timeout=400
Fetching upstream changes from https://git-wip-us.apache.org/repos/asf/cloudstack.git
 > /usr/bin/git --version # timeout=400
 > /usr/bin/git fetch --tags --progress https://git-wip-us.apache.org/repos/asf/cloudstack.git
+refs/heads/*:refs/remotes/origin/*
 > /usr/bin/git rev-parse refs/remotes/origin/master^{commit} # timeout=400
 > /usr/bin/git rev-parse refs/remotes/origin/origin/master^{commit} # timeout=400
Checking out Revision 0b6c540a203453580bb76a0d0a60be292fccfa0e (refs/remotes/origin/master)
 > /usr/bin/git config core.sparsecheckout # timeout=400
 > /usr/bin/git checkout -f 0b6c540a203453580bb76a0d0a60be292fccfa0e
 > /usr/bin/git rev-list 7c1590ffd67b74f52fe374b0fb91f8c1ef731c39 # timeout=400
[copy-to-slave] Copying 'settings.xml', excluding nothing, from 'file:/var/lib/jenkins/userContent/'
on the master to '<http://jenkins.buildacloud.org/job/build-master-simulator/ws/'> on
'cloudstack-buildslave-centos6-9ee'.
[build-master-simulator] $ /jenkins/tools/hudson.tasks.Maven_MavenInstallation/maven-3.1.1/bin/mvn
-s <http://jenkins.buildacloud.org/job/build-master-simulator/ws/settings.xml> -Psimulator
-pl plugins/hypervisors/simulator -am clean test
[INFO] Scanning for projects...
[INFO] ------------------------------------------------------------------------
[INFO] Reactor Build Order:
[INFO] 
[INFO] Apache CloudStack Developer Tools - Checkstyle Configuration
[INFO] Apache CloudStack
[INFO] Apache CloudStack Maven Conventions Parent
[INFO] Apache CloudStack Framework - Managed Context
[INFO] Apache CloudStack Utils
[INFO] Apache CloudStack Framework
[INFO] Apache CloudStack Framework - Event Notification
[INFO] Apache CloudStack Framework - Configuration
[INFO] Apache CloudStack API
[INFO] Apache CloudStack Framework - REST
[INFO] Apache CloudStack Framework - IPC
[INFO] Apache CloudStack Cloud Engine
[INFO] Apache CloudStack Cloud Engine API
[INFO] Apache CloudStack Framework - Security
[INFO] Apache CloudStack Core
[INFO] Apache CloudStack Agents
[INFO] Apache CloudStack Framework - Clustering
[INFO] Apache CloudStack Framework - Event Notification
[INFO] Apache CloudStack Cloud Engine Schema Component
[INFO] Apache CloudStack Framework - Jobs
[INFO] Apache CloudStack Cloud Engine Internal Components API
[INFO] Apache CloudStack Server
[INFO] Apache CloudStack Cloud Services
[INFO] Apache CloudStack Secondary Storage
[INFO] Apache CloudStack Secondary Storage Service
[INFO] Apache CloudStack Engine Storage Component
[INFO] Apache CloudStack Engine Storage Volume Component
[INFO] Apache CloudStack Engine Storage Image Component
[INFO] Apache CloudStack Engine Storage Snapshot Component
[INFO] Apache CloudStack Plugin POM
[INFO] Apache CloudStack Plugin - Hypervisor Simulator
[INFO]                                                                         
[INFO] ------------------------------------------------------------------------
[INFO] Building Apache CloudStack Developer Tools - Checkstyle Configuration 4.6.0-SNAPSHOT
[INFO] ------------------------------------------------------------------------
[INFO] 
[INFO] --- maven-clean-plugin:2.5:clean (default-clean) @ checkstyle ---
[INFO] Deleting <http://jenkins.buildacloud.org/job/build-master-simulator/ws/tools/checkstyle/target>
[INFO] 
[INFO] --- maven-resources-plugin:2.6:resources (default-resources) @ checkstyle ---
[WARNING] Using platform encoding (UTF-8 actually) to copy filtered resources, i.e. build
is platform dependent!
[INFO] Copying 3 resources
[INFO] 
[INFO] --- maven-compiler-plugin:2.5.1:compile (default-compile) @ checkstyle ---
[INFO] No sources to compile
[INFO] 
[INFO] --- maven-resources-plugin:2.6:testResources (default-testResources) @ checkstyle ---
[WARNING] Using platform encoding (UTF-8 actually) to copy filtered resources, i.e. build
is platform dependent!
[INFO] skip non existing resourceDirectory <http://jenkins.buildacloud.org/job/build-master-simulator/ws/tools/checkstyle/src/test/resources>
[INFO] 
[INFO] --- maven-compiler-plugin:2.5.1:testCompile (default-testCompile) @ checkstyle ---
[INFO] No sources to compile
[INFO] 
[INFO] --- maven-surefire-plugin:2.12.4:test (default-test) @ checkstyle ---
[INFO] No tests to run.
[INFO]                                                                         
[INFO] ------------------------------------------------------------------------
[INFO] Building Apache CloudStack 4.6.0-SNAPSHOT
[INFO] ------------------------------------------------------------------------
[INFO] 
[INFO] --- maven-clean-plugin:2.5:clean (default-clean) @ cloudstack ---
[INFO] Deleting <http://jenkins.buildacloud.org/job/build-master-simulator/ws/target>
(includes = [**/*], excludes = [])
[INFO] Deleting <http://jenkins.buildacloud.org/job/build-master-simulator/ws/> (includes
= [target, dist], excludes = [])
[INFO] 
[INFO] --- maven-remote-resources-plugin:1.3:process (default) @ cloudstack ---
[INFO]                                                                         
[INFO] ------------------------------------------------------------------------
[INFO] Building Apache CloudStack Maven Conventions Parent 4.6.0-SNAPSHOT
[INFO] ------------------------------------------------------------------------
[INFO] 
[INFO] --- maven-clean-plugin:2.5:clean (default-clean) @ cloud-maven-standard ---
[INFO] Deleting <http://jenkins.buildacloud.org/job/build-master-simulator/ws/maven-standard/target>
(includes = [**/*], excludes = [])
[INFO] Deleting <http://jenkins.buildacloud.org/job/build-master-simulator/ws/maven-standard>
(includes = [target, dist], excludes = [])
[INFO] 
[INFO] --- maven-checkstyle-plugin:2.11:check (cloudstack-checkstyle) @ cloud-maven-standard
---
[INFO] Starting audit...
Audit done.

[INFO] 
[INFO] --- maven-remote-resources-plugin:1.3:process (default) @ cloud-maven-standard ---
[INFO]                                                                         
[INFO] ------------------------------------------------------------------------
[INFO] Building Apache CloudStack Framework - Managed Context 4.6.0-SNAPSHOT
[INFO] ------------------------------------------------------------------------
[INFO] 
[INFO] --- maven-clean-plugin:2.5:clean (default-clean) @ cloud-framework-managed-context
---
[INFO] Deleting <http://jenkins.buildacloud.org/job/build-master-simulator/ws/framework/managed-context/target>
(includes = [**/*], excludes = [])
[INFO] Deleting <http://jenkins.buildacloud.org/job/build-master-simulator/ws/framework/managed-context>
(includes = [target, dist], excludes = [])
[INFO] 
[INFO] --- maven-checkstyle-plugin:2.11:check (cloudstack-checkstyle) @ cloud-framework-managed-context
---
[INFO] Starting audit...
Audit done.

[INFO] 
[INFO] --- maven-remote-resources-plugin:1.3:process (default) @ cloud-framework-managed-context
---
[INFO] 
[INFO] --- maven-resources-plugin:2.5:resources (default-resources) @ cloud-framework-managed-context
---
[debug] execute contextualize
[INFO] Using 'UTF-8' encoding to copy filtered resources.
[INFO] skip non existing resourceDirectory <http://jenkins.buildacloud.org/job/build-master-simulator/ws/framework/managed-context/src/main/resources>
[INFO] Copying 3 resources
[INFO] 
[INFO] --- maven-compiler-plugin:3.2:compile (default-compile) @ cloud-framework-managed-context
---
[INFO] Changes detected - recompiling the module!
[INFO] Compiling 8 source files to <http://jenkins.buildacloud.org/job/build-master-simulator/ws/framework/managed-context/target/classes>
[INFO] 
[INFO] --- maven-resources-plugin:2.5:testResources (default-testResources) @ cloud-framework-managed-context
---
[debug] execute contextualize
[INFO] Using 'UTF-8' encoding to copy filtered resources.
[INFO] skip non existing resourceDirectory <http://jenkins.buildacloud.org/job/build-master-simulator/ws/framework/managed-context/src/test/resources>
[INFO] Copying 3 resources
[INFO] 
[INFO] --- maven-compiler-plugin:3.2:testCompile (default-testCompile) @ cloud-framework-managed-context
---
[INFO] Changes detected - recompiling the module!
[INFO] Compiling 1 source file to <http://jenkins.buildacloud.org/job/build-master-simulator/ws/framework/managed-context/target/test-classes>
[INFO] 
[INFO] --- maven-surefire-plugin:2.18.1:test (default-test) @ cloud-framework-managed-context
---
[INFO] Surefire report directory: <http://jenkins.buildacloud.org/job/build-master-simulator/ws/framework/managed-context/target/surefire-reports>

-------------------------------------------------------
 T E S T S
-------------------------------------------------------
Running org.apache.cloudstack.managed.context.impl.DefaultManagedContextTest
SLF4J: Failed to load class "org.slf4j.impl.StaticLoggerBinder".
SLF4J: Defaulting to no-operation (NOP) logger implementation
SLF4J: See http://www.slf4j.org/codes.html#StaticLoggerBinder for further details.
Tests run: 6, Failures: 0, Errors: 0, Skipped: 0, Time elapsed: 0.031 sec - in org.apache.cloudstack.managed.context.impl.DefaultManagedContextTest

Results :

Tests run: 6, Failures: 0, Errors: 0, Skipped: 0

[INFO]                                                                         
[INFO] ------------------------------------------------------------------------
[INFO] Building Apache CloudStack Utils 4.6.0-SNAPSHOT
[INFO] ------------------------------------------------------------------------
[INFO] 
[INFO] --- maven-clean-plugin:2.5:clean (default-clean) @ cloud-utils ---
[INFO] Deleting <http://jenkins.buildacloud.org/job/build-master-simulator/ws/utils/target>
(includes = [**/*], excludes = [])
[INFO] Deleting <http://jenkins.buildacloud.org/job/build-master-simulator/ws/utils>
(includes = [target, dist], excludes = [])
[INFO] 
[INFO] --- maven-checkstyle-plugin:2.11:check (cloudstack-checkstyle) @ cloud-utils ---
[INFO] Starting audit...
<http://jenkins.buildacloud.org/job/build-master-simulator/ws/utils/src/com/cloud/utils/S3Utils.java>:342:4:
Line contains a tab character.
<http://jenkins.buildacloud.org/job/build-master-simulator/ws/utils/src/com/cloud/utils/S3Utils.java>:343:4:
Line contains a tab character.
<http://jenkins.buildacloud.org/job/build-master-simulator/ws/utils/src/com/cloud/utils/S3Utils.java>:344:4:
Line contains a tab character.
<http://jenkins.buildacloud.org/job/build-master-simulator/ws/utils/src/com/cloud/utils/S3Utils.java>:346:4:
Line contains a tab character.
<http://jenkins.buildacloud.org/job/build-master-simulator/ws/utils/src/com/cloud/utils/S3Utils.java>:347:4:
Line contains a tab character.
<http://jenkins.buildacloud.org/job/build-master-simulator/ws/utils/src/com/cloud/utils/S3Utils.java>:348:
Line has trailing spaces.
<http://jenkins.buildacloud.org/job/build-master-simulator/ws/utils/src/com/cloud/utils/S3Utils.java>:348:4:
Line contains a tab character.
<http://jenkins.buildacloud.org/job/build-master-simulator/ws/utils/src/com/cloud/utils/S3Utils.java>:349:4:
Line contains a tab character.
<http://jenkins.buildacloud.org/job/build-master-simulator/ws/utils/src/com/cloud/utils/S3Utils.java>:350:4:
Line contains a tab character.
<http://jenkins.buildacloud.org/job/build-master-simulator/ws/utils/src/com/cloud/utils/S3Utils.java>:351:4:
Line contains a tab character.
<http://jenkins.buildacloud.org/job/build-master-simulator/ws/utils/src/com/cloud/utils/S3Utils.java>:352:4:
Line contains a tab character.
<http://jenkins.buildacloud.org/job/build-master-simulator/ws/utils/src/com/cloud/utils/S3Utils.java>:353:
Line has trailing spaces.
Audit done.

[INFO] ------------------------------------------------------------------------
[INFO] Reactor Summary:
[INFO] 
[INFO] Apache CloudStack Developer Tools - Checkstyle Configuration  SUCCESS [0.710s]
[INFO] Apache CloudStack ................................. SUCCESS [0.550s]
[INFO] Apache CloudStack Maven Conventions Parent ........ SUCCESS [1.024s]
[INFO] Apache CloudStack Framework - Managed Context ..... SUCCESS [2.856s]
[INFO] Apache CloudStack Utils ........................... FAILURE [1.269s]
[INFO] Apache CloudStack Framework ....................... SKIPPED
[INFO] Apache CloudStack Framework - Event Notification .. SKIPPED
[INFO] Apache CloudStack Framework - Configuration ....... SKIPPED
[INFO] Apache CloudStack API ............................. SKIPPED
[INFO] Apache CloudStack Framework - REST ................ SKIPPED
[INFO] Apache CloudStack Framework - IPC ................. SKIPPED
[INFO] Apache CloudStack Cloud Engine .................... SKIPPED
[INFO] Apache CloudStack Cloud Engine API ................ SKIPPED
[INFO] Apache CloudStack Framework - Security ............ SKIPPED
[INFO] Apache CloudStack Core ............................ SKIPPED
[INFO] Apache CloudStack Agents .......................... SKIPPED
[INFO] Apache CloudStack Framework - Clustering .......... SKIPPED
[INFO] Apache CloudStack Framework - Event Notification .. SKIPPED
[INFO] Apache CloudStack Cloud Engine Schema Component ... SKIPPED
[INFO] Apache CloudStack Framework - Jobs ................ SKIPPED
[INFO] Apache CloudStack Cloud Engine Internal Components API  SKIPPED
[INFO] Apache CloudStack Server .......................... SKIPPED
[INFO] Apache CloudStack Cloud Services .................. SKIPPED
[INFO] Apache CloudStack Secondary Storage ............... SKIPPED
[INFO] Apache CloudStack Secondary Storage Service ....... SKIPPED
[INFO] Apache CloudStack Engine Storage Component ........ SKIPPED
[INFO] Apache CloudStack Engine Storage Volume Component . SKIPPED
[INFO] Apache CloudStack Engine Storage Image Component .. SKIPPED
[INFO] Apache CloudStack Engine Storage Snapshot Component  SKIPPED
[INFO] Apache CloudStack Plugin POM ...................... SKIPPED
[INFO] Apache CloudStack Plugin - Hypervisor Simulator ... SKIPPED
[INFO] ------------------------------------------------------------------------
[INFO] BUILD FAILURE
[INFO] ------------------------------------------------------------------------
[INFO] Total time: 8.021s
[INFO] Finished at: Wed Mar 04 08:26:04 CET 2015
[INFO] Final Memory: 48M/288M
[INFO] ------------------------------------------------------------------------
[ERROR] Failed to execute goal org.apache.maven.plugins:maven-checkstyle-plugin:2.11:check
(cloudstack-checkstyle) on project cloud-utils: Failed during checkstyle execution: There
are 12 checkstyle errors. -> [Help 1]
[ERROR] 
[ERROR] To see the full stack trace of the errors, re-run Maven with the -e switch.
[ERROR] Re-run Maven using the -X switch to enable full debug logging.
[ERROR] 
[ERROR] For more information about the errors and possible solutions, please read the following
articles:
[ERROR] [Help 1] http://cwiki.apache.org/confluence/display/MAVEN/MojoExecutionException
[ERROR] 
[ERROR] After correcting the problems, you can resume the build with the command
[ERROR]   mvn <goals> -rf :cloud-utils
Build step 'Invoke top-level Maven targets' marked build as failure
Recording test results

Mime
View raw message