cloudstack-dev mailing list archives

Site index · List index
Message view « Date » · « Thread »
Top « Date » · « Thread »
From jenk...@cloudstack.org
Subject Build failed in Jenkins: build-4.5 #389
Date Wed, 11 Mar 2015 12:04:41 GMT
See <http://jenkins.buildacloud.org/job/build-4.5/389/changes>

Changes:

[Rohit Yadav] server: remove unused import in ImageStoreJoinDaoImpl

------------------------------------------
[...truncated 2733 lines...]
[INFO] ------------------------------------------------------------------------
[INFO]                                                                         
[INFO] ------------------------------------------------------------------------
[INFO] Skipping Apache CloudStack Plugin - User Authenticator SAML2
[INFO] This project has been banned from the build due to previous failures.
[INFO] ------------------------------------------------------------------------
[INFO]                                                                         
[INFO] ------------------------------------------------------------------------
[INFO] Skipping Apache CloudStack Plugin - User Authenticator SHA256 Salted
[INFO] This project has been banned from the build due to previous failures.
[INFO] ------------------------------------------------------------------------
[INFO]                                                                         
[INFO] ------------------------------------------------------------------------
[INFO] Skipping Apache CloudStack Plugin - Dns Notifier Example
[INFO] This project has been banned from the build due to previous failures.
[INFO] ------------------------------------------------------------------------
[INFO]                                                                         
[INFO] ------------------------------------------------------------------------
[INFO] Skipping Apache CloudStack Plugin - SNMP Alerts
[INFO] This project has been banned from the build due to previous failures.
[INFO] ------------------------------------------------------------------------
[INFO]                                                                         
[INFO] ------------------------------------------------------------------------
[INFO] Skipping Apache CloudStack Plugin - Syslog Alerts
[INFO] This project has been banned from the build due to previous failures.
[INFO] ------------------------------------------------------------------------
[INFO]                                                                         
[INFO] ------------------------------------------------------------------------
[INFO] Skipping Apache CloudStack Plugin - Network VXLAN
[INFO] This project has been banned from the build due to previous failures.
[INFO] ------------------------------------------------------------------------
[INFO]                                                                         
[INFO] ------------------------------------------------------------------------
[INFO] Skipping Apache CloudStack Plugin - GloboDNS
[INFO] This project has been banned from the build due to previous failures.
[INFO] ------------------------------------------------------------------------
[INFO]                                                                         
[INFO] ------------------------------------------------------------------------
[INFO] Skipping Apache CloudStack Engine Storage Component
[INFO] This project has been banned from the build due to previous failures.
[INFO] ------------------------------------------------------------------------
[INFO]                                                                         
[INFO] ------------------------------------------------------------------------
[INFO] Skipping Apache CloudStack System VM
[INFO] This project has been banned from the build due to previous failures.
[INFO] ------------------------------------------------------------------------

Results :

Tests run: 0, Failures: 0, Errors: 0, Skipped: 0

Running org.apache.cloudstack.implicitplanner.ImplicitPlannerTest
[INFO] 
[INFO] --- maven-resources-plugin:2.5:testResources (default-testResources) @ cloud-mom-rabbitmq
---
[debug] execute contextualize
[INFO] Using 'UTF-8' encoding to copy filtered resources.
[INFO] skip non existing resourceDirectory <http://jenkins.buildacloud.org/job/build-4.5/ws/plugins/event-bus/rabbitmq/test/resources>
[INFO] Copying 3 resources
[INFO] 
[INFO] --- maven-compiler-plugin:2.5.1:testCompile (default-testCompile) @ cloud-mom-rabbitmq
---
[INFO] No sources to compile
[INFO] 
[INFO] --- maven-surefire-plugin:2.12:test (default-test) @ cloud-mom-rabbitmq ---
[INFO] Surefire report directory: <http://jenkins.buildacloud.org/job/build-4.5/ws/plugins/event-bus/rabbitmq/target/surefire-reports>

-------------------------------------------------------
 T E S T S
-------------------------------------------------------
[INFO] 
[INFO] --- maven-resources-plugin:2.5:testResources (default-testResources) @ cloud-mom-inmemory
---
[debug] execute contextualize
[INFO] Using 'UTF-8' encoding to copy filtered resources.
[INFO] skip non existing resourceDirectory <http://jenkins.buildacloud.org/job/build-4.5/ws/plugins/event-bus/inmemory/test/resources>
[INFO] Copying 3 resources
[INFO] 
[INFO] --- maven-compiler-plugin:2.5.1:testCompile (default-testCompile) @ cloud-mom-inmemory
---
[INFO] Compiling 1 source file to <http://jenkins.buildacloud.org/job/build-4.5/ws/plugins/event-bus/inmemory/target/test-classes>
log4j:WARN No appenders could be found for logger (org.springframework.test.context.junit4.SpringJUnit4ClassRunner).
log4j:WARN Please initialize the log4j system properly.
log4j:WARN See http://logging.apache.org/log4j/1.2/faq.html#noconfig for more info.
[INFO] 
[INFO] --- maven-surefire-plugin:2.12:test (default-test) @ cloud-plugin-dedicated-resources
---
[INFO] Surefire report directory: <http://jenkins.buildacloud.org/job/build-4.5/ws/plugins/dedicated-resources/target/surefire-reports>

-------------------------------------------------------
 T E S T S
-------------------------------------------------------

Results :

Tests run: 0, Failures: 0, Errors: 0, Skipped: 0

[INFO] 
[INFO] --- maven-resources-plugin:2.5:testResources (default-testResources) @ cloud-plugin-network-ovs
---
[debug] execute contextualize
[INFO] Using 'UTF-8' encoding to copy filtered resources.
[INFO] skip non existing resourceDirectory <http://jenkins.buildacloud.org/job/build-4.5/ws/plugins/network-elements/ovs/test/resources>
[INFO] Copying 3 resources
[INFO] 
[INFO] --- maven-compiler-plugin:2.5.1:testCompile (default-testCompile) @ cloud-plugin-network-ovs
---
[INFO] No sources to compile
[INFO] 
[INFO] --- maven-surefire-plugin:2.12:test (default-test) @ cloud-plugin-network-ovs ---
[INFO] Surefire report directory: <http://jenkins.buildacloud.org/job/build-4.5/ws/plugins/network-elements/ovs/target/surefire-reports>

-------------------------------------------------------
 T E S T S
-------------------------------------------------------
Running org.apache.cloudstack.dedicated.manager.DedicatedApiUnitTest

Results :

Tests run: 0, Failures: 0, Errors: 0, Skipped: 0

log4j:WARN No appenders could be found for logger (org.springframework.test.context.junit4.SpringJUnit4ClassRunner).
log4j:WARN Please initialize the log4j system properly.
log4j:WARN See http://logging.apache.org/log4j/1.2/faq.html#noconfig for more info.
[INFO] 
[INFO] --- maven-surefire-plugin:2.12:test (default-test) @ cloud-mom-inmemory ---
[INFO] Surefire report directory: <http://jenkins.buildacloud.org/job/build-4.5/ws/plugins/event-bus/inmemory/target/surefire-reports>

-------------------------------------------------------
 T E S T S
-------------------------------------------------------
[INFO] ------------------------------------------------------------------------
[INFO] Reactor Summary:
[INFO] 
[INFO] Apache CloudStack Developer Tools - Checkstyle Configuration  SUCCESS [0.808s]
[INFO] Apache CloudStack ................................. SUCCESS [0.651s]
[INFO] Apache CloudStack Maven Conventions Parent ........ SUCCESS [1.694s]
[INFO] Apache CloudStack Framework - Managed Context ..... SUCCESS [3.612s]
[INFO] Apache CloudStack Utils ........................... SUCCESS [19.568s]
[INFO] Apache CloudStack Framework ....................... SUCCESS [0.177s]
[INFO] Apache CloudStack Framework - Event Notification .. SUCCESS [9.886s]
[INFO] Apache CloudStack Framework - Configuration ....... SUCCESS [4.443s]
[INFO] Apache CloudStack API ............................. SUCCESS [13.137s]
[INFO] Apache CloudStack Framework - REST ................ SUCCESS [5.301s]
[INFO] Apache CloudStack Framework - IPC ................. SUCCESS [4.100s]
[INFO] Apache CloudStack Cloud Engine .................... SUCCESS [0.154s]
[INFO] Apache CloudStack Cloud Engine API ................ SUCCESS [4.365s]
[INFO] Apache CloudStack Framework - Security ............ SUCCESS [2.465s]
[INFO] Apache CloudStack Core ............................ SUCCESS [10.559s]
[INFO] Apache CloudStack Agents .......................... SUCCESS [5.425s]
[INFO] Apache CloudStack Framework - Clustering .......... SUCCESS [3.354s]
[INFO] Apache CloudStack Framework - Event Notification .. SUCCESS [3.407s]
[INFO] Apache CloudStack Cloud Engine Schema Component ... SUCCESS [14.162s]
[INFO] Apache CloudStack Framework - Jobs ................ SUCCESS [5.127s]
[INFO] Apache CloudStack Cloud Engine Internal Components API  SUCCESS [2.715s]
[INFO] Apache CloudStack Server .......................... SUCCESS [38.540s]
[INFO] Apache CloudStack Usage Server .................... SUCCESS [8.511s]
[INFO] Apache CloudStack Cloud Engine Orchestration Component  SUCCESS [10.336s]
[INFO] Apache CloudStack Cloud Services .................. SUCCESS [0.176s]
[INFO] Apache CloudStack Secondary Storage ............... SUCCESS [3.085s]
[INFO] Apache CloudStack Secondary Storage Service ....... SUCCESS [12.547s]
[INFO] Apache CloudStack Engine Storage Component ........ SKIPPED
[INFO] Apache CloudStack Engine Storage Volume Component . SKIPPED
[INFO] Apache CloudStack Engine Storage Image Component .. SKIPPED
[INFO] Apache CloudStack Engine Storage Data Motion Component  SKIPPED
[INFO] Apache CloudStack Engine Storage Cache Component .. SKIPPED
[INFO] Apache CloudStack Engine Storage Snapshot Component  SKIPPED
[INFO] Apache CloudStack Cloud Engine API ................ SUCCESS [2.845s]
[INFO] Apache CloudStack Cloud Engine Service ............ SKIPPED
[INFO] Apache CloudStack Plugin POM ...................... SUCCESS [0.353s]
[INFO] Apache CloudStack Plugin - API Rate Limit ......... FAILURE [21.113s]
[INFO] Apache CloudStack Plugin - Storage Volume default provider  SKIPPED
[INFO] Apache CloudStack Plugin - Storage Volume SolidFire Provider  SKIPPED
[INFO] Apache CloudStack Plugin - API SolidFire .......... SKIPPED
[INFO] Apache CloudStack Plugin - API Discovery .......... SUCCESS [14.556s]
[INFO] Apache CloudStack Plugin - ACL Static Role Based .. SUCCESS [8.672s]
[INFO] Apache CloudStack Plugin - Host Anti-Affinity Processor  SUCCESS [8.346s]
[INFO] Apache CloudStack Plugin - Explicit Dedication Processor  SUCCESS [9.040s]
[INFO] Apache CloudStack Plugin - User Concentrated Pod Deployment Planner  SUCCESS [8.304s]
[INFO] Apache CloudStack Plugin - User Dispersing Deployment Planner  SUCCESS [8.168s]
[INFO] Apache CloudStack Plugin - Implicit Dedication Planner  SKIPPED
[INFO] Apache CloudStack Plugin - Skip Heurestics Planner  SUCCESS [7.358s]
[INFO] Apache CloudStack Plugin - Host Allocator Random .. SUCCESS [7.649s]
[INFO] Apache CloudStack Plugin - Dedicated Resources .... SKIPPED
[INFO] Apache CloudStack Plugin - Hypervisor OracleVM .... SUCCESS [9.684s]
[INFO] Apache CloudStack Plugin - Open vSwitch ........... SUCCESS [9.727s]
[INFO] Apache CloudStack Plugin - Hypervisor XenServer ... SKIPPED
[INFO] Apache CloudStack Plugin - Hypervisor KVM ......... SKIPPED
[INFO] Apache CloudStack Plugin - RabbitMQ Event Bus ..... SUCCESS [7.446s]
[INFO] Apache CloudStack Plugin - In Memory Event Bus .... SKIPPED
[INFO] Apache CloudStack Plugin - Hypervisor Baremetal ... SKIPPED
[INFO] Apache CloudStack Plugin - Hypervisor UCS ......... SKIPPED
[INFO] Apache CloudStack Plugin - Hypervisor Hyper-V ..... SKIPPED
[INFO] Apache CloudStack Plugin - Network Elastic Load Balancer  SKIPPED
[INFO] Apache CloudStack Plugin - Network Internal Load Balancer  SKIPPED
[INFO] Apache CloudStack Framework - Spring Life Cycle ... SUCCESS [2.990s]
[INFO] Apache CloudStack Plugin - Network Juniper Contrail  SKIPPED
[INFO] Apache CloudStack Plugin - Palo Alto .............. SKIPPED
[INFO] Apache CloudStack Plugin - Network Netscaler ...... SKIPPED
[INFO] Apache CloudStack Plugin - Network Nicira NVP ..... SKIPPED
[INFO] Apache CloudStack Plugin - BigSwitch Virtual Network Segment  SKIPPED
[INFO] Apache CloudStack Plugin - Network Brocade VCS .... SKIPPED
[INFO] Apache CloudStack Plugin - Midokura Midonet ....... SKIPPED
[INFO] Apache CloudStack Plugin - Stratosphere SSP ....... SKIPPED
[INFO] Apache CloudStack Plugin - Network Opendaylight ... SKIPPED
[INFO] Apache CloudStack Plugin - Storage Allocator Random  SKIPPED
[INFO] Apache CloudStack Plugin - User Authenticator LDAP  SKIPPED
[INFO] Apache CloudStack Plugin - User Authenticator MD5 . SKIPPED
[INFO] Apache CloudStack Plugin - User Authenticator PBKDF2-SHA-256  SKIPPED
[INFO] Apache CloudStack Plugin - User Authenticator Plain Text  SKIPPED
[INFO] Apache CloudStack Plugin - User Authenticator SAML2  SKIPPED
[INFO] Apache CloudStack Plugin - User Authenticator SHA256 Salted  SKIPPED
[INFO] Apache CloudStack Plugin - Dns Notifier Example ... SKIPPED
[INFO] Apache CloudStack Plugin - Storage Image S3 ....... SKIPPED
[INFO] Apache CloudStack Plugin - Storage Image Swift provider  SKIPPED
[INFO] Apache CloudStack Plugin - Storage Image default provider  SKIPPED
[INFO] Apache CloudStack Plugin - Storage Image sample provider  SKIPPED
[INFO] Apache CloudStack Plugin - Storage Volume Nexenta Provider  SKIPPED
[INFO] Apache CloudStack Plugin - Storage Volume CloudByte Provider  SKIPPED
[INFO] Apache CloudStack Plugin - Storage Volume sample provider  SKIPPED
[INFO] Apache CloudStack Plugin - SNMP Alerts ............ SKIPPED
[INFO] Apache CloudStack Plugin - Syslog Alerts .......... SKIPPED
[INFO] Apache CloudStack Plugin - Network VXLAN .......... SKIPPED
[INFO] Apache CloudStack Plugin - GloboDNS ............... SKIPPED
[INFO] Apache CloudStack Framework - Spring Module ....... SUCCESS [9.712s]
[INFO] Apache CloudStack Secondary Storage Controller .... SUCCESS [9.367s]
[INFO] Apache CloudStack Console Proxy - RDP Client ...... SUCCESS [11.547s]
[INFO] Apache CloudStack Console Proxy ................... SUCCESS [3.152s]
[INFO] Apache CloudStack Console Proxy - Server .......... SUCCESS [5.697s]
[INFO] Apache CloudStack System VM ....................... SKIPPED
[INFO] Apache CloudStack Client UI ....................... SKIPPED
[INFO] Apache CloudStack Framework - QuickCloud .......... SUCCESS [1.236s]
[INFO] Apache CloudStack AWS API Bridge .................. SKIPPED
[INFO] ------------------------------------------------------------------------
[INFO] BUILD FAILURE
[INFO] ------------------------------------------------------------------------
[INFO] Total time: 2:31.787s (Wall Clock)
[INFO] Finished at: Wed Mar 11 13:04:56 CET 2015
[INFO] Final Memory: 59M/386M
[INFO] ------------------------------------------------------------------------
Running org.apache.cloudstack.mom.inmemory.InMemoryEventBusTest
[ERROR] Failed to execute goal org.apache.maven.plugins:maven-surefire-plugin:2.12:test (default-test)
on project cloud-plugin-api-limit-account-based: There are test failures.
[ERROR] 
[ERROR] Please refer to <http://jenkins.buildacloud.org/job/build-4.5/ws/plugins/api/rate-limit/target/surefire-reports>
for the individual test results.
[ERROR] -> [Help 1]
[ERROR] 
[ERROR] To see the full stack trace of the errors, re-run Maven with the -e switch.
[ERROR] Re-run Maven using the -X switch to enable full debug logging.
[ERROR] 
[ERROR] For more information about the errors and possible solutions, please read the following
articles:
[ERROR] [Help 1] http://cwiki.apache.org/confluence/display/MAVEN/MojoFailureException
[ERROR] 
[ERROR] After correcting the problems, you can resume the build with the command
[ERROR]   mvn <goals> -rf :cloud-plugin-api-limit-account-based
Build step 'Invoke top-level Maven targets' marked build as failure
Recording test results

Mime
View raw message