cloudstack-dev mailing list archives

Site index · List index
Message view « Date » · « Thread »
Top « Date » · « Thread »
From jenk...@cloudstack.org
Subject Build failed in Jenkins: cloudstack-4.3-maven-build-noredist #530
Date Wed, 04 Feb 2015 09:46:51 GMT
See <http://jenkins.buildacloud.org/job/cloudstack-4.3-maven-build-noredist/530/changes>

Changes:

[Rohit Yadav] CLOUDSTACK-8198: Use random local storage UUID

[Rohit Yadav] Remove the comparison between GuestOSCategoryVO.CATEGORY_NONE and guestOSCategory.getName()
to make OS category of None to be a valid option.

------------------------------------------
[...truncated 1954 lines...]

Results :

Tests run: 0, Failures: 0, Errors: 0, Skipped: 0

[INFO] 
[INFO] --- maven-jar-plugin:2.4:jar (default-jar) @ cloud-engine-schema ---
[INFO] Building jar: <http://jenkins.buildacloud.org/job/cloudstack-4.3-maven-build-noredist/ws/engine/schema/target/cloud-engine-schema-4.3.2.jar>
[INFO] 
[INFO] --- maven-site-plugin:3.1:attach-descriptor (attach-descriptor) @ cloud-engine-schema
---
[INFO] 
[INFO] --- maven-install-plugin:2.3.1:install (default-install) @ cloud-engine-schema ---
[INFO] Installing <http://jenkins.buildacloud.org/job/cloudstack-4.3-maven-build-noredist/ws/engine/schema/target/cloud-engine-schema-4.3.2.jar>
to /home/jenkins/.m2/repository/org/apache/cloudstack/cloud-engine-schema/4.3.2/cloud-engine-schema-4.3.2.jar
[INFO] Installing <http://jenkins.buildacloud.org/job/cloudstack-4.3-maven-build-noredist/ws/engine/schema/pom.xml>
to /home/jenkins/.m2/repository/org/apache/cloudstack/cloud-engine-schema/4.3.2/cloud-engine-schema-4.3.2.pom
[INFO]                                                                         
[INFO] ------------------------------------------------------------------------
[INFO] Building Apache CloudStack Framework - Jobs 4.3.2
[INFO] ------------------------------------------------------------------------
[INFO] 
[INFO] --- maven-clean-plugin:2.5:clean (default-clean) @ cloud-framework-jobs ---
[INFO] Deleting <http://jenkins.buildacloud.org/job/cloudstack-4.3-maven-build-noredist/ws/framework/jobs>
(includes = [target, dist], excludes = [])
[INFO] 
[INFO] --- maven-remote-resources-plugin:1.3:process (default) @ cloud-framework-jobs ---
[INFO] 
[INFO] --- maven-resources-plugin:2.5:resources (default-resources) @ cloud-framework-jobs
---
[debug] execute contextualize
[INFO] Using 'UTF-8' encoding to copy filtered resources.
[INFO] Copying 1 resource
[INFO] Copying 3 resources
[INFO] 
[INFO] --- maven-compiler-plugin:2.5.1:compile (default-compile) @ cloud-framework-jobs ---
[INFO] Compiling 33 source files to <http://jenkins.buildacloud.org/job/cloudstack-4.3-maven-build-noredist/ws/framework/jobs/target/classes>
[INFO] 
[INFO] --- maven-resources-plugin:2.5:testResources (default-testResources) @ cloud-framework-jobs
---
[debug] execute contextualize
[INFO] Using 'UTF-8' encoding to copy filtered resources.
[INFO] Copying 4 resources
[INFO] Copying 3 resources
[INFO] 
[INFO] --- maven-compiler-plugin:2.5.1:testCompile (default-testCompile) @ cloud-framework-jobs
---
[INFO] Compiling 4 source files to <http://jenkins.buildacloud.org/job/cloudstack-4.3-maven-build-noredist/ws/framework/jobs/target/test-classes>
[INFO] 
[INFO] --- maven-surefire-plugin:2.12:test (default-test) @ cloud-framework-jobs ---
[INFO] Surefire report directory: <http://jenkins.buildacloud.org/job/cloudstack-4.3-maven-build-noredist/ws/framework/jobs/target/surefire-reports>

-------------------------------------------------------
 T E S T S
-------------------------------------------------------

Results :

Tests run: 0, Failures: 0, Errors: 0, Skipped: 0

[INFO] 
[INFO] --- maven-jar-plugin:2.4:jar (default-jar) @ cloud-framework-jobs ---
[INFO] Building jar: <http://jenkins.buildacloud.org/job/cloudstack-4.3-maven-build-noredist/ws/framework/jobs/target/cloud-framework-jobs-4.3.2.jar>
[INFO] 
[INFO] --- maven-site-plugin:3.1:attach-descriptor (attach-descriptor) @ cloud-framework-jobs
---
[INFO] 
[INFO] --- maven-install-plugin:2.3.1:install (default-install) @ cloud-framework-jobs ---
[INFO] Installing <http://jenkins.buildacloud.org/job/cloudstack-4.3-maven-build-noredist/ws/framework/jobs/target/cloud-framework-jobs-4.3.2.jar>
to /home/jenkins/.m2/repository/org/apache/cloudstack/cloud-framework-jobs/4.3.2/cloud-framework-jobs-4.3.2.jar
[INFO] Installing <http://jenkins.buildacloud.org/job/cloudstack-4.3-maven-build-noredist/ws/framework/jobs/pom.xml>
to /home/jenkins/.m2/repository/org/apache/cloudstack/cloud-framework-jobs/4.3.2/cloud-framework-jobs-4.3.2.pom
[INFO]                                                                         
[INFO] ------------------------------------------------------------------------
[INFO] Building Apache CloudStack Cloud Engine Internal Components API 4.3.2
[INFO] ------------------------------------------------------------------------
[INFO] 
[INFO] --- maven-clean-plugin:2.5:clean (default-clean) @ cloud-engine-components-api ---
[INFO] Deleting <http://jenkins.buildacloud.org/job/cloudstack-4.3-maven-build-noredist/ws/engine/components-api>
(includes = [target, dist], excludes = [])
[INFO] 
[INFO] --- maven-remote-resources-plugin:1.3:process (default) @ cloud-engine-components-api
---
[INFO] 
[INFO] --- maven-resources-plugin:2.5:resources (default-resources) @ cloud-engine-components-api
---
[debug] execute contextualize
[INFO] Using 'UTF-8' encoding to copy filtered resources.
[INFO] Copying 1 resource
[INFO] Copying 3 resources
[INFO] 
[INFO] --- maven-compiler-plugin:2.5.1:compile (default-compile) @ cloud-engine-components-api
---
[INFO] Compiling 31 source files to <http://jenkins.buildacloud.org/job/cloudstack-4.3-maven-build-noredist/ws/engine/components-api/target/classes>
[INFO] 
[INFO] --- maven-resources-plugin:2.5:testResources (default-testResources) @ cloud-engine-components-api
---
[debug] execute contextualize
[INFO] Using 'UTF-8' encoding to copy filtered resources.
[INFO] skip non existing resourceDirectory <http://jenkins.buildacloud.org/job/cloudstack-4.3-maven-build-noredist/ws/engine/components-api/test/resources>
[INFO] Copying 3 resources
[INFO] 
[INFO] --- maven-compiler-plugin:2.5.1:testCompile (default-testCompile) @ cloud-engine-components-api
---
[INFO] No sources to compile
[INFO] 
[INFO] --- maven-surefire-plugin:2.12:test (default-test) @ cloud-engine-components-api ---
[INFO] Surefire report directory: <http://jenkins.buildacloud.org/job/cloudstack-4.3-maven-build-noredist/ws/engine/components-api/target/surefire-reports>

-------------------------------------------------------
 T E S T S
-------------------------------------------------------

Results :

Tests run: 0, Failures: 0, Errors: 0, Skipped: 0

[INFO] 
[INFO] --- maven-jar-plugin:2.4:jar (default-jar) @ cloud-engine-components-api ---
[INFO] Building jar: <http://jenkins.buildacloud.org/job/cloudstack-4.3-maven-build-noredist/ws/engine/components-api/target/cloud-engine-components-api-4.3.2.jar>
[INFO] 
[INFO] --- maven-site-plugin:3.1:attach-descriptor (attach-descriptor) @ cloud-engine-components-api
---
[INFO] 
[INFO] --- maven-install-plugin:2.3.1:install (default-install) @ cloud-engine-components-api
---
[INFO] Installing <http://jenkins.buildacloud.org/job/cloudstack-4.3-maven-build-noredist/ws/engine/components-api/target/cloud-engine-components-api-4.3.2.jar>
to /home/jenkins/.m2/repository/org/apache/cloudstack/cloud-engine-components-api/4.3.2/cloud-engine-components-api-4.3.2.jar
[INFO] Installing <http://jenkins.buildacloud.org/job/cloudstack-4.3-maven-build-noredist/ws/engine/components-api/pom.xml>
to /home/jenkins/.m2/repository/org/apache/cloudstack/cloud-engine-components-api/4.3.2/cloud-engine-components-api-4.3.2.pom
[INFO]                                                                         
[INFO] ------------------------------------------------------------------------
[INFO] Building Apache CloudStack Server 4.3.2
[INFO] ------------------------------------------------------------------------
[INFO] 
[INFO] --- maven-clean-plugin:2.5:clean (default-clean) @ cloud-server ---
[INFO] Deleting <http://jenkins.buildacloud.org/job/cloudstack-4.3-maven-build-noredist/ws/server>
(includes = [target, dist], excludes = [])
[INFO] 
[INFO] --- maven-remote-resources-plugin:1.3:process (default) @ cloud-server ---
[INFO] 
[INFO] --- maven-antrun-plugin:1.7:run (generate-resource) @ cloud-server ---
[INFO] Executing tasks

main:
     [copy] Copying 3 files to <http://jenkins.buildacloud.org/job/cloudstack-4.3-maven-build-noredist/ws/server/target/conf>
     [copy] Copying 1 file to <http://jenkins.buildacloud.org/job/cloudstack-4.3-maven-build-noredist/ws/server/target/conf>
[INFO] Executed tasks
[INFO] 
[INFO] --- maven-resources-plugin:2.5:resources (default-resources) @ cloud-server ---
[debug] execute contextualize
[INFO] Using 'UTF-8' encoding to copy filtered resources.
[INFO] Copying 30 resources
[INFO] Copying 3 resources
[INFO] 
[INFO] --- maven-compiler-plugin:2.5.1:compile (default-compile) @ cloud-server ---
[INFO] Compiling 358 source files to <http://jenkins.buildacloud.org/job/cloudstack-4.3-maven-build-noredist/ws/server/target/classes>
[INFO] ------------------------------------------------------------------------
[INFO] Reactor Summary:
[INFO] 
[INFO] Apache CloudStack ................................. SUCCESS [9.774s]
[INFO] Apache CloudStack Maven Conventions Parent ........ SUCCESS [0.116s]
[INFO] Apache CloudStack Framework - Managed Context ..... SUCCESS [9.168s]
[INFO] Apache CloudStack Utils ........................... SUCCESS [25.708s]
[INFO] Apache CloudStack Framework ....................... SUCCESS [0.078s]
[INFO] Apache CloudStack Framework - Event Notification .. SUCCESS [14.628s]
[INFO] Apache CloudStack Framework - Configuration ....... SUCCESS [9.554s]
[INFO] Apache CloudStack API ............................. SUCCESS [38.144s]
[INFO] Apache CloudStack Framework - REST ................ SUCCESS [6.642s]
[INFO] Apache CloudStack Framework - IPC ................. SUCCESS [14.263s]
[INFO] Apache CloudStack Cloud Engine .................... SUCCESS [0.094s]
[INFO] Apache CloudStack Cloud Engine API ................ SUCCESS [10.900s]
[INFO] Apache CloudStack Core ............................ SUCCESS [23.887s]
[INFO] Apache CloudStack Agents .......................... SUCCESS [20.126s]
[INFO] Apache CloudStack Framework - Clustering .......... SUCCESS [7.385s]
[INFO] Apache CloudStack Framework - Event Notification .. SUCCESS [3.848s]
[INFO] Apache CloudStack Cloud Engine Schema Component ... SUCCESS [33.293s]
[INFO] Apache CloudStack Framework - Jobs ................ SUCCESS [12.677s]
[INFO] Apache CloudStack Cloud Engine Internal Components API  SUCCESS [8.660s]
[INFO] Apache CloudStack Server .......................... FAILURE [20.684s]
[INFO] Apache CloudStack Usage Server .................... SKIPPED
[INFO] Apache XenSource XAPI ............................. SKIPPED
[INFO] Apache CloudStack Cloud Engine Orchestration Component  SKIPPED
[INFO] Apache CloudStack Cloud Services .................. SKIPPED
[INFO] Apache CloudStack Secondary Storage Service ....... SKIPPED
[INFO] Apache CloudStack Engine Storage Component ........ SKIPPED
[INFO] Apache CloudStack Engine Storage Volume Component . SKIPPED
[INFO] Apache CloudStack Engine Storage Image Component .. SKIPPED
[INFO] Apache CloudStack Engine Storage Data Motion Component  SKIPPED
[INFO] Apache CloudStack Engine Storage Cache Component .. SKIPPED
[INFO] Apache CloudStack Engine Storage Snapshot Component  SKIPPED
[INFO] Apache CloudStack Cloud Engine API ................ SKIPPED
[INFO] Apache CloudStack Cloud Engine Service ............ SKIPPED
[INFO] Apache CloudStack Plugin POM ...................... SKIPPED
[INFO] Apache CloudStack Plugin - API Rate Limit ......... SKIPPED
[INFO] Apache CloudStack Plugin - API Discovery .......... SKIPPED
[INFO] Apache CloudStack Plugin - ACL Static Role Based .. SKIPPED
[INFO] Apache CloudStack Plugin - Host Anti-Affinity Processor  SKIPPED
[INFO] Apache CloudStack Plugin - Explicit Dedication Processor  SKIPPED
[INFO] Apache CloudStack Plugin - User Concentrated Pod Deployment Planner  SKIPPED
[INFO] Apache CloudStack Plugin - User Dispersing Deployment Planner  SKIPPED
[INFO] Apache CloudStack Plugin - Implicit Dedication Planner  SKIPPED
[INFO] Apache CloudStack Plugin - Skip Heurestics Planner  SKIPPED
[INFO] Apache CloudStack Plugin - Host Allocator Random .. SKIPPED
[INFO] Apache CloudStack Plugin - Dedicated Resources .... SKIPPED
[INFO] Apache CloudStack Plugin - Hypervisor OracleVM .... SKIPPED
[INFO] Apache CloudStack Plugin - Open vSwitch ........... SKIPPED
[INFO] Apache CloudStack Plugin - Hypervisor Xen ......... SKIPPED
[INFO] Apache CloudStack Plugin - Hypervisor KVM ......... SKIPPED
[INFO] Apache CloudStack Plugin - RabbitMQ Event Bus ..... SKIPPED
[INFO] Apache CloudStack Plugin - Hypervisor Baremetal ... SKIPPED
[INFO] Apache CloudStack Plugin - Hypervisor UCS ......... SKIPPED
[INFO] Apache CloudStack Plugin - Hypervisor Hyper-V ..... SKIPPED
[INFO] Apache CloudStack Plugin - Network Elastic Load Balancer  SKIPPED
[INFO] Apache CloudStack Plugin - Network Internal Load Balancer  SKIPPED
[INFO] Apache CloudStack Plugin - Network Juniper Contrail  SKIPPED
[INFO] Apache CloudStack Plugin - Palo Alto .............. SKIPPED
[INFO] Apache CloudStack Checkstyle Configuration ........ SKIPPED
[INFO] Apache CloudStack Plugin - Network Nicira NVP ..... SKIPPED
[INFO] Apache CloudStack Plugin - BigSwitch Virtual Network Segment  SKIPPED
[INFO] Apache CloudStack Plugin - Midokura Midonet ....... SKIPPED
[INFO] Apache Cloudstack Plugin - Stratosphere SSP ....... SKIPPED
[INFO] Apache CloudStack Plugin - Storage Allocator Random  SKIPPED
[INFO] Apache CloudStack Plugin - User Authenticator LDAP  SKIPPED
[INFO] Apache CloudStack Plugin - User Authenticator MD5 . SKIPPED
[INFO] Apache CloudStack Plugin - User Authenticator Plain Text  SKIPPED
[INFO] Apache CloudStack Plugin - User Authenticator SHA256 Salted  SKIPPED
[INFO] Apache CloudStack Plugin - Dns Notifier Example ... SKIPPED
[INFO] Apache CloudStack Plugin - Storage Image S3 ....... SKIPPED
[INFO] Apache CloudStack Plugin - Storage Image Swift provider  SKIPPED
[INFO] Apache CloudStack Plugin - Storage Image default provider  SKIPPED
[INFO] Apache CloudStack Plugin - Storage Image sample provider  SKIPPED
[INFO] Apache CloudStack Plugin - Storage Volume SolidFire Provider  SKIPPED
[INFO] Apache CloudStack Plugin - Storage Volume default provider  SKIPPED
[INFO] Apache CloudStack Plugin - Storage Volume sample provider  SKIPPED
[INFO] Apache CloudStack Plugin - SNMP Alerts ............ SKIPPED
[INFO] Apache CloudStack Plugin - Syslog Alerts .......... SKIPPED
[INFO] Apache CloudStack Plugin - Network VXLAN .......... SKIPPED
[INFO] Apache CloudStack Plugin - Hypervisor Simulator ... SKIPPED
[INFO] Apache CloudStack Framework - Spring Life Cycle ... SKIPPED
[INFO] cloud-framework-spring-module ..................... SKIPPED
[INFO] Apache CloudStack Test ............................ SKIPPED
[INFO] Apache CloudStack Console Proxy - RDP Client ...... SKIPPED
[INFO] Apache CloudStack Console Proxy ................... SKIPPED
[INFO] Apache CloudStack Console Proxy - Server .......... SKIPPED
[INFO] Apache CloudStack System VM ....................... SKIPPED
[INFO] Apache CloudStack Client UI ....................... SKIPPED
[INFO] Apache CloudStack Framework - QuickCloud .......... SKIPPED
[INFO] ------------------------------------------------------------------------
[INFO] BUILD FAILURE
[INFO] ------------------------------------------------------------------------
[INFO] Total time: 4:35.669s
[INFO] Finished at: Wed Feb 04 09:48:33 UTC 2015
[INFO] Final Memory: 42M/284M
[INFO] ------------------------------------------------------------------------
[ERROR] Failed to execute goal org.apache.maven.plugins:maven-compiler-plugin:2.5.1:compile
(default-compile) on project cloud-server: Fatal error compiling: Unknown error trying to
execute the external compiler:
[ERROR] /bin/sh -c cd <http://jenkins.buildacloud.org/job/cloudstack-4.3-maven-build-noredist/ws/server>
&& /usr/lib/jvm/java-1.7.0-openjdk-1.7.0.75-2.5.4.2.el7_0.x86_64/jre/../bin/javac
@/tmp/org.codehaus.plexus.compiler.javac.JavacCompiler5894625583551515359arguments -J-Xmx512m
-J-Xms128m
[ERROR] -> [Help 1]
[ERROR] 
[ERROR] To see the full stack trace of the errors, re-run Maven with the -e switch.
[ERROR] Re-run Maven using the -X switch to enable full debug logging.
[ERROR] 
[ERROR] For more information about the errors and possible solutions, please read the following
articles:
[ERROR] [Help 1] http://cwiki.apache.org/confluence/display/MAVEN/MojoExecutionException
[ERROR] 
[ERROR] After correcting the problems, you can resume the build with the command
[ERROR]   mvn <goals> -rf :cloud-server
Build step 'Invoke top-level Maven targets' marked build as failure
[FINDBUGS] Skipping publisher since build result is FAILURE
Archiving artifacts

Mime
View raw message