cloudstack-dev mailing list archives

Site index · List index
Message view « Date » · « Thread »
Top « Date » · « Thread »
From jenk...@cloudstack.org
Subject Build failed in Jenkins: build-master-simulator #1674
Date Tue, 17 Feb 2015 15:22:49 GMT
See <http://jenkins.buildacloud.org/job/build-master-simulator/1674/>

------------------------------------------
[...truncated 1513 lines...]
[INFO]                                                                         
[INFO] ------------------------------------------------------------------------
[INFO] Building Apache CloudStack Engine Storage Image Component 4.6.0-SNAPSHOT
[INFO] ------------------------------------------------------------------------
[INFO] 
[INFO] --- maven-clean-plugin:2.5:clean (default-clean) @ cloud-engine-storage-image ---
[INFO] Deleting <http://jenkins.buildacloud.org/job/build-master-simulator/ws/engine/storage/image/target>
(includes = [**/*], excludes = [])
[INFO] Deleting <http://jenkins.buildacloud.org/job/build-master-simulator/ws/engine/storage/image>
(includes = [target, dist], excludes = [])
[INFO] 
[INFO] --- maven-checkstyle-plugin:2.11:check (cloudstack-checkstyle) @ cloud-engine-storage-image
---
[INFO] Starting audit...
Audit done.

[INFO] 
[INFO] --- maven-remote-resources-plugin:1.3:process (default) @ cloud-engine-storage-image
---
[INFO] 
[INFO] --- maven-resources-plugin:2.5:resources (default-resources) @ cloud-engine-storage-image
---
[debug] execute contextualize
[INFO] Using 'UTF-8' encoding to copy filtered resources.
[INFO] Copying 1 resource
[INFO] Copying 3 resources
[INFO] 
[INFO] --- maven-compiler-plugin:3.2:compile (default-compile) @ cloud-engine-storage-image
---
[INFO] Changes detected - recompiling the module!
[INFO] Compiling 6 source files to <http://jenkins.buildacloud.org/job/build-master-simulator/ws/engine/storage/image/target/classes>
[INFO] 
[INFO] --- maven-resources-plugin:2.5:testResources (default-testResources) @ cloud-engine-storage-image
---
[debug] execute contextualize
[INFO] Using 'UTF-8' encoding to copy filtered resources.
[INFO] skip non existing resourceDirectory <http://jenkins.buildacloud.org/job/build-master-simulator/ws/engine/storage/image/test/resources>
[INFO] Copying 3 resources
[INFO] 
[INFO] --- maven-compiler-plugin:3.2:testCompile (default-testCompile) @ cloud-engine-storage-image
---
[INFO] No sources to compile
[INFO] 
[INFO] --- maven-surefire-plugin:2.18.1:test (default-test) @ cloud-engine-storage-image ---
[INFO]                                                                         
[INFO] ------------------------------------------------------------------------
[INFO] Building Apache CloudStack Engine Storage Snapshot Component 4.6.0-SNAPSHOT
[INFO] ------------------------------------------------------------------------
[INFO] 
[INFO] --- maven-clean-plugin:2.5:clean (default-clean) @ cloud-engine-storage-snapshot ---
[INFO] Deleting <http://jenkins.buildacloud.org/job/build-master-simulator/ws/engine/storage/snapshot/target>
(includes = [**/*], excludes = [])
[INFO] Deleting <http://jenkins.buildacloud.org/job/build-master-simulator/ws/engine/storage/snapshot>
(includes = [target, dist], excludes = [])
[INFO] 
[INFO] --- maven-checkstyle-plugin:2.11:check (cloudstack-checkstyle) @ cloud-engine-storage-snapshot
---
[INFO] Starting audit...
Audit done.

[INFO] 
[INFO] --- maven-remote-resources-plugin:1.3:process (default) @ cloud-engine-storage-snapshot
---
[INFO] 
[INFO] --- maven-resources-plugin:2.5:resources (default-resources) @ cloud-engine-storage-snapshot
---
[debug] execute contextualize
[INFO] Using 'UTF-8' encoding to copy filtered resources.
[INFO] Copying 2 resources
[INFO] Copying 3 resources
[INFO] 
[INFO] --- maven-compiler-plugin:3.2:compile (default-compile) @ cloud-engine-storage-snapshot
---
[INFO] Changes detected - recompiling the module!
[INFO] Compiling 9 source files to <http://jenkins.buildacloud.org/job/build-master-simulator/ws/engine/storage/snapshot/target/classes>
[INFO] 
[INFO] --- maven-resources-plugin:2.5:testResources (default-testResources) @ cloud-engine-storage-snapshot
---
[debug] execute contextualize
[INFO] Using 'UTF-8' encoding to copy filtered resources.
[INFO] Copying 2 resources
[INFO] Copying 3 resources
[INFO] 
[INFO] --- maven-compiler-plugin:3.2:testCompile (default-testCompile) @ cloud-engine-storage-snapshot
---
[INFO] Changes detected - recompiling the module!
[INFO] Compiling 2 source files to <http://jenkins.buildacloud.org/job/build-master-simulator/ws/engine/storage/snapshot/target/test-classes>
[INFO] 
[INFO] --- maven-compiler-plugin:3.2:testCompile (default) @ cloud-engine-storage-snapshot
---
[INFO] Changes detected - recompiling the module!
[INFO] Compiling 2 source files to <http://jenkins.buildacloud.org/job/build-master-simulator/ws/engine/storage/snapshot/target/test-classes>
[INFO] 
[INFO] --- maven-surefire-plugin:2.18.1:test (default-test) @ cloud-engine-storage-snapshot
---
[INFO] Surefire report directory: <http://jenkins.buildacloud.org/job/build-master-simulator/ws/engine/storage/snapshot/target/surefire-reports>

-------------------------------------------------------
 T E S T S
-------------------------------------------------------
log4j:WARN No appenders could be found for logger (org.springframework.test.context.junit4.SpringJUnit4ClassRunner).
log4j:WARN Please initialize the log4j system properly.
log4j:WARN See http://logging.apache.org/log4j/1.2/faq.html#noconfig for more info.
Running src.SnapshotDataFactoryTest
Tests run: 1, Failures: 0, Errors: 0, Skipped: 0, Time elapsed: 0.024 sec - in src.SnapshotDataFactoryTest
Running src.VMSnapshotStrategyTest
Tests run: 3, Failures: 0, Errors: 0, Skipped: 0, Time elapsed: 2.179 sec - in src.VMSnapshotStrategyTest

Results :

Tests run: 4, Failures: 0, Errors: 0, Skipped: 0

[INFO]                                                                         
[INFO] ------------------------------------------------------------------------
[INFO] Building Apache CloudStack Plugin POM 4.6.0-SNAPSHOT
[INFO] ------------------------------------------------------------------------
[INFO] 
[INFO] --- maven-clean-plugin:2.5:clean (default-clean) @ cloudstack-plugins ---
[INFO] Deleting <http://jenkins.buildacloud.org/job/build-master-simulator/ws/plugins/target>
(includes = [**/*], excludes = [])
[INFO] Deleting <http://jenkins.buildacloud.org/job/build-master-simulator/ws/plugins>
(includes = [target, dist], excludes = [])
[INFO] 
[INFO] --- maven-remote-resources-plugin:1.3:process (default) @ cloudstack-plugins ---
[INFO]                                                                         
[INFO] ------------------------------------------------------------------------
[INFO] Building Apache CloudStack Plugin - Hypervisor Simulator 4.6.0-SNAPSHOT
[INFO] ------------------------------------------------------------------------
[INFO] 
ha:AAAAYB+LCAAAAAAAAP9b85aBtbiIQSmjNKU4P0+vJLE4u1gvPjexLDVPzxdEGvvmZ+X75ZekLlOVfvTjc8FPJgaGiiIGKaiG5Py84vycVD1nCA1SyAABjCCFBQCV27OjYAAAAA==[0[INFO]
Deleting <http://jenkins.buildacloud.org/job/build-master-simulator/ws/plugins/hypervisors/simulator>
(includes = [target, dist], excludes = [])
[INFO] 
[INFO] --- maven-checkstyle-plugin:2.11:check (cloudstack-checkstyle) @ cloud-plugin-hypervisor-simulator
---
[INFO] Starting audit...
Audit done.

[INFO] 
[INFO] --- maven-remote-resources-plugin:1.3:process (default) @ cloud-plugin-hypervisor-simulator
---
[INFO] 
[INFO] --- maven-resources-plugin:2.5:resources (default-resources) @ cloud-plugin-hypervisor-simulator
---
[debug] execute contextualize
[INFO] Using 'UTF-8' encoding to copy filtered resources.
[INFO] Copying 7 resources
[INFO] Copying 3 resources
[INFO] 
[INFO] --- maven-compiler-plugin:3.2:compile (default-compile) @ cloud-plugin-hypervisor-simulator
---
[INFO] Changes detected - recompiling the module!
[INFO] Compiling 54 source files to <http://jenkins.buildacloud.org/job/build-master-simulator/ws/plugins/hypervisors/simulator/target/classes>
[INFO] 
[INFO] --- maven-resources-plugin:2.5:testResources (default-testResources) @ cloud-plugin-hypervisor-simulator
---
[debug] execute contextualize
[INFO] Using 'UTF-8' encoding to copy filtered resources.
[INFO] skip non existing resourceDirectory <http://jenkins.buildacloud.org/job/build-master-simulator/ws/plugins/hypervisors/simulator/test/resources>
[INFO] Copying 3 resources
[INFO] 
[INFO] --- maven-compiler-plugin:3.2:testCompile (default-testCompile) @ cloud-plugin-hypervisor-simulator
---
[INFO] No sources to compile
[INFO] 
[INFO] --- maven-surefire-plugin:2.18.1:test (default-test) @ cloud-plugin-hypervisor-simulator
---
[INFO] ------------------------------------------------------------------------
[INFO] Reactor Summary:
[INFO] 
[INFO] Apache CloudStack Developer Tools - Checkstyle Configuration  SUCCESS [0.973s]
[INFO] Apache CloudStack ................................. SUCCESS [1.132s]
[INFO] Apache CloudStack Maven Conventions Parent ........ SUCCESS [1.249s]
[INFO] Apache CloudStack Framework - Managed Context ..... SUCCESS [5.279s]
[INFO] Apache CloudStack Utils ........................... SUCCESS [23.676s]
[INFO] Apache CloudStack Framework ....................... SUCCESS [0.081s]
[INFO] Apache CloudStack Framework - Event Notification .. SUCCESS [13.568s]
[INFO] Apache CloudStack Framework - Configuration ....... SUCCESS [6.495s]
[INFO] Apache CloudStack API ............................. SUCCESS [15.651s]
[INFO] Apache CloudStack Framework - REST ................ SUCCESS [4.414s]
[INFO] Apache CloudStack Framework - IPC ................. SUCCESS [6.493s]
[INFO] Apache CloudStack Cloud Engine .................... SUCCESS [0.035s]
[INFO] Apache CloudStack Cloud Engine API ................ SUCCESS [6.347s]
[INFO] Apache CloudStack Framework - Security ............ SUCCESS [4.059s]
[INFO] Apache CloudStack Core ............................ SUCCESS [17.009s]
[INFO] Apache CloudStack Agents .......................... SUCCESS [8.567s]
[INFO] Apache CloudStack Framework - Clustering .......... SUCCESS [6.304s]
[INFO] Apache CloudStack Framework - Event Notification .. SUCCESS [3.341s]
[INFO] A[INFO] Final Memory: 60M/400M
[INFO] ------------------------------------------------------------------------
Recording test results
ERROR: Publisher hudson.tasks.junit.JUnitResultArchiver aborted due to exception
java.lang.RuntimeException: Failed to serialize hudson.tasks.junit.TestResult#suites for class
hudson.tasks.junit.TestResult
	at hudson.util.RobustReflectionConverter$2.writeField(RobustReflectionConverter.java:214)
	at hudson.util.RobustReflectionConverter$2.visit(RobustReflectionConverter.java:182)
	at com.thoughtworks.xstream.converters.reflection.PureJavaReflectionProvider.visitSerializableFields(PureJavaReflectionProvider.java:138)
	at hudson.util.RobustReflectionConverter.doMarshal(RobustReflectionConverter.java:167)
	at hudson.util.RobustReflectionConverter.marshal(RobustReflectionConverter.java:108)
	at com.thoughtworks.xstream.core.AbstractReferenceMarshaller.convert(AbstractReferenceMarshaller.java:69)
	at com.thoughtworks.xstream.core.TreeMarshaller.convertAnother(TreeMarshaller.java:58)
	at com.thoughtworks.xstream.core.TreeMarshaller.convertAnother(TreeMarshaller.java:43)
	at com.thoughtworks.xstream.core.TreeMarshaller.start(TreeMarshaller.java:82)
	at com.thoughtworks.xstream.core.AbstractTreeMarshallingStrategy.marshal(AbstractTreeMarshallingStrategy.java:37)
	at com.thoughtworks.xstream.XStream.marshal(XStream.java:1026)
	at com.thoughtworks.xstream.XStream.marshal(XStream.java:1015)
	at com.thoughtworks.xstream.XStream.toXML(XStream.java:988)
	at hudson.XmlFile.write(XmlFile.java:178)
	at hudson.tasks.junit.TestResultAction.setResult(TestResultAction.java:106)
	at hudson.tasks.junit.TestResultAction.<init>(TestResultAction.java:81)
	at hudson.tasks.junit.JUnitResultArchiver.perform(JUnitResultArchiver.java:146)
	at hudson.tasks.BuildStepCompatibilityLayer.perform(BuildStepCompatibilityLayer.java:74)
	at hudson.tasks.BuildStepMonitor$1.perform(BuildStepMonitor.java:20)
	at hudson.model.AbstractBuild$AbstractBuildExecution.perform(AbstractBuild.java:770)
	at hudson.model.AbstractBuild$AbstractBuildExecution.performAllBuildSteps(AbstractBuild.java:734)
	at hudson.model.Build$BuildExecution.post2(Build.java:183)
	at hudson.model.AbstractBuild$AbstractBuildExecution.post(AbstractBuild.java:683)
	at hudson.model.Run.execute(Run.java:1784)
	at hudson.model.FreeStyleBuild.run(FreeStyleBuild.java:43)
	at hudson.model.ResourceController.execute(ResourceController.java:89)
	at hudson.model.Executor.run(Executor.java:240)
Caused by: java.lang.RuntimeException: Failed to serialize hudson.tasks.junit.SuiteResult#cases
for class hudson.tasks.junit.SuiteResult
	at hudson.util.RobustReflectionConverter$2.writeField(RobustReflectionConverter.java:214)
	at hudson.util.RobustReflectionConverter$2.visit(RobustReflectionConverter.java:182)
	at com.thoughtworks.xstream.converters.reflection.PureJavaReflectionProvider.visitSerializableFields(PureJavaReflectionProvider.java:138)
	at hudson.util.RobustReflectionConverter.doMarshal(RobustReflectionConverter.java:167)
	at hudson.util.RobustReflectionConverter.marshal(RobustReflectionConverter.java:108)
	at com.thoughtworks.xstream.core.AbstractReferenceMarshaller.convert(AbstractReferenceMarshaller.java:69)
	at com.thoughtworks.xstream.core.TreeMarshaller.convertAnother(TreeMarshaller.java:58)
	at com.thoughtworks.xstream.core.TreeMarshaller.convertAnother(TreeMarshaller.java:43)
	at com.thoughtworks.xstream.core.AbstractReferenceMarshaller$1.convertAnother(AbstractReferenceMarshaller.java:88)
	at com.thoughtworks.xstream.converters.collections.AbstractCollectionConverter.writeItem(AbstractCollectionConverter.java:64)
	at com.thoughtworks.xstream.converters.collections.CollectionConverter.marshal(CollectionConverter.java:74)
	at com.thoughtworks.xstream.core.AbstractReferenceMarshaller.convert(AbstractReferenceMarshaller.java:69)
	at com.thoughtworks.xstream.core.TreeMarshaller.convertAnother(TreeMarshaller.java:58)
	at com.thoughtworks.xstream.core.AbstractReferenceMarshaller$1.convertAnother(AbstractReferenceMarshaller.java:84)
	at hudson.util.RobustReflectionConverter.marshallField(RobustReflectionConverter.java:223)
	at hudson.util.RobustReflectionConverter$2.writeField(RobustReflectionConverter.java:210)
	... 26 more
Caused by: java.lang.RuntimeException: Failed to serialize hudson.tasks.junit.CaseResult#duration
for class hudson.tasks.junit.CaseResult
	at hudson.util.RobustReflectionConverter$2.writeField(RobustReflectionConverter.java:214)
	at hudson.util.RobustReflectionConverter$2.visit(RobustReflectionConverter.java:182)
	at com.thoughtworks.xstream.converters.reflection.PureJavaReflectionProvider.visitSerializableFields(PureJavaReflectionProvider.java:138)
	at hudson.util.RobustReflectionConverter.doMarshal(RobustReflectionConverter.java:167)
	at hudson.util.RobustReflectionConverter.marshal(RobustReflectionConverter.java:108)
	at com.thoughtworks.xstream.core.AbstractReferenceMarshaller.convert(AbstractReferenceMarshaller.java:69)
	at com.thoughtworks.xstream.core.TreeMarshaller.convertAnother(TreeMarshaller.java:58)
	at com.thoughtworks.xstream.core.TreeMarshaller.convertAnother(TreeMarshaller.java:43)
	at com.thoughtworks.xstream.core.AbstractReferenceMarshaller$1.convertAnother(AbstractReferenceMarshaller.java:88)
	at com.thoughtworks.xstream.converters.collections.AbstractCollectionConverter.writeItem(AbstractCollectionConverter.java:64)
	at com.thoughtworks.xstream.converters.collections.CollectionConverter.marshal(CollectionConverter.java:74)
	at com.thoughtworks.xstream.core.AbstractReferenceMarshaller.convert(AbstractReferenceMarshaller.java:69)
	at com.thoughtworks.xstream.core.TreeMarshaller.convertAnother(TreeMarshaller.java:58)
	at com.thoughtworks.xstream.core.AbstractReferenceMarshaller$1.convertAnother(AbstractReferenceMarshaller.java:84)
	at hudson.util.RobustReflectionConverter.marshallField(RobustReflectionConverter.java:223)
	at hudson.util.RobustReflectionConverter$2.writeField(RobustReflectionConverter.java:210)
	... 41 more
Caused by: com.thoughtworks.xstream.io.StreamException:  : No space left on device
	at com.thoughtworks.xstream.core.util.QuickWriter.flush(QuickWriter.java:77)
	at com.thoughtworks.xstream.core.util.QuickWriter.write(QuickWriter.java:37)
	at com.thoughtworks.xstream.io.xml.PrettyPrintWriter.startNode(PrettyPrintWriter.java:197)
	at com.thoughtworks.xstream.io.xml.PrettyPrintWriter.startNode(PrettyPrintWriter.java:206)
	at com.thoughtworks.xstream.io.WriterWrapper.startNode(WriterWrapper.java:33)
	at com.thoughtworks.xstream.io.path.PathTrackingWriter.startNode(PathTrackingWriter.java:44)
	at com.thoughtworks.xstream.io.ExtendedHierarchicalStreamWriterHelper.startNode(ExtendedHierarchicalStreamWriterHelper.java:17)
	at hudson.util.RobustReflectionConverter$2.writeField(RobustReflectionConverter.java:193)
	... 56 more
Caused by: java.io.IOException: No space left on device
	at java.io.FileOutputStream.writeBytes(Native Method)
	at java.io.FileOutputStream.write(FileOutputStream.java:318)
	at sun.nio.cs.StreamEncoder.writeBytes(StreamEncoder.java:221)
	at sun.nio.cs.StreamEncoder.implFlushBuffer(StreamEncoder.java:291)
	at sun.nio.cs.StreamEncoder.implFlush(StreamEncoder.java:295)
	at sun.nio.cs.StreamEncoder.flush(StreamEncoder.java:141)
	at java.io.OutputStreamWriter.flush(OutputStreamWriter.java:229)
	at java.io.BufferedWriter.flush(BufferedWriter.java:254)
	at hudson.util.AtomicFileWriter.flush(AtomicFileWriter.java:90)
	at com.thoughtworks.xstream.core.util.QuickWriter.flush(QuickWriter.java:75)
	... 63 more

Mime
View raw message