cloudstack-dev mailing list archives

Site index · List index
Message view « Date » · « Thread »
Top « Date » · « Thread »
From jenk...@cloudstack.org
Subject Build failed in Jenkins: build-4.5 #315
Date Mon, 02 Feb 2015 11:25:08 GMT
See <http://jenkins.buildacloud.org/job/build-4.5/315/>

------------------------------------------
[...truncated 818 lines...]

[INFO] 
[INFO] --- maven-remote-resources-plugin:1.3:process (default) @ cloud-framework-db ---
[INFO] 
[INFO] --- maven-resources-plugin:2.5:resources (default-resources) @ cloud-framework-db ---
[debug] execute contextualize
[INFO] Using 'UTF-8' encoding to copy filtered resources.
[INFO] Copying 1 resource
[INFO] Copying 3 resources
[INFO] 
[INFO] --- maven-compiler-plugin:2.5.1:compile (default-compile) @ cloud-framework-db ---
[INFO] Compiling 43 source files to <http://jenkins.buildacloud.org/job/build-4.5/ws/framework/db/target/classes>
[INFO] Starting audit...
Audit done.

[INFO] 
[INFO] --- maven-remote-resources-plugin:1.3:process (default) @ cloudstack-service-console-proxy-rdpclient
---
[INFO] 
[INFO] --- maven-resources-plugin:2.5:testResources (default-testResources) @ cloud-framework-events
---
[debug] execute contextualize
[INFO] Using 'UTF-8' encoding to copy filtered resources.
[INFO] skip non existing resourceDirectory <http://jenkins.buildacloud.org/job/build-4.5/ws/framework/events/test/resources>
[INFO] Copying 3 resources
[INFO] 
[INFO] --- maven-compiler-plugin:2.5.1:testCompile (default-testCompile) @ cloud-framework-events
---
[INFO] No sources to compile
[INFO] 
[INFO] --- maven-surefire-plugin:2.12:test (default-test) @ cloud-framework-events ---
[INFO] Surefire report directory: <http://jenkins.buildacloud.org/job/build-4.5/ws/framework/events/target/surefire-reports>

-------------------------------------------------------
 T E S T S
-------------------------------------------------------
[INFO] 
[INFO] --- maven-resources-plugin:2.5:resources (default-resources) @ cloudstack-service-console-proxy-rdpclient
---
[debug] execute contextualize
[INFO] Using 'UTF-8' encoding to copy filtered resources.
[INFO] Copying 1 resource
[INFO] Copying 3 resources
[INFO] 
[INFO] --- maven-compiler-plugin:2.5.1:compile (default-compile) @ cloudstack-service-console-proxy-rdpclient
---
[INFO] Compiling 146 source files to <http://jenkins.buildacloud.org/job/build-4.5/ws/services/console-proxy-rdp/rdpconsole/target/classes>

Results :

Tests run: 0, Failures: 0, Errors: 0, Skipped: 0

[INFO] 
[INFO] --- maven-resources-plugin:2.5:testResources (default-testResources) @ cloud-framework-spring-module
---
[debug] execute contextualize
[INFO] Using 'UTF-8' encoding to copy filtered resources.
[INFO] Copying 32 resources
[INFO] Copying 3 resources
[INFO] 
[INFO] --- maven-compiler-plugin:2.5.1:testCompile (default-testCompile) @ cloud-framework-spring-module
---
[INFO] Compiling 4 source files to <http://jenkins.buildacloud.org/job/build-4.5/ws/framework/spring/module/target/test-classes>
[INFO] 
[INFO] --- maven-surefire-plugin:2.12:test (default-test) @ cloud-framework-spring-module
---
[INFO] Surefire report directory: <http://jenkins.buildacloud.org/job/build-4.5/ws/framework/spring/module/target/surefire-reports>

-------------------------------------------------------
 T E S T S
-------------------------------------------------------
[INFO] 
[INFO] --- maven-resources-plugin:2.5:testResources (default-testResources) @ cloud-framework-db
---
[debug] execute contextualize
[INFO] Using 'UTF-8' encoding to copy filtered resources.
[INFO] Copying 1 resource
[INFO] Copying 3 resources
[INFO] 
[INFO] --- maven-compiler-plugin:2.5.1:testCompile (default-testCompile) @ cloud-framework-db
---
[INFO] Compiling 15 source files to <http://jenkins.buildacloud.org/job/build-4.5/ws/framework/db/target/test-classes>
Running org.apache.cloudstack.spring.module.model.impl.DefaultModuleDefinitionTest
log4j:WARN No appenders could be found for logger (org.springframework.core.io.support.PathMatchingResourcePatternResolver).
log4j:WARN Please initialize the log4j system properly.
log4j:WARN See http://logging.apache.org/log4j/1.2/faq.html#noconfig for more info.
Tests run: 6, Failures: 0, Errors: 0, Skipped: 0, Time elapsed: 2.435 sec
Running org.apache.cloudstack.spring.module.factory.ModuleBasedContextFactoryTest
[INFO] 
[INFO] --- maven-resources-plugin:2.5:testResources (default-testResources) @ cloudstack-service-console-proxy-rdpclient
---
[debug] execute contextualize
[INFO] Using 'UTF-8' encoding to copy filtered resources.
[INFO] skip non existing resourceDirectory <http://jenkins.buildacloud.org/job/build-4.5/ws/services/console-proxy-rdp/rdpconsole/src/test/resources>
[INFO] Copying 3 resources
[INFO] 
[INFO] --- maven-compiler-plugin:2.5.1:testCompile (default-testCompile) @ cloudstack-service-console-proxy-rdpclient
---
[INFO] Compiling 4 source files to <http://jenkins.buildacloud.org/job/build-4.5/ws/services/console-proxy-rdp/rdpconsole/target/test-classes>
[INFO] 
[INFO] --- maven-surefire-plugin:2.12:test (default-test) @ cloud-framework-db ---
[INFO] Surefire report directory: <http://jenkins.buildacloud.org/job/build-4.5/ws/framework/db/target/surefire-reports>

-------------------------------------------------------
 T E S T S
-------------------------------------------------------
Running com.cloud.utils.DbUtilTest
OpenJDK 64-Bit Server VM warning: INFO: os::commit_memory(0x00000000f1c80000, 63963136, 0)
failed; error='Cannot allocate memory' (errno=12)
#
# There is insufficient memory for the Java Runtime Environment to continue.
# Native memory allocation (malloc) failed to allocate 63963136 bytes for committing reserved
memory.
# An error report file with more information is saved as:
# /tmp/jvm-42441/hs_error.log
# [ timer expired, abort... ]
/bin/sh: line 1: 42441 Aborted                 /usr/lib/jvm/java-1.7.0-openjdk-1.7.0.75-2.5.4.2.el7_0.x86_64/jre/bin/java
-jar <http://jenkins.buildacloud.org/job/build-4.5/ws/framework/spring/module/target/surefire/surefirebooter7943007899012339536.jar>
<http://jenkins.buildacloud.org/job/build-4.5/ws/framework/spring/module/target/surefire/surefire8333140536224530851tmp>
<http://jenkins.buildacloud.org/job/build-4.5/ws/framework/spring/module/target/surefire/surefire_56061815335751921956tmp>

Results :

Tests run: 6, Failures: 0, Errors: 0, Skipped: 0

[INFO] 
[INFO] --- maven-surefire-plugin:2.12:test (default-test) @ cloudstack-service-console-proxy-rdpclient
---
[INFO] ------------------------------------------------------------------------
[INFO] Reactor Summary:
[INFO] 
[INFO] Apache CloudStack Developer Tools - Checkstyle Configuration  SUCCESS [3.320s]
[INFO] Apache CloudStack ................................. SUCCESS [2.304s]
[INFO] Apache CloudStack Maven Conventions Parent ........ SUCCESS [6.908s]
[INFO] Apache CloudStack Framework - Managed Context ..... SUCCESS [17.773s]
[INFO] Apache CloudStack Utils ........................... SUCCESS [44.679s]
[INFO] Apache CloudStack Framework ....................... SUCCESS [1.078s]
[INFO] Apache CloudStack Framework - Event Notification .. SKIPPED
[INFO] Apache CloudStack Framework - Configuration ....... SKIPPED
[INFO] Apache CloudStack API ............................. SKIPPED
[INFO] Apache CloudStack Framework - REST ................ SUCCESS [25.168s]
[INFO] Apache CloudStack Framework - IPC ................. SKIPPED
[INFO] Apache CloudStack Cloud Engine .................... SUCCESS [1.135s]
[INFO] Apache CloudStack Cloud Engine API ................ SKIPPED
[INFO] Apache CloudStack Framework - Security ............ SKIPPED
[INFO] Surefire report directory: <http://jenkins.buildacloud.org/job/build-4.5/ws/services/console-proxy-rdp/rdpconsole/target/surefire-reports>
[INFO] Apache CloudStack Core ............................ SKIPPED
[INFO] Apache CloudStack Agents .......................... SKIPPED
[INFO] Apache CloudStack Framework - Clustering .......... SKIPPED
[INFO] Apache CloudStack Framework - Event Notification .. SUCCESS [13.686s]
[INFO] Apache CloudStack Cloud Engine Schema Component ... SKIPPED
[INFO] Apache CloudStack Framework - Jobs ................ SKIPPED
[INFO] Apache CloudStack Cloud Engine Internal Components API  SKIPPED
[INFO] Apache CloudStack Server .......................... SKIPPED
[INFO] Apache CloudStack Usage Server .................... SKIPPED
[INFO] Apache CloudStack Cloud Engine Orchestration Component  SKIPPED
[INFO] Apache CloudStack Cloud Services .................. SUCCESS [0.500s]
[INFO] Apache CloudStack Secondary Storage ............... SUCCESS [13.897s]
[INFO] Apache CloudStack Secondary Storage Service ....... SKIPPED
[INFO] Apache CloudStack Engine Storage Component ........ SKIPPED
[INFO] Apache CloudStack Engine Storage Volume Component . SKIPPED
[INFO] Apache CloudStack Engine Storage Image Component .. SKIPPED
[INFO] Apache CloudStack Engine Storage Data Motion Component  SKIPPED
[INFO] Apache CloudStack Engine Storage Cache Component .. SKIPPED
[INFO] Apache CloudStack Engine Storage Snapshot Component  SKIPPED
[INFO] Apache CloudStack Cloud Engine API ................ SKIPPED
[INFO] Apache CloudStack Cloud Engine Service ............ SKIPPED
[INFO] Apache CloudStack Plugin POM ...................... SKIPPED
[INFO] Apache CloudStack Plugin - API Rate Limit ......... SKIPPED
[INFO] Apache CloudStack Plugin - Storage Volume default provider  SKIPPED
[INFO] Apache CloudStack Plugin - Storage Volume SolidFire Provider  SKIPPED
[INFO] Apache CloudStack Plugin - API SolidFire .......... SKIPPED
[INFO] Apache CloudStack Plugin - API Discovery .......... SKIPPED
[INFO] Apache CloudStack Plugin - ACL Static Role Based .. SKIPPED
[INFO] Apache CloudStack Plugin - Host Anti-Affinity Processor  SKIPPED
[INFO] Apache CloudStack Plugin - Explicit Dedication Processor  SKIPPED
[INFO] Apache CloudStack Plugin - User Concentrated Pod Deployment Planner  SKIPPED
[INFO] Apache CloudStack Plugin - User Dispersing Deployment Planner  SKIPPED
[INFO] Apache CloudStack Plugin - Implicit Dedication Planner  SKIPPED
[INFO] Apache CloudStack Plugin - Skip Heurestics Planner  SKIPPED
[INFO] Apache CloudStack Plugin - Host Allocator Random .. SKIPPED
[INFO] Apache CloudStack Plugin - Dedicated Resources .... SKIPPED
[INFO] Apache CloudStack Plugin - Hypervisor OracleVM .... SKIPPED
[INFO] Apache CloudStack Plugin - Open vSwitch ........... SKIPPED
[INFO] Apache CloudStack Plugin - Hypervisor XenServer ... SKIPPED
[INFO] Apache CloudStack Plugin - Hypervisor KVM ......... SKIPPED
[INFO] Apache CloudStack Plugin - RabbitMQ Event Bus ..... SKIPPED
[INFO] Apache CloudStack Plugin - In Memory Event Bus .... SKIPPED
[INFO] Apache CloudStack Plugin - Hypervisor Baremetal ... SKIPPED
[INFO] Apache CloudStack Plugin - Hypervisor UCS ......... SKIPPED
[INFO] Apache CloudStack Plugin - Hypervisor Hyper-V ..... SKIPPED
[INFO] Apache CloudStack Plugin - Network Elastic Load Balancer  SKIPPED
[INFO] Apache CloudStack Plugin - Network Internal Load Balancer  SKIPPED
[INFO] Apache CloudStack Framework - Spring Life Cycle ... SKIPPED
[INFO] Apache CloudStack Plugin - Network Juniper Contrail  SKIPPED
[INFO] Apache CloudStack Plugin - Palo Alto .............. SKIPPED
[INFO] Apache CloudStack Plugin - Network Netscaler ...... SKIPPED
[INFO] Apache CloudStack Plugin - Network Nicira NVP ..... SKIPPED
[INFO] Apache CloudStack Plugin - BigSwitch Virtual Network Segment  SKIPPED
[INFO] Apache CloudStack Plugin - Network Brocade VCS .... SKIPPED
[INFO] Apache CloudStack Plugin - Midokura Midonet ....... SKIPPED
[INFO] Apache CloudStack Plugin - Stratosphere SSP ....... SKIPPED
[INFO] Apache CloudStack Plugin - Network Opendaylight ... SKIPPED
[INFO] Apache CloudStack Plugin - Storage Allocator Random  SKIPPED
[INFO] Apache CloudStack Plugin - User Authenticator LDAP  SKIPPED
[INFO] Apache CloudStack Plugin - User Authenticator MD5 . SKIPPED
[INFO] Apache CloudStack Plugin - User Authenticator Plain Text  SKIPPED
[INFO] Apache CloudStack Plugin - User Authenticator SAML2  SKIPPED
[INFO] Apache CloudStack Plugin - User Authenticator SHA256 Salted  SKIPPED
[INFO] Apache CloudStack Plugin - Dns Notifier Example ... SKIPPED
[INFO] Apache CloudStack Plugin - Storage Image S3 ....... SKIPPED
[INFO] Apache CloudStack Plugin - Storage Image Swift provider  SKIPPED
[INFO] Apache CloudStack Plugin - Storage Image default provider  SKIPPED
[INFO] Apache CloudStack Plugin - Storage Image sample provider  SKIPPED
[INFO] Apache CloudStack Plugin - Storage Volume Nexenta Provider  SKIPPED
[INFO] Apache CloudStack Plugin - Storage Volume CloudByte Provider  SKIPPED
[INFO] Apache CloudStack Plugin - Storage Volume sample provider  SKIPPED
[INFO] Apache CloudStack Plugin - SNMP Alerts ............ SKIPPED
[INFO] Apache CloudStack Plugin - Syslog Alerts .......... SKIPPED
[INFO] Apache CloudStack Plugin - Network VXLAN .......... SKIPPED
[INFO] Apache CloudStack Plugin - GloboDNS ............... SKIPPED
[INFO] Apache CloudStack Framework - Spring Module ....... FAILURE [6:56.098s]
[INFO] Apache CloudStack Secondary Storage Controller .... SKIPPED
[INFO] Apache CloudStack Console Proxy - RDP Client ...... SKIPPED
[INFO] Apache CloudStack Console Proxy ................... SUCCESS [13.374s]
[INFO] Apache CloudStack Console Proxy - Server .......... SKIPPED
[INFO] Apache CloudStack System VM ....................... SKIPPED
[INFO] Apache CloudStack Client UI ....................... SKIPPED
[INFO] Apache CloudStack Framework - QuickCloud .......... SUCCESS [5.616s]
[INFO] Apache CloudStack AWS API Bridge .................. SKIPPED
[INFO] ------------------------------------------------------------------------
[INFO] BUILD FAILURE
[INFO] ------------------------------------------------------------------------
[INFO] Total time: 8:24.640s (Wall Clock)
[INFO] Finished at: Mon Feb 02 11:26:09 UTC 2015
log4j:WARN No appenders could be found for logger (com.cloud.utils.crypt.EncryptionSecretKeyChecker).
log4j:WARN Please initialize the log4j system properly.
log4j:WARN See http://logging.apache.org/log4j/1.2/faq.html#noconfig for more info.
[INFO] Final Memory: 48M/283M
[INFO] ------------------------------------------------------------------------
[ERROR] Failed to execute goal org.apache.maven.plugins:maven-surefire-plugin:2.12:test (default-test)
on project cloud-framework-spring-module: Error occurred in starting fork, check output in
log -> [Help 1]
[ERROR] 
[ERROR] To see the full stack trace of the errors, re-run Maven with the -e switch.
[ERROR] Re-run Maven using the -X switch to enable full debug logging.
[ERROR] 
[ERROR] For more information about the errors and possible solutions, please read the following
articles:

-------------------------------------------------------
 T E S T S
-------------------------------------------------------
[ERROR] [Help 1] http://cwiki.apache.org/confluence/display/MAVEN/MojoExecutionException
[ERROR] 
[ERROR] After correcting the problems, you can resume the build with the command
[ERROR]   mvn <goals> -rf :cloud-framework-spring-module
Error: Unable to access jarfile <http://jenkins.buildacloud.org/job/build-4.5/ws/services/console-proxy-rdp/rdpconsole/target/surefire/surefirebooter8572863661542289095.jar>

Results :

Tests run: 0, Failures: 0, Errors: 0, Skipped: 0


Results :

Tests run: 0, Failures: 0, Errors: 0, Skipped: 0

Build step 'Invoke top-level Maven targets' marked build as failure
Recording test results

Mime
View raw message