cloudstack-dev mailing list archives

Site index · List index
Message view « Date » · « Thread »
Top « Date » · « Thread »
From jenk...@cloudstack.org
Subject Build failed in Jenkins: build-4.5-simulator #188
Date Fri, 06 Feb 2015 20:48:46 GMT
See <http://jenkins.buildacloud.org/job/build-4.5-simulator/188/changes>

Changes:

[Rohit Yadav] debian: remove old cache after upgrade

------------------------------------------
[...truncated 756 lines...]
Running org.apache.cloudstack.framework.ws.jackson.CSJacksonAnnotationTest
Tests run: 1, Failures: 0, Errors: 0, Skipped: 1, Time elapsed: 0.328 sec

Results :

Tests run: 1, Failures: 0, Errors: 0, Skipped: 1

[INFO]                                                                         
[INFO] ------------------------------------------------------------------------
[INFO] Building Apache CloudStack Framework - IPC 4.5.0-SNAPSHOT
[INFO] ------------------------------------------------------------------------
[INFO] 
[INFO] --- maven-clean-plugin:2.5:clean (default-clean) @ cloud-framework-ipc ---
[INFO] Deleting <http://jenkins.buildacloud.org/job/build-4.5-simulator/ws/framework/ipc/target>
(includes = [**/*], excludes = [])
[INFO] Deleting <http://jenkins.buildacloud.org/job/build-4.5-simulator/ws/framework/ipc>
(includes = [target, dist], excludes = [])
[INFO] 
[INFO] --- maven-checkstyle-plugin:2.11:check (cloudstack-checkstyle) @ cloud-framework-ipc
---
[INFO] Starting audit...
Audit done.

[INFO] 
[INFO] --- maven-remote-resources-plugin:1.3:process (default) @ cloud-framework-ipc ---
[INFO] 
[INFO] --- maven-resources-plugin:2.5:resources (default-resources) @ cloud-framework-ipc
---
[debug] execute contextualize
[INFO] Using 'UTF-8' encoding to copy filtered resources.
[INFO] Copying 1 resource
[INFO] Copying 3 resources
[INFO] 
[INFO] --- maven-compiler-plugin:2.5.1:compile (default-compile) @ cloud-framework-ipc ---
[INFO] Compiling 55 source files to <http://jenkins.buildacloud.org/job/build-4.5-simulator/ws/framework/ipc/target/classes>
[INFO] 
[INFO] --- maven-resources-plugin:2.5:testResources (default-testResources) @ cloud-framework-ipc
---
[debug] execute contextualize
[INFO] Using 'UTF-8' encoding to copy filtered resources.
[INFO] Copying 3 resources
[INFO] Copying 3 resources
[INFO] 
[INFO] --- maven-compiler-plugin:2.5.1:testCompile (default-testCompile) @ cloud-framework-ipc
---
[INFO] Compiling 12 source files to <http://jenkins.buildacloud.org/job/build-4.5-simulator/ws/framework/ipc/target/test-classes>
[INFO] 
[INFO] --- maven-surefire-plugin:2.12:test (default-test) @ cloud-framework-ipc ---
[INFO] Tests are skipped.
[INFO]                                                                         
[INFO] ------------------------------------------------------------------------
[INFO] Building Apache CloudStack Cloud Engine 4.5.0-SNAPSHOT
[INFO] ------------------------------------------------------------------------
[INFO] 
[INFO] --- maven-clean-plugin:2.5:clean (default-clean) @ cloud-engine ---
[INFO] Deleting <http://jenkins.buildacloud.org/job/build-4.5-simulator/ws/engine/target>
(includes = [**/*], excludes = [])
[INFO] Deleting <http://jenkins.buildacloud.org/job/build-4.5-simulator/ws/engine> (includes
= [target, dist], excludes = [])
[INFO] 
[INFO] --- maven-remote-resources-plugin:1.3:process (default) @ cloud-engine ---
[INFO]                                                                         
[INFO] ------------------------------------------------------------------------
[INFO] Building Apache CloudStack Cloud Engine API 4.5.0-SNAPSHOT
[INFO] ------------------------------------------------------------------------
[INFO] 
[INFO] --- maven-clean-plugin:2.5:clean (default-clean) @ cloud-engine-api ---
[INFO] Deleting <http://jenkins.buildacloud.org/job/build-4.5-simulator/ws/engine/api/target>
(includes = [**/*], excludes = [])
[INFO] Deleting <http://jenkins.buildacloud.org/job/build-4.5-simulator/ws/engine/api>
(includes = [target, dist], excludes = [])
[INFO] 
[INFO] --- maven-checkstyle-plugin:2.11:check (cloudstack-checkstyle) @ cloud-engine-api ---
[INFO] Starting audit...
Audit done.

[INFO] 
[INFO] --- maven-remote-resources-plugin:1.3:process (default) @ cloud-engine-api ---
[INFO] 
[INFO] --- maven-resources-plugin:2.5:resources (default-resources) @ cloud-engine-api ---
[debug] execute contextualize
[INFO] Using 'UTF-8' encoding to copy filtered resources.
[INFO] Copying 1 resource
[INFO] Copying 3 resources
[INFO] 
[INFO] --- maven-compiler-plugin:2.5.1:compile (default-compile) @ cloud-engine-api ---
[INFO] Compiling 107 source files to <http://jenkins.buildacloud.org/job/build-4.5-simulator/ws/engine/api/target/classes>
[INFO] 
[INFO] --- maven-resources-plugin:2.5:testResources (default-testResources) @ cloud-engine-api
---
[debug] execute contextualize
[INFO] Using 'UTF-8' encoding to copy filtered resources.
[INFO] skip non existing resourceDirectory <http://jenkins.buildacloud.org/job/build-4.5-simulator/ws/engine/api/test/resources>
[INFO] Copying 3 resources
[INFO] 
[INFO] --- maven-compiler-plugin:2.5.1:testCompile (default-testCompile) @ cloud-engine-api
---
[INFO] Compiling 2 source files to <http://jenkins.buildacloud.org/job/build-4.5-simulator/ws/engine/api/target/test-classes>
[INFO] 
[INFO] --- maven-surefire-plugin:2.12:test (default-test) @ cloud-engine-api ---
[INFO] Surefire report directory: <http://jenkins.buildacloud.org/job/build-4.5-simulator/ws/engine/api/target/surefire-reports>

-------------------------------------------------------
 T E S T S
-------------------------------------------------------
Running org.apache.cloudstack.engine.subsystem.api.storage.ScopeTest
Tests run: 3, Failures: 0, Errors: 0, Skipped: 0, Time elapsed: 0.889 sec
Running org.apache.cloudstack.engine.subsystem.api.storage.type.VolumeTypeHelperTest
Tests run: 8, Failures: 0, Errors: 0, Skipped: 0, Time elapsed: 0.065 sec

Results :

Tests run: 11, Failures: 0, Errors: 0, Skipped: 0

[INFO]                                                                         
[INFO] ------------------------------------------------------------------------
[INFO] Building Apache CloudStack Framework - Security 4.5.0-SNAPSHOT
[INFO] ------------------------------------------------------------------------
[INFO] 
[INFO] --- maven-clean-plugin:2.5:clean (default-clean) @ cloud-framework-security ---
[INFO] Deleting <http://jenkins.buildacloud.org/job/build-4.5-simulator/ws/framework/security/target>
(includes = [**/*], excludes = [])
[INFO] Deleting <http://jenkins.buildacloud.org/job/build-4.5-simulator/ws/framework/security>
(includes = [target, dist], excludes = [])
[INFO] 
[INFO] --- maven-checkstyle-plugin:2.11:check (cloudstack-checkstyle) @ cloud-framework-security
---
[INFO] Starting audit...
Audit done.

[INFO] 
[INFO] --- maven-remote-resources-plugin:1.3:process (default) @ cloud-framework-security
---
[INFO] 
[INFO] --- maven-resources-plugin:2.5:resources (default-resources) @ cloud-framework-security
---
[debug] execute contextualize
[INFO] Using 'UTF-8' encoding to copy filtered resources.
[INFO] Copying 1 resource
[INFO] Copying 3 resources
[INFO] 
[INFO] --- maven-compiler-plugin:2.5.1:compile (default-compile) @ cloud-framework-security
---
[INFO] Compiling 7 source files to <http://jenkins.buildacloud.org/job/build-4.5-simulator/ws/framework/security/target/classes>
[INFO] 
[INFO] --- maven-resources-plugin:2.5:testResources (default-testResources) @ cloud-framework-security
---
[debug] execute contextualize
[INFO] Using 'UTF-8' encoding to copy filtered resources.
[INFO] skip non existing resourceDirectory <http://jenkins.buildacloud.org/job/build-4.5-simulator/ws/framework/security/test/resources>
[INFO] Copying 3 resources
[INFO] 
[INFO] --- maven-compiler-plugin:2.5.1:testCompile (default-testCompile) @ cloud-framework-security
---
[INFO] No sources to compile
[INFO] 
[INFO] --- maven-surefire-plugin:2.12:test (default-test) @ cloud-framework-security ---
[INFO] Surefire report directory: <http://jenkins.buildacloud.org/job/build-4.5-simulator/ws/framework/security/target/surefire-reports>

-------------------------------------------------------
 T E S T S
-------------------------------------------------------

Results :

Tests run: 0, Failures: 0, Errors: 0, Skipped: 0

[INFO]                                                                         
[INFO] ------------------------------------------------------------------------
[INFO] Building Apache CloudStack Core 4.5.0-SNAPSHOT
[INFO] ------------------------------------------------------------------------
[INFO] 
[INFO] --- maven-clean-plugin:2.5:clean (default-clean) @ cloud-core ---
[INFO] Deleting <http://jenkins.buildacloud.org/job/build-4.5-simulator/ws/core/target>
(includes = [**/*], excludes = [])
[INFO] Deleting <http://jenkins.buildacloud.org/job/build-4.5-simulator/ws/core> (includes
= [target, dist], excludes = [])
[INFO] 
[INFO] --- maven-checkstyle-plugin:2.11:check (cloudstack-checkstyle) @ cloud-core ---
[INFO] Starting audit...
Audit done.

[INFO] 
[INFO] --- maven-remote-resources-plugin:1.3:process (default) @ cloud-core ---
[INFO] 
[INFO] --- maven-resources-plugin:2.5:resources (default-resources) @ cloud-core ---
[debug] execute contextualize
[INFO] Using 'UTF-8' encoding to copy filtered resources.
[INFO] Copying 26 resources
[INFO] Copying 3 resources
[INFO] 
[INFO] --- maven-compiler-plugin:2.5.1:compile (default-compile) @ cloud-core ---
[INFO] Compiling 331 source files to <http://jenkins.buildacloud.org/job/build-4.5-simulator/ws/core/target/classes>
[INFO] 
[INFO] --- license-maven-plugin:2.5:check (cloudstack-checklicence) @ cloud-core ---
[INFO] Checking licenses...
[INFO] 
[INFO] --- maven-resources-plugin:2.5:testResources (default-testResources) @ cloud-core ---
[debug] execute contextualize
[INFO] Using 'UTF-8' encoding to copy filtered resources.
[INFO] skip non existing resourceDirectory <http://jenkins.buildacloud.org/job/build-4.5-simulator/ws/core/test/resources>
[INFO] Copying 3 resources
[INFO] 
[INFO] --- maven-compiler-plugin:2.5.1:testCompile (default-testCompile) @ cloud-core ---
[INFO] Compiling 21 source files to <http://jenkins.buildacloud.org/job/build-4.5-simulator/ws/core/target/test-classes>
[INFO] 
[INFO] --- maven-surefire-plugin:2.12:test (default-test) @ cloud-core ---
[INFO] Surefire report directory: <http://jenkins.buildacloud.org/job/build-4.5-simulator/ws/core/target/surefire-reports>

-------------------------------------------------------
 T E S T S
-------------------------------------------------------
Build timed out (after 7 minutes). Marking the build as failed.
Build was aborted
Recording test results

Results :

Tests run: 0, Failures: 0, Errors: 0, Skipped: 0

[INFO] ------------------------------------------------------------------------
[INFO] Reactor Summary:
[INFO] 
[INFO] Apache CloudStack Developer Tools - Checkstyle Configuration  SUCCESS [3.965s]
[INFO] Apache CloudStack ................................. SUCCESS [3.716s]
[INFO] Apache CloudStack Maven Conventions Parent ........ SUCCESS [6.239s]
[INFO] Apache CloudStack Framework - Managed Context ..... SUCCESS [15.053s]
[INFO] Apache CloudStack Utils ........................... SUCCESS [2:09.832s]
[INFO] Apache CloudStack Framework ....................... SUCCESS [0.213s]
[INFO] Apache CloudStack Framework - Event Notification .. SUCCESS [36.070s]
[INFO] Apache CloudStack Framework - Configuration ....... SUCCESS [22.307s]
[INFO] Apache CloudStack API ............................. SUCCESS [1:14.811s]
[INFO] Apache CloudStack Framework - REST ................ SUCCESS [14.676s]
[INFO] Apache CloudStack Framework - IPC ................. SUCCESS [21.932s]
[INFO] Apache CloudStack Cloud Engine .................... SUCCESS [0.189s]
[INFO] Apache CloudStack Cloud Engine API ................ SUCCESS [24.385s]
[INFO] Apache CloudStack Framework - Security ............ SUCCESS [12.712s]
[INFO] Apache CloudStack Core ............................ FAILURE [42.238s]
[INFO] Apache CloudStack Agents .......................... SKIPPED
[INFO] Apache CloudStack Framework - Clustering .......... SKIPPED
[INFO] Apache CloudStack Framework - Event Notification .. SKIPPED
[INFO] Apache CloudStack Cloud Engine Schema Component ... SKIPPED
[INFO] Apache CloudStack Framework - Jobs ................ SKIPPED
[INFO] Apache CloudStack Cloud Engine Internal Components API  SKIPPED
[INFO] Apache CloudStack Server .......................... SKIPPED
[INFO] Apache CloudStack Cloud Services .................. SKIPPED
[INFO] Apache CloudStack Secondary Storage ............... SKIPPED
[INFO] Apache CloudStack Secondary Storage Service ....... SKIPPED
[INFO] Apache CloudStack Engine Storage Component ........ SKIPPED
[INFO] Apache CloudStack Engine Storage Volume Component . SKIPPED
[INFO] Apache CloudStack Engine Storage Image Component .. SKIPPED
[INFO] Apache CloudStack Engine Storage Snapshot Component  SKIPPED
[INFO] Apache CloudStack Plugin POM ...................... SKIPPED
[INFO] Apache CloudStack Plugin - Hypervisor Simulator ... SKIPPED
[INFO] ------------------------------------------------------------------------
[INFO] BUILD FAILURE
[INFO] ------------------------------------------------------------------------
[INFO] Total time: 6:57.677s
[INFO] Finished at: Fri Feb 06 21:48:59 CET 2015
[INFO] Final Memory: 54M/337M
[INFO] ------------------------------------------------------------------------
[ERROR] Failed to execute goal org.apache.maven.plugins:maven-surefire-plugin:2.12:test (default-test)
on project cloud-core: Error occurred in starting fork, check output in log -> [Help 1]
[ERROR] 
[ERROR] To see the full stack trace of the errors, re-run Maven with the -e switch.
[ERROR] Re-run Maven using the -X switch to enable full debug logging.
[ERROR] 
[ERROR] For more information about the errors and possible solutions, please read the following
articles:
[ERROR] [Help 1] http://cwiki.apache.org/confluence/display/MAVEN/MojoExecutionException
[ERROR] 
[ERROR] After correcting the problems, you can resume the build with the command
[ERROR]   mvn <goals> -rf :cloud-core

Mime
View raw message