cloudstack-dev mailing list archives

Site index · List index
Message view « Date » · « Thread »
Top « Date » · « Thread »
From jenk...@cloudstack.org
Subject Build failed in Jenkins: build-master #2261
Date Fri, 27 Feb 2015 10:47:19 GMT
See <http://jenkins.buildacloud.org/job/build-master/2261/changes>

Changes:

[Rohit Yadav] CLOUDSTACK-8273: fix baremetal account creation

------------------------------------------
[...truncated 5861 lines...]
[debug] execute contextualize
[INFO] Using 'UTF-8' encoding to copy filtered resources.
[INFO] skip non existing resourceDirectory <http://jenkins.buildacloud.org/job/build-master/ws/services/console-proxy-rdp/rdpconsole/src/test/resources>
[INFO] Copying 3 resources
[INFO] 
[INFO] --- maven-compiler-plugin:3.2:testCompile (default-testCompile) @ cloudstack-service-console-proxy-rdpclient
---
[INFO] Changes detected - recompiling the module!
[INFO] Compiling 4 source files to <http://jenkins.buildacloud.org/job/build-master/ws/services/console-proxy-rdp/rdpconsole/target/test-classes>
[INFO] 
[INFO] --- maven-surefire-plugin:2.18.1:test (default-test) @ cloudstack-service-console-proxy-rdpclient
---
[INFO] Surefire report directory: <http://jenkins.buildacloud.org/job/build-master/ws/services/console-proxy-rdp/rdpconsole/target/surefire-reports>

-------------------------------------------------------
 T E S T S
-------------------------------------------------------
Running streamer.BaseElementTest
Tests run: 1, Failures: 0, Errors: 0, Skipped: 0, Time elapsed: 0.144 sec - in streamer.BaseElementTest
Running streamer.ByteBufferTest
Tests run: 400, Failures: 0, Errors: 0, Skipped: 0, Time elapsed: 0.207 sec - in streamer.ByteBufferTest
Running common.ClientTest
Tests run: 1, Failures: 0, Errors: 0, Skipped: 0, Time elapsed: 0.053 sec - in common.ClientTest
Running rdpclient.MockServerTest
Tests run: 2, Failures: 0, Errors: 0, Skipped: 0, Time elapsed: 0.361 sec - in rdpclient.MockServerTest

Results :

Tests run: 404, Failures: 0, Errors: 0, Skipped: 0

[INFO]                                                                         
[INFO] ------------------------------------------------------------------------
[INFO] Building Apache CloudStack Console Proxy 4.6.0-SNAPSHOT
[INFO] ------------------------------------------------------------------------
[INFO] 
[INFO] --- maven-clean-plugin:2.5:clean (default-clean) @ cloudstack-service-console-proxy
---
[INFO] Deleting <http://jenkins.buildacloud.org/job/build-master/ws/services/console-proxy/target>
(includes = [**/*], excludes = [])
[INFO] Deleting <http://jenkins.buildacloud.org/job/build-master/ws/services/console-proxy>
(includes = [target, dist], excludes = [])
[INFO] 
[INFO] --- maven-checkstyle-plugin:2.11:check (cloudstack-checkstyle) @ cloudstack-service-console-proxy
---
[INFO] Starting audit...
Audit done.

[INFO] 
[INFO] --- maven-remote-resources-plugin:1.3:process (default) @ cloudstack-service-console-proxy
---
[INFO]                                                                         
[INFO] ------------------------------------------------------------------------
[INFO] Building Apache CloudStack Console Proxy - Server 4.6.0-SNAPSHOT
[INFO] ------------------------------------------------------------------------
[INFO] 
[INFO] --- maven-clean-plugin:2.5:clean (default-clean) @ cloud-console-proxy ---
[INFO] Deleting <http://jenkins.buildacloud.org/job/build-master/ws/services/console-proxy/server/target>
(includes = [**/*], excludes = [])
[INFO] Deleting <http://jenkins.buildacloud.org/job/build-master/ws/services/console-proxy/server>
(includes = [target, dist], excludes = [])
[INFO] 
[INFO] --- maven-checkstyle-plugin:2.11:check (cloudstack-checkstyle) @ cloud-console-proxy
---
[INFO] Starting audit...
Audit done.

[INFO] 
[INFO] --- maven-remote-resources-plugin:1.3:process (default) @ cloud-console-proxy ---
[INFO] 
[INFO] --- maven-resources-plugin:2.5:resources (default-resources) @ cloud-console-proxy
---
[debug] execute contextualize
[INFO] Using 'UTF-8' encoding to copy filtered resources.
[INFO] skip non existing resourceDirectory <http://jenkins.buildacloud.org/job/build-master/ws/services/console-proxy/server/certs>
[INFO] Copying 3 resources
[INFO] 
[INFO] --- maven-compiler-plugin:3.2:compile (default-compile) @ cloud-console-proxy ---
[INFO] Changes detected - recompiling the module!
[INFO] Compiling 58 source files to <http://jenkins.buildacloud.org/job/build-master/ws/services/console-proxy/server/target/classes>
[INFO] 
[INFO] --- maven-resources-plugin:2.5:testResources (default-testResources) @ cloud-console-proxy
---
[debug] execute contextualize
[INFO] Using 'UTF-8' encoding to copy filtered resources.
[INFO] skip non existing resourceDirectory <http://jenkins.buildacloud.org/job/build-master/ws/services/console-proxy/server/test/resources>
[INFO] Copying 3 resources
[INFO] 
[INFO] --- maven-compiler-plugin:3.2:testCompile (default-testCompile) @ cloud-console-proxy
---
[INFO] Changes detected - recompiling the module!
[INFO] Compiling 1 source file to <http://jenkins.buildacloud.org/job/build-master/ws/services/console-proxy/server/target/test-classes>
[INFO] 
[INFO] --- maven-surefire-plugin:2.18.1:test (default-test) @ cloud-console-proxy ---
[INFO] Surefire report directory: <http://jenkins.buildacloud.org/job/build-master/ws/services/console-proxy/server/target/surefire-reports>

-------------------------------------------------------
 T E S T S
-------------------------------------------------------
Running com.cloud.consoleproxy.ConsoleProxyRdpClientTest
Tests run: 3, Failures: 0, Errors: 0, Skipped: 0, Time elapsed: 0.047 sec - in com.cloud.consoleproxy.ConsoleProxyRdpClientTest

Results :

Tests run: 3, Failures: 0, Errors: 0, Skipped: 0

[INFO]                                                                         
[INFO] ------------------------------------------------------------------------
[INFO] Building Apache CloudStack System VM 4.6.0-SNAPSHOT
[INFO] ------------------------------------------------------------------------
[INFO] 
[INFO] --- maven-clean-plugin:2.5:clean (default-clean) @ cloud-systemvm ---
[INFO] Deleting <http://jenkins.buildacloud.org/job/build-master/ws/systemvm/target>
(includes = [**/*], excludes = [])
[INFO] Deleting <http://jenkins.buildacloud.org/job/build-master/ws/systemvm/dist> (includes
= [**/*], excludes = [])
[INFO] Deleting <http://jenkins.buildacloud.org/job/build-master/ws/systemvm> (includes
= [target, dist], excludes = [])
[INFO] 
[INFO] --- maven-checkstyle-plugin:2.11:check (cloudstack-checkstyle) @ cloud-systemvm ---
[INFO] Starting audit...
Audit done.

[INFO] 
[INFO] --- maven-antrun-plugin:1.8:run (build-cloud-scripts) @ cloud-systemvm ---
[INFO] Executing tasks

main:
    [mkdir] Created dir: <http://jenkins.buildacloud.org/job/build-master/ws/systemvm/dist>
    [mkdir] Created dir: <http://jenkins.buildacloud.org/job/build-master/ws/systemvm/target/build-patch>
    [mkdir] Created dir: <http://jenkins.buildacloud.org/job/build-master/ws/systemvm/target/build-patch/usr/sbin>
     [copy] Copying 108 files to <http://jenkins.buildacloud.org/job/build-master/ws/systemvm/target/build-patch>
     [copy] Copying 3 files to <http://jenkins.buildacloud.org/job/build-master/ws/systemvm/target/build-patch/usr/sbin>
      [tar] Building tar: <http://jenkins.buildacloud.org/job/build-master/ws/systemvm/target/patch.tar>
     [gzip] Building: <http://jenkins.buildacloud.org/job/build-master/ws/systemvm/dist/cloud-scripts.tgz>
   [delete] Deleting directory <http://jenkins.buildacloud.org/job/build-master/ws/systemvm/target/build-patch>
   [delete] Deleting: <http://jenkins.buildacloud.org/job/build-master/ws/systemvm/target/patch.tar>
[INFO] Executed tasks
[INFO] 
[INFO] --- maven-remote-resources-plugin:1.3:process (default) @ cloud-systemvm ---
[INFO]                                                                         
[INFO] ------------------------------------------------------------------------
[INFO] Building Apache CloudStack Client UI 4.6.0-SNAPSHOT
[INFO] ------------------------------------------------------------------------
[WARNING] The POM for org.apache.cloudstack:cloud-plugin-user-authenticator-pbkdf2:jar:4.6.0-SNAPSHOT
is missing, no dependency information available
[INFO] ------------------------------------------------------------------------
[INFO] Reactor Summary:
[INFO] 
[INFO] Apache CloudStack Developer Tools - Checkstyle Configuration  SUCCESS [0.835s]
[INFO] Apache CloudStack ................................. SUCCESS [0.530s]
[INFO] Apache CloudStack Maven Conventions Parent ........ SUCCESS [0.908s]
[INFO] Apache CloudStack Framework - Managed Context ..... SUCCESS [2.787s]
[INFO] Apache CloudStack Utils ........................... SUCCESS [13.255s]
[INFO] Apache CloudStack Framework ....................... SUCCESS [0.054s]
[INFO] Apache CloudStack Framework - Event Notification .. SUCCESS [6.134s]
[INFO] Apache CloudStack Framework - Configuration ....... SUCCESS [4.001s]
[INFO] Apache CloudStack API ............................. SUCCESS [11.589s]
[INFO] Apache CloudStack Framework - REST ................ SUCCESS [2.399s]
[INFO] Apache CloudStack Framework - IPC ................. SUCCESS [3.769s]
[INFO] Apache CloudStack Cloud Engine .................... SUCCESS [0.035s]
[INFO] Apache CloudStack Cloud Engine API ................ SUCCESS [4.431s]
[INFO] Apache CloudStack Framework - Security ............ SUCCESS [2.021s]
[INFO] Apache CloudStack Core ............................ SUCCESS [8.515s]
[INFO] Apache CloudStack Agents .......................... SUCCESS [5.004s]
[INFO] Apache CloudStack Framework - Clustering .......... SUCCESS [2.570s]
[INFO] Apache CloudStack Framework - Event Notification .. SUCCESS [1.488s]
[INFO] Apache CloudStack Cloud Engine Schema Component ... SUCCESS [10.816s]
[INFO] Apache CloudStack Framework - Jobs ................ SUCCESS [4.308s]
[INFO] Apache CloudStack Cloud Engine Internal Components API  SUCCESS [2.601s]
[INFO] Apache CloudStack Server .......................... SUCCESS [34.259s]
[INFO] Apache CloudStack Usage Server .................... SUCCESS [5.792s]
[INFO] Apache CloudStack Cloud Engine Orchestration Component  SUCCESS [7.775s]
[INFO] Apache CloudStack Cloud Services .................. SUCCESS [0.036s]
[INFO] Apache CloudStack Secondary Storage ............... SUCCESS [0.252s]
[INFO] Apache CloudStack Secondary Storage Service ....... SUCCESS [4.700s]
[INFO] Apache CloudStack Engine Storage Component ........ SUCCESS [6.002s]
[INFO] Apache CloudStack Engine Storage Volume Component . SUCCESS [4.174s]
[INFO] Apache CloudStack Engine Storage Image Component .. SUCCESS [2.460s]
[INFO] Apache CloudStack Engine Storage Data Motion Component  SUCCESS [2.341s]
[INFO] Apache CloudStack Engine Storage Cache Component .. SUCCESS [2.057s]
[INFO] Apache CloudStack Engine Storage Snapshot Component  SUCCESS [8.143s]
[INFO] Apache CloudStack Cloud Engine API ................ SUCCESS [1.598s]
[INFO] Apache CloudStack Cloud Engine Service ............ SUCCESS [0.712s]
[INFO] Apache CloudStack Plugin POM ...................... SUCCESS [0.362s]
[INFO] Apache CloudStack Plugin - API Rate Limit ......... SUCCESS [6.578s]
[INFO] Apache CloudStack Plugin - Storage Volume default provider  SUCCESS [2.309s]
[INFO] Apache CloudStack Plugin - Storage Volume SolidFire Provider  SUCCESS [4.352s]
[INFO] Apache CloudStack Plugin - API SolidFire .......... SUCCESS [2.130s]
[INFO] Apache CloudStack Plugin - API Discovery .......... SUCCESS [4.361s]
[INFO] Apache CloudStack Plugin - ACL Static Role Based .. SUCCESS [1.886s]
[INFO] Apache CloudStack Plugin - Host Anti-Affinity Processor  SUCCESS [1.939s]
[INFO] Apache CloudStack Plugin - Explicit Dedication Processor  SUCCESS [2.010s]
[INFO] Apache CloudStack Plugin - User Concentrated Pod Deployment Planner  SUCCESS [2.120s]
[INFO] Apache CloudStack Plugin - User Dispersing Deployment Planner  SUCCESS [1.912s]
[INFO] Apache CloudStack Plugin - Implicit Dedication Planner  SUCCESS [6.510s]
[INFO] Apache CloudStack Plugin - Skip Heurestics Planner  SUCCESS [1.780s]
[INFO] Apache CloudStack Plugin - Host Allocator Random .. SUCCESS [1.943s]
[INFO] Apache CloudStack Plugin - Dedicated Resources .... SUCCESS [6.190s]
[INFO] Apache CloudStack Plugin - Hypervisor OracleVM .... SUCCESS [2.767s]
[INFO] Apache CloudStack Plugin - Open vSwitch ........... SUCCESS [2.946s]
[INFO] Apache CloudStack Plugin - Hypervisor XenServer ... SUCCESS [7.937s]
[INFO] Apache CloudStack Plugin - Hypervisor KVM ......... SUCCESS [7.934s]
[INFO] Apache CloudStack Plugin - RabbitMQ Event Bus ..... SUCCESS [1.979s]
[INFO] Apache CloudStack Plugin - In Memory Event Bus .... SUCCESS [4.008s]
[INFO] Apache CloudStack Plugin - Hypervisor Baremetal ... SUCCESS [3.553s]
[INFO] Apache CloudStack Plugin - Hypervisor UCS ......... SUCCESS [2.335s]
[INFO] Apache CloudStack Plugin - Hypervisor Hyper-V ..... SUCCESS [5.444s]
[INFO] Apache CloudStack Plugin - Network Elastic Load Balancer  SUCCESS [5.147s]
[INFO] Apache CloudStack Plugin - Network Internal Load Balancer  SUCCESS [8.265s]
[INFO] Apache CloudStack Framework - Spring Life Cycle ... SUCCESS [1.702s]
[INFO] Apache CloudStack Plugin - Network Juniper Contrail  SUCCESS [11.864s]
[INFO] Apache CloudStack Plugin - Palo Alto .............. SUCCESS [6.583s]
[INFO] Apache CloudStack Plugin - Network Netscaler ...... SUCCESS [3.491s]
[INFO] Apache CloudStack Plugin - Network Nicira NVP ..... SUCCESS [7.754s]
[INFO] Apache CloudStack Plugin - BigSwitch Virtual Network Segment  SUCCESS [5.435s]
[INFO] Apache CloudStack Plugin - Network Brocade VCS .... SUCCESS [7.559s]
[INFO] Apache CloudStack Plugin - Midokura Midonet ....... SUCCESS [6.682s]
[INFO] Apache CloudStack Plugin - Stratosphere SSP ....... SUCCESS [5.680s]
[INFO] Apache CloudStack Plugin - Network Opendaylight ... SUCCESS [5.194s]
[INFO] Apache CloudStack Plugin - Storage Allocator Random  SUCCESS [1.942s]
[INFO] Apache CloudStack Plugin - User Authenticator LDAP  SUCCESS [2.933s]
[INFO] Apache CloudStack Plugin - User Authenticator MD5 . SUCCESS [4.350s]
[INFO] Apache CloudStack Plugin - User Authenticator PBKDF2-SHA-256  SUCCESS [6.078s]
[INFO] Apache CloudStack Plugin - User Authenticator Plain Text  SUCCESS [1.969s]
[INFO] Apache CloudStack Plugin - User Authenticator SAML2  SUCCESS [25.844s]
[INFO] Apache CloudStack Plugin - User Authenticator SHA256 Salted  SUCCESS [4.323s]
[INFO] Apache CloudStack Plugin - Dns Notifier Example ... SUCCESS [1.794s]
[INFO] Apache CloudStack Plugin - Storage Image S3 ....... SUCCESS [2.062s]
[INFO] Apache CloudStack Plugin - Storage Image Swift provider  SUCCESS [1.998s]
[INFO] Apache CloudStack Plugin - Storage Image default provider  SUCCESS [2.068s]
[INFO] Apache CloudStack Plugin - Storage Image sample provider  SUCCESS [1.916s]
[INFO] Apache CloudStack Plugin - Storage Volume Nexenta Provider  SUCCESS [3.801s]
[INFO] Apache CloudStack Plugin - Storage Volume CloudByte Provider  SUCCESS [2.915s]
[INFO] Apache CloudStack Plugin - Storage Volume sample provider  SUCCESS [1.963s]
[INFO] Apache CloudStack Plugin - SNMP Alerts ............ SUCCESS [4.199s]
[INFO] Apache CloudStack Plugin - Syslog Alerts .......... SUCCESS [3.667s]
[INFO] Apache CloudStack Plugin - Network VXLAN .......... SUCCESS [4.673s]
[INFO] Apache CloudStack Plugin - GloboDNS ............... SUCCESS [7.550s]
[INFO] Apache CloudStack Framework - Spring Module ....... SUCCESS [5.454s]
[INFO] Apache CloudStack Secondary Storage Controller .... SUCCESS [2.525s]
[INFO] Apache CloudStack Console Proxy - RDP Client ...... SUCCESS [7.144s]
[INFO] Apache CloudStack Console Proxy ................... SUCCESS [0.232s]
[INFO] Apache CloudStack Console Proxy - Server .......... SUCCESS [4.220s]
[INFO] Apache CloudStack System VM ....................... SUCCESS [0.735s]
[INFO] Apache CloudStack Client UI ....................... FAILURE [0.325s]
[INFO] Apache CloudStack Framework - QuickCloud .......... SKIPPED
[INFO] Apache CloudStack AWS API Bridge .................. SKIPPED
[INFO] ------------------------------------------------------------------------
[INFO] BUILD FAILURE
[INFO] ------------------------------------------------------------------------
[INFO] Total time: 7:17.590s
[INFO] Finished at: Fri Feb 27 11:47:15 CET 2015
[INFO] Final Memory: 82M/403M
[INFO] ------------------------------------------------------------------------
[ERROR] Failed to execute goal on project cloud-client-ui: Could not resolve dependencies
for project org.apache.cloudstack:cloud-client-ui:war:4.6.0-SNAPSHOT: Failure to find org.apache.cloudstack:cloud-plugin-user-authenticator-pbkdf2:jar:4.6.0-SNAPSHOT
in http://repository.apache.org/snapshots was cached in the local repository, resolution will
not be reattempted until the update interval of apache.snapshots has elapsed or updates are
forced -> [Help 1]
[ERROR] 
[ERROR] To see the full stack trace of the errors, re-run Maven with the -e switch.
[ERROR] Re-run Maven using the -X switch to enable full debug logging.
[ERROR] 
[ERROR] For more information about the errors and possible solutions, please read the following
articles:
[ERROR] [Help 1] http://cwiki.apache.org/confluence/display/MAVEN/DependencyResolutionException
[ERROR] 
[ERROR] After correcting the problems, you can resume the build with the command
[ERROR]   mvn <goals> -rf :cloud-client-ui
Build step 'Invoke top-level Maven targets' marked build as failure
Recording test results

Mime
View raw message