cloudstack-dev mailing list archives

Site index · List index
Message view « Date » · « Thread »
Top « Date » · « Thread »
From jenk...@cloudstack.org
Subject Build failed in Jenkins: build-master-simulator #1668
Date Sat, 07 Feb 2015 20:03:53 GMT
See <http://jenkins.buildacloud.org/job/build-master-simulator/1668/>

------------------------------------------
[...truncated 1266 lines...]
[INFO] No sources to compile
[INFO] 
[INFO] --- maven-surefire-plugin:2.18.1:test (default-test) @ cloud-engine-components-api
---
[INFO]                                                                         
[INFO] ------------------------------------------------------------------------
[INFO] Building Apache CloudStack Server 4.6.0-SNAPSHOT
[INFO] ------------------------------------------------------------------------
[INFO] 
[INFO] --- maven-clean-plugin:2.5:clean (default-clean) @ cloud-server ---
[INFO] Deleting <http://jenkins.buildacloud.org/job/build-master-simulator/ws/server/target>
(includes = [**/*], excludes = [])
[INFO] Deleting <http://jenkins.buildacloud.org/job/build-master-simulator/ws/server>
(includes = [target, dist], excludes = [])
[INFO] 
[INFO] --- maven-checkstyle-plugin:2.11:check (cloudstack-checkstyle) @ cloud-server ---
[INFO] Starting audit...
Audit done.

[INFO] 
[INFO] --- maven-remote-resources-plugin:1.3:process (default) @ cloud-server ---
[INFO] 
[INFO] --- maven-antrun-plugin:1.8:run (generate-resource) @ cloud-server ---
[INFO] Executing tasks

main:
     [copy] Copying 3 files to <http://jenkins.buildacloud.org/job/build-master-simulator/ws/server/target/conf>
     [copy] Copying 1 file to <http://jenkins.buildacloud.org/job/build-master-simulator/ws/server/target/conf>
[INFO] Executed tasks
[INFO] 
[INFO] --- maven-resources-plugin:2.5:resources (default-resources) @ cloud-server ---
[debug] execute contextualize
[INFO] Using 'UTF-8' encoding to copy filtered resources.
[INFO] Copying 30 resources
[INFO] Copying 3 resources
[INFO] 
[INFO] --- maven-compiler-plugin:3.2:compile (default-compile) @ cloud-server ---
[INFO] Changes detected - recompiling the module!
[INFO] Compiling 403 source files to <http://jenkins.buildacloud.org/job/build-master-simulator/ws/server/target/classes>
[INFO] 
[INFO] --- maven-resources-plugin:2.5:testResources (default-testResources) @ cloud-server
---
[debug] execute contextualize
[INFO] Using 'UTF-8' encoding to copy filtered resources.
[INFO] Copying 33 resources
[INFO] Copying 3 resources
[INFO] 
[INFO] --- maven-compiler-plugin:3.2:testCompile (default-testCompile) @ cloud-server ---
[INFO] Changes detected - recompiling the module!
[INFO] Compiling 99 source files to <http://jenkins.buildacloud.org/job/build-master-simulator/ws/server/target/test-classes>
[INFO] 
[INFO] --- maven-surefire-plugin:2.18.1:test (default-test) @ cloud-server ---
[INFO] Surefire report directory: <http://jenkins.buildacloud.org/job/build-master-simulator/ws/server/target/surefire-reports>

-------------------------------------------------------
 T E S T S
-------------------------------------------------------
log4j:WARN No appenders could be found for logger (org.springframework.test.context.junit4.SpringJUnit4ClassRunner).
log4j:WARN Please initialize the log4j system properly.
log4j:WARN See http://logging.apache.org/log4j/1.2/faq.html#noconfig for more info.
Running com.cloud.event.EventControlsUnitTest
Tests run: 1, Failures: 0, Errors: 0, Skipped: 0, Time elapsed: 0.504 sec - in com.cloud.event.EventControlsUnitTest
Running com.cloud.keystore.KeystoreTest
org.apache.cloudstack.api.response.UserVmResponse/null/{"id":"3","securitygroup":[],"nic":[],"tags":[],"affinitygroup":[]}
org.apache.cloudstack.api.response.AlertResponse/null/{"id":"100","description":"Hello"}
Tests run: 1, Failures: 0, Errors: 0, Skipped: 0, Time elapsed: 0.164 sec - in com.cloud.keystore.KeystoreTest
Running com.cloud.alert.AlertControlsUnitTest
Tests run: 1, Failures: 0, Errors: 0, Skipped: 0, Time elapsed: 0.038 sec - in com.cloud.alert.AlertControlsUnitTest
Running com.cloud.capacity.CapacityManagerTest
Tests run: 1, Failures: 0, Errors: 0, Skipped: 0, Time elapsed: 0.216 sec - in com.cloud.capacity.CapacityManagerTest
Running com.cloud.servlet.StaticResourceServletTest
Tests run: 12, Failures: 0, Errors: 0, Skipped: 0, Time elapsed: 0.173 sec - in com.cloud.servlet.StaticResourceServletTest
Running com.cloud.servlet.ConsoleProxyServletTest
Tests run: 1, Failures: 0, Errors: 0, Skipped: 0, Time elapsed: 0.003 sec - in com.cloud.servlet.ConsoleProxyServletTest
Running com.cloud.resourcelimit.ResourceLimitManagerImplTest
Tests run: 1, Failures: 0, Errors: 0, Skipped: 0, Time elapsed: 0.002 sec - in com.cloud.resourcelimit.ResourceLimitManagerImplTest
Running com.cloud.network.firewall.FirewallManagerTest
Tests run: 1, Failures: 0, Errors: 0, Skipped: 1, Time elapsed: 0.002 sec - in com.cloud.network.firewall.FirewallManagerTest
Running com.cloud.network.ExternalLoadBalancerDeviceManagerImplTest
Tests run: 2, Failures: 0, Errors: 0, Skipped: 0, Time elapsed: 1.025 sec - in com.cloud.network.ExternalLoadBalancerDeviceManagerImplTest
Running com.cloud.network.element.VirtualRouterElementTest
Tests run: 2, Failures: 0, Errors: 0, Skipped: 2, Time elapsed: 0.007 sec - in com.cloud.network.element.VirtualRouterElementTest
Running com.cloud.network.UpdatePhysicalNetworkTest
Tests run: 1, Failures: 0, Errors: 0, Skipped: 0, Time elapsed: 0.355 sec - in com.cloud.network.UpdatePhysicalNetworkTest
Running com.cloud.network.CreatePrivateNetworkTest
Tests run: 1, Failures: 0, Errors: 0, Skipped: 0, Time elapsed: 0.107 sec - in com.cloud.network.CreatePrivateNetworkTest
Running com.cloud.network.NetworkModelTest
Tests run: 1, Failures: 0, Errors: 0, Skipped: 0, Time elapsed: 0.113 sec - in com.cloud.network.NetworkModelTest
Running com.cloud.network.router.NetworkHelperImplTest
Tests run: 4, Failures: 0, Errors: 0, Skipped: 0, Time elapsed: 0.181 sec - in com.cloud.network.router.NetworkHelperImplTest
Running com.cloud.network.router.RouterControlHelperTest
Tests run: 2, Failures: 0, Errors: 0, Skipped: 0, Time elapsed: 0.191 sec - in com.cloud.network.router.RouterControlHelperTest
Running com.cloud.network.router.VirtualNetworkApplianceManagerImplTest
Tests run: 2, Failures: 0, Errors: 0, Skipped: 0, Time elapsed: 0.647 sec - in com.cloud.network.router.VirtualNetworkApplianceManagerImplTest
Running com.cloud.network.security.SecurityGroupManagerImplTest
Tests run: 4, Failures: 0, Errors: 0, Skipped: 0, Time elapsed: 4.117 sec - in com.cloud.network.security.SecurityGroupManagerImplTest
Running com.cloud.network.security.SecurityGroupQueueTest
Total jobs dequeued = 10, num queued=1003 queue current size=993
Num Vms= 50 Queue size = 50
Num Vms= 20000 Queue size = 20000 time=1201 ms
Num Vms= 5000 Queue size = 5000 time=1004 ms
Num Vms= 1 Queue size = 1 time=1 ms
Num Vms= 1000000 Queue size = 1000000 time=1357 ms
Total jobs dequeued = 10, num queued=1010 queue current size=1000
Total jobs dequeued = 1, num queued=1001 queue current size=1000
Total jobs dequeued = 10, num queued=1000 queue current size=990
Total jobs dequeued = 10, num queued=10 queue current size=0
Tests run: 4, Failures: 0, Errors: 1, Skipped: 0, Time elapsed: 4.263 sec <<< FAILURE!
- in com.cloud.network.security.SecurityGroupQueueTest
testNumJobsEqToNumVms3(com.cloud.network.security.SecurityGroupQueueTest)  Time elapsed: 4.091
sec  <<< ERROR!
java.lang.OutOfMemoryError: unable to create new native thread
	at java.lang.Thread.start0(Native Method)
	at java.lang.Thread.start(Thread.java:693)
	at com.cloud.network.security.SecurityGroupQueueTest.testNumJobsEqToNumVms2(SecurityGroupQueueTest.java:124)
	at com.cloud.network.security.SecurityGroupQueueTest.testNumJobsEqToNumVms3(SecurityGroupQueueTest.java:143)

Running com.cloud.network.vpc.VpcManagerImplTest
Tests run: 1, Failures: 0, Errors: 0, Skipped: 0, Time elapsed: 0.004 sec - in com.cloud.network.vpc.VpcManagerImplTest
Running com.cloud.network.DedicateGuestVlanRangesTest
Tests run: 2, Failures: 0, Errors: 0, Skipped: 0, Time elapsed: 0.033 sec - in com.cloud.network.DedicateGuestVlanRangesTest
Running com.cloud.network.lb.AssignLoadBalancerTest
Tests run: 4, Failures: 0, Errors: 0, Skipped: 0, Time elapsed: 0.084 sec - in com.cloud.network.lb.AssignLoadBalancerTest
Running com.cloud.network.lb.UpdateLoadBalancerTest
Tests run: 2, Failures: 0, Errors: 0, Skipped: 0, Time elapsed: 0.052 sec - in com.cloud.network.lb.UpdateLoadBalancerTest
Running com.cloud.network.dao.NetworkDaoTest
Tests run: 2, Failures: 0, Errors: 0, Skipped: 0, Time elapsed: 0.002 sec - in com.cloud.network.dao.NetworkDaoTest
Running com.cloud.vm.FirstFitPlannerTest
Tests run: 1, Failures: 0, Errors: 0, Skipped: 0, Time elapsed: 0.464 sec - in com.cloud.vm.FirstFitPlannerTest
Running com.cloud.vm.DeploymentPlanningManagerImplTest
Tests run: 3, Failures: 0, Errors: 0, Skipped: 0, Time elapsed: 0.675 sec - in com.cloud.vm.DeploymentPlanningManagerImplTest
Running com.cloud.vm.snapshot.VMSnapshotManagerTest
Tests run: 7, Failures: 0, Errors: 0, Skipped: 0, Time elapsed: 0.15 sec - in com.cloud.vm.snapshot.VMSnapshotManagerTest
Running com.cloud.vm.UserVmManagerTest
Tests run: 9, Failures: 0, Errors: 0, Skipped: 0, Time elapsed: 0.205 sec - in com.cloud.vm.UserVmManagerTest
Running com.cloud.configuration.ValidateIpRangeTest
Tests run: 3, Failures: 0, Errors: 0, Skipped: 0, Time elapsed: 0.011 sec - in com.cloud.configuration.ValidateIpRangeTest
Running com.cloud.configuration.ConfigurationManagerTest
Tests run: 9, Failures: 0, Errors: 0, Skipped: 0, Time elapsed: 0.045 sec - in com.cloud.configuration.ConfigurationManagerTest
Running com.cloud.server.ConfigurationServerImplTest
Tests run: 4, Failures: 0, Errors: 0, Skipped: 0, Time elapsed: 0.005 sec - in com.cloud.server.ConfigurationServerImplTest
Running com.cloud.template.TemplateManagerImplTest
Tests run: 1, Failures: 0, Errors: 0, Skipped: 0, Time elapsed: 0.006 sec - in com.cloud.template.TemplateManagerImplTest
Running com.cloud.vpc.Site2SiteVpnTest
Tests run: 1, Failures: 0, Errors: 0, Skipped: 0, Time elapsed: 2.48 sec - in com.cloud.vpc.Site2SiteVpnTest
Running com.cloud.vpc.NetworkACLServiceTest
Tests run: 5, Failures: 0, Errors: 0, Skipped: 0, Time elapsed: 0.172 sec - in com.cloud.vpc.NetworkACLServiceTest
Running com.cloud.vpc.NetworkACLManagerTest
Tests run: 6, Failures: 0, Errors: 0, Skipped: 0, Time elapsed: 0.166 sec - in com.cloud.vpc.NetworkACLManagerTest
Running com.cloud.storage.VolumeApiServiceImplTest
Tests run: 11, Failures: 0, Errors: 0, Skipped: 0, Time elapsed: 0.12 sec - in com.cloud.storage.VolumeApiServiceImplTest
Running com.cloud.user.AccountManagerImplTest
Tests run: 5, Failures: 0, Errors: 0, Skipped: 0, Time elapsed: 0.133 sec - in com.cloud.user.AccountManagerImplTest
Running com.cloud.api.ApiServletTest
Tests run: 13, Failures: 0, Errors: 0, Skipped: 0, Time elapsed: 0.062 sec - in com.cloud.api.ApiServletTest
Running com.cloud.api.ApiResponseHelperTest
Tests run: 1, Failures: 0, Errors: 0, Skipped: 0, Time elapsed: 0.014 sec - in com.cloud.api.ApiResponseHelperTest
Running com.cloud.api.dispatch.ParamGenericValidationWorkerTest
Tests run: 4, Failures: 0, Errors: 0, Skipped: 0, Time elapsed: 0.01 sec - in com.cloud.api.dispatch.ParamGenericValidationWorkerTest
Running com.cloud.api.dispatch.DispatchChainFactoryTest
Tests run: 1, Failures: 0, Errors: 0, Skipped: 0, Time elapsed: 0.002 sec - in com.cloud.api.dispatch.DispatchChainFactoryTest
Running com.cloud.api.dispatch.CommandCreationWorkerTest
Tests run: 1, Failures: 0, Errors: 0, Skipped: 0, Time elapsed: 0.011 sec - in com.cloud.api.dispatch.CommandCreationWorkerTest
Running com.cloud.api.dispatch.SpecificCmdValidationWorkerTest
Tests run: 1, Failures: 0, Errors: 0, Skipped: 0, Time elapsed: 0.003 sec - in com.cloud.api.dispatch.SpecificCmdValidationWorkerTest
Running com.cloud.api.dispatch.ParamProcessWorkerTest
Tests run: 1, Failures: 0, Errors: 0, Skipped: 0, Time elapsed: 0.003 sec - in com.cloud.api.dispatch.ParamProcessWorkerTest
Running com.cloud.ha.KVMFencerTest
Tests run: 6, Failures: 0, Errors: 0, Skipped: 0, Time elapsed: 0.013 sec - in com.cloud.ha.KVMFencerTest
Running com.cloud.ha.HighAvailabilityManagerImplTest
Tests run: 1, Failures: 0, Errors: 0, Skipped: 0, Time elapsed: 0.028 sec - in com.cloud.ha.HighAvailabilityManagerImplTest
Running org.cloud.network.router.deployment.VpcRouterDeploymentDefinitionTest
Tests run: 15, Failures: 0, Errors: 0, Skipped: 0, Time elapsed: 0.126 sec - in org.cloud.network.router.deployment.VpcRouterDeploymentDefinitionTest
Running org.cloud.network.router.deployment.RouterDeploymentDefinitionTest
Tests run: 43, Failures: 0, Errors: 0, Skipped: 0, Time elapsed: 0.263 sec - in org.cloud.network.router.deployment.RouterDeploymentDefinitionTest
Running org.apache.cloudstack.networkoffering.CreateNetworkOfferingTest
Tests run: 10, Failures: 0, Errors: 0, Skipped: 0, Time elapsed: 3.028 sec - in org.apache.cloudstack.networkoffering.CreateNetworkOfferingTest
Running org.apache.cloudstack.privategw.AclOnPrivateGwTest
Tests run: 2, Failures: 0, Errors: 0, Skipped: 0, Time elapsed: 0.148 sec - in org.apache.cloudstack.privategw.AclOnPrivateGwTest
Running org.apache.cloudstack.service.ServiceOfferingVOTest
Tests run: 2, Failures: 0, Errors: 0, Skipped: 0, Time elapsed: 0.001 sec - in org.apache.cloudstack.service.ServiceOfferingVOTest
Running org.apache.cloudstack.affinity.AffinityApiUnitTest
Tests run: 7, Failures: 0, Errors: 0, Skipped: 0, Time elapsed: 0.15 sec - in org.apache.cloudstack.affinity.AffinityApiUnitTest
Running org.apache.cloudstack.network.lb.ApplicationLoadBalancerTest
Tests run: 11, Failures: 0, Errors: 0, Skipped: 0, Time elapsed: 0.357 sec - in org.apache.cloudstack.network.lb.ApplicationLoadBalancerTest
Running org.apache.cloudstack.network.lb.CertServiceTest
Tests run: 14, Failures: 0, Errors: 0, Skipped: 0, Time elapsed: 0.349 sec - in org.apache.cloudstack.network.lb.CertServiceTest
Running org.apache.cloudstack.region.gslb.GlobalLoadBalancingRulesServiceImplTest
Tests run: 4, Failures: 0, Errors: 0, Skipped: 0, Time elapsed: 0.028 sec - in org.apache.cloudstack.region.gslb.GlobalLoadBalancingRulesServiceImplTest
Running org.apache.cloudstack.region.RegionManagerTest
Tests run: 2, Failures: 0, Errors: 0, Skipped: 0, Time elapsed: 0 sec - in org.apache.cloudstack.region.RegionManagerTest

Results :

Tests in error: 
  SecurityGroupQueueTest.testNumJobsEqToNumVms3:143->testNumJobsEqToNumVms2:124 ยป OutOfMemory

Tests run: 257, Failures: 0, Errors: 1, Skipped: 3

[INFO] ------------------------------------------------------------------------
[INFO] Reactor Summary:
[INFO] 
[INFO] Apache CloudStack Developer Tools - Checkstyle Configuration  SUCCESS [0.744s]
[INFO] Apache CloudStack ................................. SUCCESS [0.593s]
[INFO] Apache CloudStack Maven Conventions Parent ........ SUCCESS [1.091s]
[INFO] Apache CloudStack Framework - Managed Context ..... SUCCESS [3.016s]
[INFO] Apache CloudStack Utils ........................... SUCCESS [14.419s]
[INFO] Apache CloudStack Framework ....................... SUCCESS [0.041s]
[INFO] Apache CloudStack Framework - Event Notification .. SUCCESS [6.283s]
[INFO] Apache CloudStack Framework - Configuration ....... SUCCESS [4.059s]
[INFO] Apache CloudStack API ............................. SUCCESS [11.425s]
[INFO] Apache CloudStack Framework - REST ................ SUCCESS [2.448s]
[INFO] Apache CloudStack Framework - IPC ................. SUCCESS [4.078s]
[INFO] Apache CloudStack Cloud Engine .................... SUCCESS [0.031s]
[INFO] Apache CloudStack Cloud Engine API ................ SUCCESS [4.365s]
[INFO] Apache CloudStack Framework - Security ............ SUCCESS [2.036s]
[INFO] Apache CloudStack Core ............................ SUCCESS [8.969s]
[INFO] Apache CloudStack Agents .......................... SUCCESS [5.037s]
[INFO] Apache CloudStack Framework - Clustering .......... SUCCESS [2.716s]
[INFO] Apache CloudStack Framework - Event Notification .. SUCCESS [1.591s]
[INFO] Apache CloudStack Cloud Engine Schema Component ... SUCCESS [11.704s]
[INFO] Apache CloudStack Framework - Jobs ................ SUCCESS [4.913s]
[INFO] Apache CloudStack Cloud Engine Internal Components API  SUCCESS [2.898s]
[INFO] Apache CloudStack Server .......................... FAILURE [44.201s]
[INFO] Apache CloudStack Cloud Services .................. SKIPPED
[INFO] Apache CloudStack Secondary Storage ............... SKIPPED
[INFO] Apache CloudStack Secondary Storage Service ....... SKIPPED
[INFO] Apache CloudStack Engine Storage Component ........ SKIPPED
[INFO] Apache CloudStack Engine Storage Volume Component . SKIPPED
[INFO] Apache CloudStack Engine Storage Image Component .. SKIPPED
[INFO] Apache CloudStack Engine Storage Snapshot Component  SKIPPED
[INFO] Apache CloudStack Plugin POM ...................... SKIPPED
[INFO] Apache CloudStack Plugin - Hypervisor Simulator ... SKIPPED
[INFO] ------------------------------------------------------------------------
[INFO] BUILD FAILURE
[INFO] ------------------------------------------------------------------------
[INFO] Total time: 2:18.450s
[INFO] Finished at: Sat Feb 07 21:03:54 CET 2015
[INFO] Final Memory: 58M/376M
[INFO] ------------------------------------------------------------------------
[ERROR] Failed to execute goal org.apache.maven.plugins:maven-surefire-plugin:2.18.1:test
(default-test) on project cloud-server: There are test failures.
[ERROR] 
[ERROR] Please refer to <http://jenkins.buildacloud.org/job/build-master-simulator/ws/server/target/surefire-reports>
for the individual test results.
[ERROR] -> [Help 1]
[ERROR] 
[ERROR] To see the full stack trace of the errors, re-run Maven with the -e switch.
[ERROR] Re-run Maven using the -X switch to enable full debug logging.
[ERROR] 
[ERROR] For more information about the errors and possible solutions, please read the following
articles:
[ERROR] [Help 1] http://cwiki.apache.org/confluence/display/MAVEN/MojoFailureException
[ERROR] 
[ERROR] After correcting the problems, you can resume the build with the command
[ERROR]   mvn <goals> -rf :cloud-server
Build step 'Invoke top-level Maven targets' marked build as failure
Recording test results

Mime
View raw message