cloudstack-dev mailing list archives

Site index · List index
Message view « Date » · « Thread »
Top « Date » · « Thread »
From jenk...@cloudstack.org
Subject Build failed in Jenkins: build-4.5 #312
Date Mon, 02 Feb 2015 10:30:29 GMT
See <http://jenkins.buildacloud.org/job/build-4.5/312/changes>

Changes:

[Rohit Yadav] Fixed few coverity patches

[Rohit Yadav] CLOUDSTACK-8127. VM name not displayed after attaching data disk to a VM.

[Rohit Yadav] BUG-ID: CLOUDSTACK-7102. Volume migration fails with 'VM i-2-3-VM does not exist
in VMware datacenter' expection.

[Rohit Yadav] CLOUDSTACK-7803 Storage live migration of instance may not happen if instance
has ISO attached.

[Rohit Yadav] CLOUDSTACK-8110. VM name in vCenter should be VM's DisplayName if global config
'vm.instancename.flag' is set.

[Rohit Yadav] CLOUDSTACK-8112. CS allows creation of VM's with the same Display name when
vm.instancename.flag is set to true.

[Rohit Yadav] CLOUDSTACK-8113. VM migration fails with "Message: No such disk device: " error.

[Rohit Yadav] CLOUDSTACK-8118. Root volume migration fails with 'No such disk device' in case
of vCenter 5.5 setup.

[Rohit Yadav] CLOUDSTACK-8126. Cold Migration of VM is not working as expected. In case a
VM is cold migrated across clusters then VM fails to start.

[Rohit Yadav] CLOUDSTACK-8129. Cold migration of VM across VMware DCs leaves the VM behind
in the source host.

[Rohit Yadav] CLOUDSTACK-8122. Handle NPE thrown during migration failures.

[Rohit Yadav] CLOUDSTACK-8119. Propagate error message to UI for attach/detach volume failure
operations.

[Rohit Yadav] CLOUDSTACK-8114. Ensure VM stop and then start updates the volume path correctly
in the DB.

[Rohit Yadav] Network offering usage event should be logged for UserVms only

[Rohit Yadav] CLOUDSTACK-8112. CS allows creation of VM's with the same Display name when
vm.instancename.flag is set to true.

[Rohit Yadav] CLOUDSTACK-6924. To attach a volume if a volume needs to be moved to another
storage

[Rohit Yadav] CLOUDSTACK-5485. Cannot process more than 5 concurrent snapshots.

[Rohit Yadav] CLOUDSTACK-8111. NFS secondary storage repetitively mounted on CS server with
ESXi hypervisors.

[Rohit Yadav] don't need to check if pv driver is updated, old pv driver should work

[Rohit Yadav] fixed NPE on calculating vm snasphot volume size

------------------------------------------
[...truncated 1289 lines...]
[INFO] --- maven-resources-plugin:2.5:resources (default-resources) @ cloud-engine-api ---
[debug] execute contextualize
[INFO] Using 'UTF-8' encoding to copy filtered resources.
[INFO] Copying 1 resource
[INFO] Copying 3 resources
[INFO] 
[INFO] --- maven-compiler-plugin:2.5.1:compile (default-compile) @ cloud-engine-api ---
[INFO] Compiling 107 source files to <http://jenkins.buildacloud.org/job/build-4.5/ws/engine/api/target/classes>
[INFO] 
[INFO] --- maven-resources-plugin:2.5:testResources (default-testResources) @ cloud-framework-security
---
[debug] execute contextualize
[INFO] Using 'UTF-8' encoding to copy filtered resources.
[INFO] skip non existing resourceDirectory <http://jenkins.buildacloud.org/job/build-4.5/ws/framework/security/test/resources>
[INFO] Copying 3 resources
[INFO] 
[INFO] --- maven-compiler-plugin:2.5.1:testCompile (default-testCompile) @ cloud-framework-security
---
[INFO] No sources to compile
[INFO] 
[INFO] --- maven-surefire-plugin:2.12:test (default-test) @ cloud-framework-security ---
[INFO] Surefire report directory: <http://jenkins.buildacloud.org/job/build-4.5/ws/framework/security/target/surefire-reports>

-------------------------------------------------------
 T E S T S
-------------------------------------------------------

Results :

Tests run: 0, Failures: 0, Errors: 0, Skipped: 0

[INFO] 
[INFO] --- maven-resources-plugin:2.5:testResources (default-testResources) @ cloud-engine-api
---
[debug] execute contextualize
[INFO] Using 'UTF-8' encoding to copy filtered resources.
[INFO] skip non existing resourceDirectory <http://jenkins.buildacloud.org/job/build-4.5/ws/engine/api/test/resources>
[INFO] Copying 3 resources
[INFO] 
[INFO] --- maven-compiler-plugin:2.5.1:testCompile (default-testCompile) @ cloud-engine-api
---
[INFO] Compiling 2 source files to <http://jenkins.buildacloud.org/job/build-4.5/ws/engine/api/target/test-classes>
[INFO] 
[INFO] --- maven-surefire-plugin:2.12:test (default-test) @ cloud-engine-api ---
[INFO] Surefire report directory: <http://jenkins.buildacloud.org/job/build-4.5/ws/engine/api/target/surefire-reports>

-------------------------------------------------------
 T E S T S
-------------------------------------------------------
Running org.apache.cloudstack.engine.subsystem.api.storage.ScopeTest
Tests run: 3, Failures: 0, Errors: 0, Skipped: 0, Time elapsed: 0.312 sec
Running org.apache.cloudstack.engine.subsystem.api.storage.type.VolumeTypeHelperTest
Tests run: 8, Failures: 0, Errors: 0, Skipped: 0, Time elapsed: 0.045 sec

Results :

Tests run: 11, Failures: 0, Errors: 0, Skipped: 0

[INFO]                                                                         
[INFO]                                                                         
[INFO] ------------------------------------------------------------------------
[INFO] Building Apache CloudStack Cloud Engine Schema Component 4.5.0-SNAPSHOT
[INFO] ------------------------------------------------------------------------
[INFO] ------------------------------------------------------------------------
[INFO] Building Apache CloudStack Core 4.5.0-SNAPSHOT
[INFO] ------------------------------------------------------------------------
[INFO] 
[INFO] --- maven-clean-plugin:2.5:clean (default-clean) @ cloud-engine-schema ---
[INFO] 
[INFO] --- maven-clean-plugin:2.5:clean (default-clean) @ cloud-core ---
[INFO] Deleting <http://jenkins.buildacloud.org/job/build-4.5/ws/core/target> (includes
= [**/*], excludes = [])
[INFO] Deleting <http://jenkins.buildacloud.org/job/build-4.5/ws/engine/schema/target>
(includes = [**/*], excludes = [])
[INFO] Deleting <http://jenkins.buildacloud.org/job/build-4.5/ws/core> (includes = [target,
dist], excludes = [])
[INFO] 
[INFO] --- maven-checkstyle-plugin:2.11:check (cloudstack-checkstyle) @ cloud-core ---
[INFO] Deleting <http://jenkins.buildacloud.org/job/build-4.5/ws/engine/schema> (includes
= [target, dist], excludes = [])
[INFO] 
[INFO] --- maven-checkstyle-plugin:2.11:check (cloudstack-checkstyle) @ cloud-engine-schema
---
[INFO] Starting audit...
Audit done.

[INFO] 
[INFO] --- maven-remote-resources-plugin:1.3:process (default) @ cloud-core ---
[INFO] 
[INFO] --- maven-resources-plugin:2.5:resources (default-resources) @ cloud-core ---
[debug] execute contextualize
[INFO] Using 'UTF-8' encoding to copy filtered resources.
[INFO] Copying 26 resources
[INFO] Copying 3 resources
[INFO] 
[INFO] --- maven-compiler-plugin:2.5.1:compile (default-compile) @ cloud-core ---
[INFO] Compiling 331 source files to <http://jenkins.buildacloud.org/job/build-4.5/ws/core/target/classes>
[INFO] Starting audit...
Audit done.

[INFO] 
[INFO] --- maven-remote-resources-plugin:1.3:process (default) @ cloud-engine-schema ---
[INFO] 
[INFO] --- maven-resources-plugin:2.5:resources (default-resources) @ cloud-engine-schema
---
[debug] execute contextualize
[INFO] Using 'UTF-8' encoding to copy filtered resources.
[INFO] Copying 2 resources
[INFO] Copying 3 resources
[INFO] 
[INFO] --- maven-compiler-plugin:2.5.1:compile (default-compile) @ cloud-engine-schema ---
[INFO] Compiling 662 source files to <http://jenkins.buildacloud.org/job/build-4.5/ws/engine/schema/target/classes>
[INFO] 
[INFO] --- license-maven-plugin:2.5:check (cloudstack-checklicence) @ cloud-core ---
[INFO] Checking licenses...
[INFO] 
[INFO] --- maven-resources-plugin:2.5:testResources (default-testResources) @ cloud-core ---
[debug] execute contextualize
[INFO] Using 'UTF-8' encoding to copy filtered resources.
[INFO] skip non existing resourceDirectory <http://jenkins.buildacloud.org/job/build-4.5/ws/core/test/resources>
[INFO] Copying 3 resources
[INFO] 
[INFO] --- maven-compiler-plugin:2.5.1:testCompile (default-testCompile) @ cloud-core ---
[INFO] Compiling 21 source files to <http://jenkins.buildacloud.org/job/build-4.5/ws/core/target/test-classes>
[INFO] -------------------------------------------------------------
[ERROR] COMPILATION ERROR : 
[INFO] -------------------------------------------------------------
[ERROR] Failure executing javac,  but could not parse the error:
/bin/sh: line 1: 39445 Aborted                 /usr/lib/jvm/java-1.7.0-openjdk-1.7.0.75-2.5.4.2.el7_0.x86_64/jre/../bin/javac
@/tmp/org.codehaus.plexus.compiler.javac.JavacCompiler5303604225883000971arguments -J-Xmx512m
-J-Xms128m

[INFO] 1 error
[INFO] -------------------------------------------------------------
[INFO] ------------------------------------------------------------------------
[INFO] Reactor Summary:
[INFO] 
[INFO] Apache CloudStack Developer Tools - Checkstyle Configuration  SUCCESS [4.207s]
[INFO] Apache CloudStack ................................. SUCCESS [3.569s]
[INFO] Apache CloudStack Maven Conventions Parent ........ SUCCESS [8.115s]
[INFO] Apache CloudStack Framework - Managed Context ..... SUCCESS [17.294s]
[INFO] Apache CloudStack Utils ........................... SUCCESS [40.293s]
[INFO] Apache CloudStack Framework ....................... SUCCESS [1.058s]
[INFO] Apache CloudStack Framework - Event Notification .. SUCCESS [1:05.281s]
[INFO] Apache CloudStack Framework - Configuration ....... SUCCESS [27.122s]
[INFO] Apache CloudStack API ............................. SUCCESS [52.457s]
[INFO] Apache CloudStack Framework - REST ................ SUCCESS [24.166s]
[INFO] Apache CloudStack Framework - IPC ................. SUCCESS [17.611s]
[INFO] Apache CloudStack Cloud Engine .................... SUCCESS [1.008s]
[INFO] Apache CloudStack Cloud Engine API ................ SUCCESS [19.181s]
[INFO] Apache CloudStack Framework - Security ............ SUCCESS [9.481s]
[INFO] Apache CloudStack Core ............................ SKIPPED
[INFO] Apache CloudStack Agents .......................... SKIPPED
[INFO] Apache CloudStack Framework - Clustering .......... SUCCESS [15.693s]
[INFO] Apache CloudStack Framework - Event Notification .. SUCCESS [17.744s]
[INFO] Apache CloudStack Cloud Engine Schema Component ... FAILURE [3:32.857s]
[INFO] Apache CloudStack Framework - Jobs ................ SKIPPED
[INFO] Apache CloudStack Cloud Engine Internal Components API  SKIPPED
[INFO] Apache CloudStack Server .......................... SKIPPED
[INFO] Apache CloudStack Usage Server .................... SKIPPED
[INFO] Apache CloudStack Cloud Engine Orchestration Component  SKIPPED
[INFO] Apache CloudStack Cloud Services .................. SUCCESS [0.934s]
[INFO] Apache CloudStack Secondary Storage ............... SUCCESS [14.015s]
[INFO] Apache CloudStack Secondary Storage Service ....... SKIPPED
[INFO] Apache CloudStack Engine Storage Component ........ SKIPPED
[INFO] Apache CloudStack Engine Storage Volume Component . SKIPPED
[INFO] Apache CloudStack Engine Storage Image Component .. SKIPPED
[INFO] Apache CloudStack Engine Storage Data Motion Component  SKIPPED
[INFO] Apache CloudStack Engine Storage Cache Component .. SKIPPED
[INFO] Apache CloudStack Engine Storage Snapshot Component  SKIPPED
[INFO] Apache CloudStack Cloud Engine API ................ SKIPPED
[INFO] Apache CloudStack Cloud Engine Service ............ SKIPPED
[INFO] Apache CloudStack Plugin POM ...................... SKIPPED
[INFO] Apache CloudStack Plugin - API Rate Limit ......... SKIPPED
[INFO] Apache CloudStack Plugin - Storage Volume default provider  SKIPPED
[INFO] Apache CloudStack Plugin - Storage Volume SolidFire Provider  SKIPPED
[INFO] Apache CloudStack Plugin - API SolidFire .......... SKIPPED
[INFO] Apache CloudStack Plugin - API Discovery .......... SKIPPED
[INFO] Apache CloudStack Plugin - ACL Static Role Based .. SKIPPED
[INFO] Apache CloudStack Plugin - Host Anti-Affinity Processor  SKIPPED
[INFO] Apache CloudStack Plugin - Explicit Dedication Processor  SKIPPED
[INFO] Apache CloudStack Plugin - User Concentrated Pod Deployment Planner  SKIPPED
[INFO] Apache CloudStack Plugin - User Dispersing Deployment Planner  SKIPPED
[INFO] Apache CloudStack Plugin - Implicit Dedication Planner  SKIPPED
[INFO] Apache CloudStack Plugin - Skip Heurestics Planner  SKIPPED
[INFO] Apache CloudStack Plugin - Host Allocator Random .. SKIPPED
[INFO] Apache CloudStack Plugin - Dedicated Resources .... SKIPPED
[INFO] Apache CloudStack Plugin - Hypervisor OracleVM .... SKIPPED
[INFO] Apache CloudStack Plugin - Open vSwitch ........... SKIPPED
[INFO] Apache CloudStack Plugin - Hypervisor XenServer ... SKIPPED
[INFO] Apache CloudStack Plugin - Hypervisor KVM ......... SKIPPED
[INFO] Apache CloudStack Plugin - RabbitMQ Event Bus ..... SKIPPED
[INFO] Apache CloudStack Plugin - In Memory Event Bus .... SKIPPED
[INFO] Apache CloudStack Plugin - Hypervisor Baremetal ... SKIPPED
[INFO] Apache CloudStack Plugin - Hypervisor UCS ......... SKIPPED
[INFO] Apache CloudStack Plugin - Hypervisor Hyper-V ..... SKIPPED
[INFO] Apache CloudStack Plugin - Network Elastic Load Balancer  SKIPPED
[INFO] Apache CloudStack Plugin - Network Internal Load Balancer  SKIPPED
[INFO] Apache CloudStack Framework - Spring Life Cycle ... SUCCESS [7.413s]
[INFO] Apache CloudStack Plugin - Network Juniper Contrail  SKIPPED
[INFO] Apache CloudStack Plugin - Palo Alto .............. SKIPPED
[INFO] Apache CloudStack Plugin - Network Netscaler ...... SKIPPED
[INFO] Apache CloudStack Plugin - Network Nicira NVP ..... SKIPPED
[INFO] Apache CloudStack Plugin - BigSwitch Virtual Network Segment  SKIPPED
[INFO] Apache CloudStack Plugin - Network Brocade VCS .... SKIPPED
[INFO] Apache CloudStack Plugin - Midokura Midonet ....... SKIPPED
[INFO] Apache CloudStack Plugin - Stratosphere SSP ....... SKIPPED
[INFO] Apache CloudStack Plugin - Network Opendaylight ... SKIPPED
[INFO] Apache CloudStack Plugin - Storage Allocator Random  SKIPPED
[INFO] Apache CloudStack Plugin - User Authenticator LDAP  SKIPPED
[INFO] Apache CloudStack Plugin - User Authenticator MD5 . SKIPPED
[INFO] Apache CloudStack Plugin - User Authenticator Plain Text  SKIPPED
[INFO] Apache CloudStack Plugin - User Authenticator SAML2  SKIPPED
[INFO] Apache CloudStack Plugin - User Authenticator SHA256 Salted  SKIPPED
[INFO] Apache CloudStack Plugin - Dns Notifier Example ... SKIPPED
[INFO] Apache CloudStack Plugin - Storage Image S3 ....... SKIPPED
[INFO] Apache CloudStack Plugin - Storage Image Swift provider  SKIPPED
[INFO] Apache CloudStack Plugin - Storage Image default provider  SKIPPED
[INFO] Apache CloudStack Plugin - Storage Image sample provider  SKIPPED
[INFO] Apache CloudStack Plugin - Storage Volume Nexenta Provider  SKIPPED
[INFO] Apache CloudStack Plugin - Storage Volume CloudByte Provider  SKIPPED
[INFO] Apache CloudStack Plugin - Storage Volume sample provider  SKIPPED
[INFO] Apache CloudStack Plugin - SNMP Alerts ............ SKIPPED
[INFO] Apache CloudStack Plugin - Syslog Alerts .......... SKIPPED
[INFO] Apache CloudStack Plugin - Network VXLAN .......... SKIPPED
[INFO] Apache CloudStack Plugin - GloboDNS ............... SKIPPED
[INFO] Apache CloudStack Framework - Spring Module ....... SUCCESS [1:02.681s]
[INFO] Apache CloudStack Secondary Storage Controller .... SKIPPED
[INFO] Apache CloudStack Console Proxy - RDP Client ...... SUCCESS [1:03.743s]
[INFO] Apache CloudStack Console Proxy ................... SUCCESS [13.921s]
[INFO] Apache CloudStack Console Proxy - Server .......... SUCCESS [28.217s]
[INFO] Apache CloudStack System VM ....................... SKIPPED
[INFO] Apache CloudStack Client UI ....................... SKIPPED
[INFO] Apache CloudStack Framework - QuickCloud .......... SUCCESS [5.656s]
[INFO] Apache CloudStack AWS API Bridge .................. SKIPPED
[INFO] ------------------------------------------------------------------------
[INFO] BUILD FAILURE
[INFO] ------------------------------------------------------------------------
[INFO] Total time: 8:02.114s (Wall Clock)
[INFO] Finished at: Mon Feb 02 10:31:25 UTC 2015
[INFO] Final Memory: 48M/356M
[INFO] ------------------------------------------------------------------------
[ERROR] Failed to execute goal org.apache.maven.plugins:maven-compiler-plugin:2.5.1:compile
(default-compile) on project cloud-engine-schema: Compilation failure
[ERROR] Failure executing javac,  but could not parse the error:
[ERROR] /bin/sh: line 1: 39445 Aborted                 /usr/lib/jvm/java-1.7.0-openjdk-1.7.0.75-2.5.4.2.el7_0.x86_64/jre/../bin/javac
@/tmp/org.codehaus.plexus.compiler.javac.JavacCompiler5303604225883000971arguments -J-Xmx512m
-J-Xms128m
[ERROR] -> [Help 1]
[ERROR] Failed to execute goal org.apache.maven.plugins:maven-compiler-plugin:2.5.1:testCompile
(default-testCompile) on project cloud-core: Fatal error compiling: Unknown error trying to
execute the external compiler:
[ERROR] /bin/sh -c cd <http://jenkins.buildacloud.org/job/build-4.5/ws/core> &&
/usr/lib/jvm/java-1.7.0-openjdk-1.7.0.75-2.5.4.2.el7_0.x86_64/jre/../bin/javac @/tmp/org.codehaus.plexus.compiler.javac.JavacCompiler6033445764492581268arguments
-J-Xmx512m -J-Xms128m
[ERROR] -> [Help 2]
[ERROR] 
[ERROR] To see the full stack trace of the errors, re-run Maven with the -e switch.
[ERROR] Re-run Maven using the -X switch to enable full debug logging.
[ERROR] 
[ERROR] For more information about the errors and possible solutions, please read the following
articles:
[ERROR] [Help 1] http://cwiki.apache.org/confluence/display/MAVEN/MojoFailureException
[ERROR] [Help 2] http://cwiki.apache.org/confluence/display/MAVEN/MojoExecutionException
[ERROR] 
[ERROR] After correcting the problems, you can resume the build with the command
[ERROR]   mvn <goals> -rf :cloud-engine-schema
Build step 'Invoke top-level Maven targets' marked build as failure
Recording test results

Mime
View raw message