cloudstack-dev mailing list archives: January 2015

Site index · List index
Message list1 · 2 · 3 · 4 · 5 · 6 · 7 · 8 · Next »Thread · Author · Date
jenk...@cloudstack.org Build failed in Jenkins: build-4.5 #257 Thu, 01 Jan, 01:05
Anshul Gangwar RE: [Question] Creating a volume from a snapshot Thu, 01 Jan, 07:50
Mohamed Infaz Re: Unable to start VM due to concurrent operation Thu, 01 Jan, 08:33
prapul cool Re: Unable to start VM due to concurrent operation Thu, 01 Jan, 09:55
Mohamed Infaz Re: Unable to start VM due to concurrent operation Thu, 01 Jan, 15:05
Ian Duffy [Question] development embedded jetty vs deployment on system install of tomcat Fri, 02 Jan, 01:59
Abhinandan Prateek Re: Unable to start VM due to concurrent operation Fri, 02 Jan, 02:38
Leo Simons Re: [Question] development embedded jetty vs deployment on system install of tomcat Fri, 02 Jan, 07:36
Daan Hoogland [ACS44]release 4.4.3 Fri, 02 Jan, 09:12
Rohit Yadav Re: [VOTE] Release Apache CloudStack CloudMonkey 5.3.1 Fri, 02 Jan, 11:13
Mohamed Infaz Re: Unable to start VM due to concurrent operation Fri, 02 Jan, 12:03
Somesh Naidu RE: Unable to start VM due to concurrent operation Fri, 02 Jan, 15:28
Mohamed Infaz Re: Unable to start VM due to concurrent operation Fri, 02 Jan, 15:34
Mohamed Infaz Re: Unable to start VM due to concurrent operation Fri, 02 Jan, 16:50
Mike Tutkowski Re: [Question] Creating a volume from a snapshot Fri, 02 Jan, 17:41
David Nalley Re: [VOTE] Release Apache CloudStack CloudMonkey 5.3.1 Fri, 02 Jan, 18:55
jenk...@cloudstack.org Build failed in Jenkins: build-master #2124 Fri, 02 Jan, 19:27
jenk...@cloudstack.org Build failed in Jenkins: build-4.5 #258 Fri, 02 Jan, 19:44
jenk...@cloudstack.org Build failed in Jenkins: build-master #2125 Fri, 02 Jan, 19:47
jenk...@cloudstack.org Build failed in Jenkins: simulator-singlerun #857 Fri, 02 Jan, 20:31
jenk...@cloudstack.org Build failed in Jenkins: simulator-singlerun #858 Fri, 02 Jan, 21:33
Rohit Yadav Re: [VOTE] Release Apache CloudStack CloudMonkey 5.3.1 Fri, 02 Jan, 21:36
jenk...@cloudstack.org Build failed in Jenkins: build-4.5 #259 Fri, 02 Jan, 22:14
jenk...@cloudstack.org Build failed in Jenkins: build-master #2126 Fri, 02 Jan, 22:17
jenk...@cloudstack.org Build failed in Jenkins: simulator-singlerun #859 Fri, 02 Jan, 23:33
jenk...@cloudstack.org Build failed in Jenkins: simulator-singlerun #860 Sat, 03 Jan, 00:34
Sebastien Goasguen Re: [VOTE] Release Apache CloudStack CloudMonkey 5.3.1 Sat, 03 Jan, 09:21
Daan Hoogland Re: [VOTE] Release Apache CloudStack CloudMonkey 5.3.1 Sat, 03 Jan, 09:49
Mohamed Infaz Unable to Create An Instance Sat, 03 Jan, 13:44
Mohamed Infaz Re: Unable to Create An Instance Sat, 03 Jan, 15:11
Rohit Yadav Re: [VOTE] Release Apache CloudStack CloudMonkey 5.3.1 Sun, 04 Jan, 07:22
Sebastien Goasguen Re: [VOTE] Release Apache CloudStack CloudMonkey 5.3.1 Sun, 04 Jan, 09:12
jenk...@cloudstack.org Build failed in Jenkins: build-master #2127 Sun, 04 Jan, 10:07
jenk...@cloudstack.org Build failed in Jenkins: build-master-simulator #1525 Sun, 04 Jan, 10:08
jenk...@cloudstack.org Build failed in Jenkins: build-master #2128 Mon, 05 Jan, 10:27
jenk...@cloudstack.org Jenkins build is back to normal : build-master-simulator #1526 Mon, 05 Jan, 10:29
jenk...@cloudstack.org Build failed in Jenkins: simulator-singlerun #861 Mon, 05 Jan, 11:32
jenk...@cloudstack.org Build failed in Jenkins: cloudstack-4.4-maven-build #545 Mon, 05 Jan, 12:04
Daan Hoogland Re: [ACS44]release 4.4.3 Mon, 05 Jan, 12:35
Daan Hoogland Quality process improvement reqs Mon, 05 Jan, 12:53
scan-ad...@coverity.com New Defects reported by Coverity Scan for cloudstack Mon, 05 Jan, 13:00
SrikanteswaraRao Talluri Re: Review Request 29395: CLOUDSTACK-8124: Skipping snapshot tests on hyperv hypervisor Mon, 05 Jan, 13:16
jenk...@cloudstack.org Build failed in Jenkins: build-master #2129 Mon, 05 Jan, 13:17
jenk...@cloudstack.org Build failed in Jenkins: build-master-simulator #1527 Mon, 05 Jan, 13:18
SrikanteswaraRao Talluri Re: Review Request 29509: CLOUDSATCK-8138: Fixed VmSnapshot revert issue in test_escalations_instances.py Mon, 05 Jan, 13:20
SrikanteswaraRao Talluri Re: Review Request 29478: CLOUDSTACK-8137: Fixed cleanup issue in sec group tests in test_escalations_instances.py Mon, 05 Jan, 13:21
SrikanteswaraRao Talluri Re: Review Request 29477: CLOUDSTACK-8135: Fixed cleanup issue in test_escalations_instances.py Mon, 05 Jan, 13:21
SrikanteswaraRao Talluri Re: Review Request 29453: CLOUDSTACK-8132: Fixed issue related to secondary storage count of template Mon, 05 Jan, 13:21
SrikanteswaraRao Talluri Re: Review Request 29425: CLOUDSTACK-8130: Fixed test_escalations_templates.py - Removed test case dependency on each other Mon, 05 Jan, 13:21
SrikanteswaraRao Talluri Re: Review Request 29394: CLOUDSTACK-8124: Skipping snapshot test cases on hyperv Mon, 05 Jan, 13:22
SrikanteswaraRao Talluri Re: Review Request 29509: CLOUDSATCK-8138: Fixed VmSnapshot revert issue in test_escalations_instances.py Mon, 05 Jan, 13:26
Tejas Gadaria Unable to add primary storage (SR_BACKEND_FAILURE_73NFS mount error [opterr=mount failed with return code 32]) Mon, 05 Jan, 14:25
Somesh Naidu RE: Unable to add primary storage (SR_BACKEND_FAILURE_73NFS mount error [opterr=mount failed with return code 32]) Mon, 05 Jan, 14:45
jenk...@cloudstack.org Build failed in Jenkins: build-master #2130 Mon, 05 Jan, 14:47
jenk...@cloudstack.org Build failed in Jenkins: build-master-simulator #1528 Mon, 05 Jan, 14:48
jenk...@cloudstack.org Build failed in Jenkins: build-master-simulator #1529 Mon, 05 Jan, 14:58
jenk...@cloudstack.org Build failed in Jenkins: build-master #2131 Mon, 05 Jan, 15:07
jenk...@cloudstack.org Build failed in Jenkins: build-master-simulator #1530 Mon, 05 Jan, 15:08
jenk...@cloudstack.org Build failed in Jenkins: build-master #2132 Mon, 05 Jan, 15:17
Nux! Re: [ACS44]release 4.4.3 Mon, 05 Jan, 16:57
Suresh Sadhu RE: Unable to add primary storage (SR_BACKEND_FAILURE_73NFS mount error [opterr=mount failed with return code 32]) Mon, 05 Jan, 17:46
Suresh Ramamurthy Adding command to update the network plugin host details... Mon, 05 Jan, 19:50
Karen Vuong [PROMOTE] CloudStack Silicon Valley User Group Meetup - January 14th, 2015 Mon, 05 Jan, 20:31
Jayapal Reddy Uradi Re: Adding command to update the network plugin host details... Tue, 06 Jan, 05:56
Tejas Gadaria Re: Unable to add primary storage (SR_BACKEND_FAILURE_73NFS mount error [opterr=mount failed with return code 32]) Tue, 06 Jan, 06:09
Sateesh Chodapuneedi RE: Server 2012 R2 Bug on CS 4.4.0 with vmware hypervisor Tue, 06 Jan, 06:36
Prashant Kumar Mishra Re: Unable to add primary storage (SR_BACKEND_FAILURE_73NFS mount error [opterr=mount failed with return code 32]) Tue, 06 Jan, 07:10
Ashutosh Kelkar Review Request 29620: CLOUDSTACK-8143: Corrected a test in BVT test_routers.py Tue, 06 Jan, 07:37
Rohit Yadav Re: [ACS44]release 4.4.3 Tue, 06 Jan, 08:31
Rohit Yadav Re: [VOTE] Release Apache CloudStack CloudMonkey 5.3.1 Tue, 06 Jan, 08:35
jenk...@cloudstack.org Jenkins build is back to normal : build-master #2133 Tue, 06 Jan, 09:46
jenk...@cloudstack.org Jenkins build is back to normal : build-master-simulator #1531 Tue, 06 Jan, 09:47
jenk...@cloudstack.org Jenkins build is back to normal : build-4.5 #260 Tue, 06 Jan, 10:10
jenk...@cloudstack.org Jenkins build is back to normal : build-master-noredist #4008 Tue, 06 Jan, 10:15
jenk...@cloudstack.org Jenkins build is back to normal : build-4.5-noredist #146 Tue, 06 Jan, 10:24
jenk...@cloudstack.org Build failed in Jenkins: simulator-singlerun #862 Tue, 06 Jan, 10:50
Nux! Re: [ACS44]release 4.4.3 Tue, 06 Jan, 10:52
jenk...@cloudstack.org Build failed in Jenkins: build-master #2134 Tue, 06 Jan, 11:05
jenk...@cloudstack.org Build failed in Jenkins: build-master-simulator #1533 Tue, 06 Jan, 11:05
Nux! Re: [VOTE] Release Apache CloudStack CloudMonkey 5.3.1 Tue, 06 Jan, 11:19
Rohit Yadav Re: [VOTE] Release Apache CloudStack CloudMonkey 5.3.1 Tue, 06 Jan, 11:30
jenk...@cloudstack.org Jenkins build is unstable: simulator-4.5-singlerun #117 Tue, 06 Jan, 11:50
Erik Weber Unable to add affinity group to instances in project Tue, 06 Jan, 12:27
Tejas Gadaria Re: Unable to add primary storage (SR_BACKEND_FAILURE_73NFS mount error [opterr=mount failed with return code 32]) Tue, 06 Jan, 12:44
Nux! Re: [VOTE] Release Apache CloudStack CloudMonkey 5.3.1 Tue, 06 Jan, 12:49
jenk...@cloudstack.org Build failed in Jenkins: build-master #2135 Tue, 06 Jan, 12:56
jenk...@cloudstack.org Build failed in Jenkins: build-master #2136 Tue, 06 Jan, 13:02
jenk...@cloudstack.org Jenkins build is back to normal : build-master-simulator #1534 Tue, 06 Jan, 13:09
jenk...@cloudstack.org Jenkins build is back to normal : build-master #2137 Tue, 06 Jan, 13:15
jenk...@cloudstack.org Build failed in Jenkins: simulator-singlerun #864 Tue, 06 Jan, 14:12
jenk...@cloudstack.org Build failed in Jenkins: simulator-singlerun #865 Tue, 06 Jan, 15:14
Somesh Naidu RE: Unable to add primary storage (SR_BACKEND_FAILURE_73NFS mount error [opterr=mount failed with return code 32]) Tue, 06 Jan, 16:10
jenk...@cloudstack.org Build failed in Jenkins: simulator-singlerun #866 Tue, 06 Jan, 16:31
ilya musayev Re: [VOTE] Release Apache CloudStack CloudMonkey 5.3.1 Tue, 06 Jan, 17:16
jenk...@cloudstack.org Build failed in Jenkins: simulator-singlerun #867 Tue, 06 Jan, 17:33
Logan Barfield Multi-Datacenter Deployment Tue, 06 Jan, 19:45
Francois Gaudreault StorageManager-Scavenger tries to delete VMs that are no longer existing. Tue, 06 Jan, 21:12
Erik Weber CloudStack Collab EU 2014 Slides Tue, 06 Jan, 22:17
Mike Tutkowski Re: CloudStack Collab EU 2014 Slides Tue, 06 Jan, 22:29
Matthew Midgett Vlan issue with ACS 4.4 and XenServer 6.2 Wed, 07 Jan, 01:43
Message list1 · 2 · 3 · 4 · 5 · 6 · 7 · 8 · Next »Thread · Author · Date
Box list
Jun 2019102
May 201998
Apr 2019153
Mar 2019139
Feb 2019110
Jan 2019152
Dec 201865
Nov 2018191
Oct 2018141
Sep 201877
Aug 201857
Jul 2018126
Jun 2018146
May 2018163
Apr 2018164
Mar 2018215
Feb 2018195
Jan 2018337
Dec 2017165
Nov 2017248
Oct 2017130
Sep 2017117
Aug 201790
Jul 2017232
Jun 2017173
May 2017192
Apr 2017580
Mar 20171605
Feb 20171946
Jan 2017676
Dec 20161642
Nov 20161847
Oct 2016916
Sep 20161222
Aug 20161428
Jul 2016402
Jun 2016560
May 20162853
Apr 20162138
Mar 20161055
Feb 2016761
Jan 20161700
Dec 20151924
Nov 20152018
Oct 20152202
Sep 20151779
Aug 20151982
Jul 20151394
Jun 20151542
May 20151536
Apr 20151302
Mar 20151550
Feb 2015879
Jan 2015790
Dec 20141204
Nov 20141316
Oct 20141068
Sep 20141410
Aug 20141621
Jul 20141566
Jun 20141831
May 20141734
Apr 20141772
Mar 20142262
Feb 20141700
Jan 20141972
Dec 20131288
Nov 20131526
Oct 20132279
Sep 20132064
Aug 20132376
Jul 20132867
Jun 20132184
May 20132494
Apr 20132608
Mar 20133428
Feb 20135723
Jan 20135144
Dec 20122172
Nov 20121738
Oct 20123080
Sep 20123107
Aug 20121994
Jul 20121016
Jun 20121042
May 2012594
Apr 2012133