cloudstack-dev mailing list archives

Site index · List index
Message view « Date » · « Thread »
Top « Date » · « Thread »
From jenk...@cloudstack.org
Subject Build failed in Jenkins: simulator-singlerun #861
Date Mon, 05 Jan 2015 11:32:10 GMT
See <http://jenkins.buildacloud.org/job/simulator-singlerun/861/changes>

Changes:

[Rohit Yadav] README: back to work

[w.zhou] CLOUDSTACK-8063: list secondary Ips information on non-default nics in VM response

------------------------------------------
[...truncated 9093 lines...]
  File "<http://jenkins.buildacloud.org/job/simulator-singlerun/ws/tools/marvin/marvin/sshClient.py",>
line 121, in createConnection
    timeout=self.timeout)
  File "/usr/local/lib/python2.7/site-packages/paramiko-1.13.0-py2.7.egg/paramiko/client.py",
line 236, in connect
    retry_on_signal(lambda: sock.connect(addr))
  File "/usr/local/lib/python2.7/site-packages/paramiko-1.13.0-py2.7.egg/paramiko/util.py",
line 279, in retry_on_signal
    return function()
  File "/usr/local/lib/python2.7/site-packages/paramiko-1.13.0-py2.7.egg/paramiko/client.py",
line 236, in <lambda>
    retry_on_signal(lambda: sock.connect(addr))
  File "/usr/local/lib/python2.7/socket.py", line 222, in meth
    return getattr(self._sock,name)(*args)
timeout: timed out
====Trying SSH Connection: Host:192.168.2.5 User:root                                   Port:22
RetryCnt:1===
SshClient: Exception under createConnection: ['Traceback (most recent call last):\n', '  File
"<http://jenkins.buildacloud.org/job/simulator-singlerun/ws/tools/marvin/marvin/sshClient.py",>
line 121, in createConnection\n    timeout=self.timeout)\n', '  File "/usr/local/lib/python2.7/site-packages/paramiko-1.13.0-py2.7.egg/paramiko/client.py",
line 236, in connect\n    retry_on_signal(lambda: sock.connect(addr))\n', '  File "/usr/local/lib/python2.7/site-packages/paramiko-1.13.0-py2.7.egg/paramiko/util.py",
line 279, in retry_on_signal\n    return function()\n', '  File "/usr/local/lib/python2.7/site-packages/paramiko-1.13.0-py2.7.egg/paramiko/client.py",
line 236, in <lambda>\n    retry_on_signal(lambda: sock.connect(addr))\n', '  File "/usr/local/lib/python2.7/socket.py",
line 222, in meth\n    return getattr(self._sock,name)(*args)\n', 'timeout: timed out\n']
Traceback (most recent call last):
  File "<http://jenkins.buildacloud.org/job/simulator-singlerun/ws/tools/marvin/marvin/sshClient.py",>
line 121, in createConnection
    timeout=self.timeout)
  File "/usr/local/lib/python2.7/site-packages/paramiko-1.13.0-py2.7.egg/paramiko/client.py",
line 236, in connect
    retry_on_signal(lambda: sock.connect(addr))
  File "/usr/local/lib/python2.7/site-packages/paramiko-1.13.0-py2.7.egg/paramiko/util.py",
line 279, in retry_on_signal
    return function()
  File "/usr/local/lib/python2.7/site-packages/paramiko-1.13.0-py2.7.egg/paramiko/client.py",
line 236, in <lambda>
    retry_on_signal(lambda: sock.connect(addr))
  File "/usr/local/lib/python2.7/socket.py", line 222, in meth
    return getattr(self._sock,name)(*args)
timeout: timed out
====Trying SSH Connection: Host:192.168.2.5 User:root                                   Port:22
RetryCnt:0===

==== Marvin Init Started ====

=== Marvin Parse Config Successful ===

=== Marvin Setting TestData Successful===

==== Log Folder Path: /tmp//MarvinLogs//Jan_05_2015_05_54_26_8XW44E. All logs will be available
here ====

=== Marvin Init Logging Successful===

==== Marvin Init Successful ====
===final results are now copied to: /tmp//MarvinLogs/test_vpc_vpn_J90KBV===
+ mvn -P systemvm,simulator -pl :cloud-client-ui jetty:stop
[INFO] Scanning for projects...
[INFO]                                                                         
[INFO] ------------------------------------------------------------------------
[INFO] Building Apache CloudStack Client UI 4.6.0-SNAPSHOT
[INFO] ------------------------------------------------------------------------
[INFO] 
[INFO] --- jetty-maven-plugin:9.2.6.v20141205:stop (default-cli) @ cloud-client-ui ---
[INFO] ------------------------------------------------------------------------
[INFO] BUILD SUCCESS
[INFO] ------------------------------------------------------------------------
[INFO] Total time: 6.318s
[INFO] Finished at: Mon Jan 05 06:32:49 EST 2015
[INFO] Final Memory: 26M/106M
[INFO] ------------------------------------------------------------------------
+ sleep 10
+ kill -KILL 28732
/tmp/hudson6488615197209734297.sh: line 44: kill: (28732) - No such process
+ rm -rf '*.log.*'
+ git clean -fdx
Removing agent/target/
Removing api/target/
Removing client/target/
Removing core/target/
Removing developer/target/
Removing engine/api/target/
Removing engine/components-api/target/
Removing engine/network/target/
Removing engine/orchestration/target/
Removing engine/schema/target/
Removing engine/service/target/
Removing engine/storage/cache/target/
Removing engine/storage/datamotion/target/
Removing engine/storage/image/target/
Removing engine/storage/snapshot/target/
Removing engine/storage/target/
Removing engine/storage/volume/target/
Removing engine/target/
Removing framework/cluster/target/
Removing framework/config/target/
Removing framework/db/target/
Removing framework/events/target/
Removing framework/ipc/target/
Removing framework/jobs/target/
Removing framework/managed-context/target/
Removing framework/rest/target/
Removing framework/security/target/
Removing framework/spring/lifecycle/target/
Removing framework/spring/module/target/
Removing framework/target/
Removing generatedJUnitFiles/
Removing jetty-output.out
Removing log/
Removing maven-standard/target/
Removing plugins/acl/static-role-based/target/
Removing plugins/affinity-group-processors/explicit-dedication/target/
Removing plugins/affinity-group-processors/host-anti-affinity/target/
Removing plugins/alert-handlers/snmp-alerts/target/
Removing plugins/alert-handlers/syslog-alerts/target/
Removing plugins/api/discovery/target/
Removing plugins/api/rate-limit/target/
Removing plugins/api/solidfire-intg-test/target/
Removing plugins/dedicated-resources/target/
Removing plugins/deployment-planners/implicit-dedication/target/
Removing plugins/deployment-planners/user-concentrated-pod/target/
Removing plugins/deployment-planners/user-dispersing/target/
Removing plugins/event-bus/inmemory/target/
Removing plugins/event-bus/rabbitmq/target/
Removing plugins/ha-planners/skip-heurestics/target/
Removing plugins/host-allocators/random/target/
Removing plugins/hypervisors/baremetal/target/
Removing plugins/hypervisors/hyperv/target/
Removing plugins/hypervisors/kvm/target/
Removing plugins/hypervisors/ovm/target/
Removing plugins/hypervisors/simulator/target/
Removing plugins/hypervisors/ucs/target/
Removing plugins/hypervisors/xenserver/target/
Removing plugins/network-elements/bigswitch-vns/target/
Removing plugins/network-elements/brocade-vcs/target/
Removing plugins/network-elements/dns-notifier/target/
Removing plugins/network-elements/elastic-loadbalancer/target/
Removing plugins/network-elements/globodns/target/
Removing plugins/network-elements/internal-loadbalancer/target/
Removing plugins/network-elements/juniper-contrail/target/
Removing plugins/network-elements/midonet/target/
Removing plugins/network-elements/netscaler/target/
Removing plugins/network-elements/nicira-nvp/target/
Removing plugins/network-elements/opendaylight/target/
Removing plugins/network-elements/ovs/target/
Removing plugins/network-elements/palo-alto/target/
Removing plugins/network-elements/stratosphere-ssp/target/
Removing plugins/network-elements/vxlan/target/
Removing plugins/storage-allocators/random/target/
Removing plugins/storage/image/default/target/
Removing plugins/storage/image/s3/target/
Removing plugins/storage/image/sample/target/
Removing plugins/storage/image/swift/target/
Removing plugins/storage/volume/cloudbyte/target/
Removing plugins/storage/volume/default/target/
Removing plugins/storage/volume/nexenta/target/
Removing plugins/storage/volume/sample/target/
Removing plugins/storage/volume/solidfire/target/
Removing plugins/target/
Removing plugins/user-authenticators/ldap/target/
Removing plugins/user-authenticators/md5/target/
Removing plugins/user-authenticators/plain-text/target/
Removing plugins/user-authenticators/saml2/target/
Removing plugins/user-authenticators/sha256salted/target/
Removing quickcloud/target/
Removing server/target/
Removing services/console-proxy-rdp/rdpconsole/target/
Removing services/console-proxy/server/target/
Removing services/console-proxy/target/
Removing services/secondary-storage/controller/target/
Removing services/secondary-storage/server/target/
Removing services/secondary-storage/target/
Removing services/target/
Removing systemvm/dist/
Removing systemvm/target/
Removing target/
Removing test/integration/__init__.pyc
Removing test/integration/smoke/__init__.pyc
Removing test/integration/smoke/misc/__init__.pyc
Removing test/integration/smoke/misc/test_deploy_vm.pyc
Removing test/integration/smoke/misc/test_escalations_templates.pyc
Removing test/integration/smoke/misc/test_vm_ha.pyc
Removing test/integration/smoke/misc/test_vm_sync.pyc
Removing test/integration/smoke/test_affinity_groups.pyc
Removing test/integration/smoke/test_deploy_vgpu_enabled_vm.pyc
Removing test/integration/smoke/test_deploy_vm_root_resize.pyc
Removing test/integration/smoke/test_deploy_vm_with_userdata.pyc
Removing test/integration/smoke/test_deploy_vms_with_varied_deploymentplanners.pyc
Removing test/integration/smoke/test_disk_offerings.pyc
Removing test/integration/smoke/test_global_settings.pyc
Removing test/integration/smoke/test_guest_vlan_range.pyc
Removing test/integration/smoke/test_hosts.pyc
Removing test/integration/smoke/test_internal_lb.pyc
Removing test/integration/smoke/test_iso.pyc
Removing test/integration/smoke/test_loadbalance.pyc
Removing test/integration/smoke/test_multipleips_per_nic.pyc
Removing test/integration/smoke/test_network.pyc
Removing test/integration/smoke/test_network_acl.pyc
Removing test/integration/smoke/test_nic.pyc
Removing test/integration/smoke/test_non_contigiousvlan.pyc
Removing test/integration/smoke/test_over_provisioning.pyc
Removing test/integration/smoke/test_portable_publicip.pyc
Removing test/integration/smoke/test_primary_storage.pyc
Removing test/integration/smoke/test_privategw_acl.pyc
Removing test/integration/smoke/test_public_ip_range.pyc
Removing test/integration/smoke/test_pvlan.pyc
Removing test/integration/smoke/test_regions.pyc
Removing test/integration/smoke/test_reset_vm_on_reboot.pyc
Removing test/integration/smoke/test_resource_detail.pyc
Removing test/integration/smoke/test_routers.pyc
Removing test/integration/smoke/test_scale_vm.pyc
Removing test/integration/smoke/test_secondary_storage.pyc
Removing test/integration/smoke/test_service_offerings.pyc
Removing test/integration/smoke/test_snapshots.pyc
Removing test/integration/smoke/test_ssvm.pyc
Removing test/integration/smoke/test_templates.pyc
Removing test/integration/smoke/test_vm_life_cycle.pyc
Removing test/integration/smoke/test_vm_snapshots.pyc
Removing test/integration/smoke/test_volumes.pyc
Removing test/integration/smoke/test_vpc_vpn.pyc
Removing test/target/
Removing tools/apidoc/log/
Removing tools/apidoc/target/
Removing tools/checkstyle/target/
Removing tools/devcloud-kvm/target/
Removing tools/devcloud/target/
Removing tools/marvin/Marvin.egg-info/
Removing tools/marvin/dist/
Removing tools/marvin/marvin/__init__.pyc
Removing tools/marvin/marvin/asyncJobMgr.pyc
Removing tools/marvin/marvin/cloudstackAPI/
Removing tools/marvin/marvin/cloudstackConnection.pyc
Removing tools/marvin/marvin/cloudstackException.pyc
Removing tools/marvin/marvin/cloudstackTestCase.pyc
Removing tools/marvin/marvin/cloudstackTestClient.pyc
Removing tools/marvin/marvin/codes.pyc
Removing tools/marvin/marvin/config/__init__.pyc
Removing tools/marvin/marvin/config/test_data.pyc
Removing tools/marvin/marvin/configGenerator.pyc
Removing tools/marvin/marvin/dbConnection.pyc
Removing tools/marvin/marvin/deployDataCenter.pyc
Removing tools/marvin/marvin/jsonHelper.pyc
Removing tools/marvin/marvin/lib/__init__.pyc
Removing tools/marvin/marvin/lib/base.pyc
Removing tools/marvin/marvin/lib/common.pyc
Removing tools/marvin/marvin/lib/utils.pyc
Removing tools/marvin/marvin/marvinInit.pyc
Removing tools/marvin/marvin/marvinLog.pyc
Removing tools/marvin/marvin/marvinPlugin.pyc
Removing tools/marvin/marvin/sshClient.pyc
Removing tools/marvin/target/
Removing tools/target/
Removing usage/target/
Removing utils/target/
Removing xunit.xml
[locks-and-latches] Releasing all the locks
[locks-and-latches] All the locks released
[xUnit] [INFO] - Starting to record.
[xUnit] [INFO] - Processing JUnit
[xUnit] [INFO] - [JUnit] - No test report file(s) were found with the pattern 'xunit.xml'
relative to '<http://jenkins.buildacloud.org/job/simulator-singlerun/ws/'> for the testing
framework 'JUnit'.  Did you enter a pattern relative to the correct directory?  Did you generate
the result report(s) for 'JUnit'?
[xUnit] [ERROR] - No test reports found for the metric 'JUnit' with the resolved pattern 'xunit.xml'.
Configuration error?.
[xUnit] [INFO] - Failing BUILD.
[xUnit] [INFO] - There are errors when processing test results.
[xUnit] [INFO] - Skipping tests recording.
[xUnit] [INFO] - Stop build.
Build step 'Publish xUnit test result report' changed build result to FAILURE

Mime
View raw message