cloudstack-dev mailing list archives

Site index · List index
Message view « Date » · « Thread »
Top « Date » · « Thread »
From jenk...@cloudstack.org
Subject Build failed in Jenkins: build-4.5 #299
Date Thu, 22 Jan 2015 11:24:04 GMT
See <http://jenkins.buildacloud.org/job/build-4.5/299/changes>

Changes:

[sanjeev] CLOUDSTACK-8007: Fixed the script 'test_vm_passwdenabled.py' - Template created
by Admin should have public access to be used for regular User VM Deployment

------------------------------------------
[...truncated 309 lines...]
[INFO] --- maven-compiler-plugin:2.5.1:testCompile (default-testCompile) @ cloud-quickcloud
---
[INFO] No sources to compile
[INFO] 
[INFO] --- maven-surefire-plugin:2.12:test (default-test) @ cloud-quickcloud ---
[INFO] 
[INFO] --- maven-resources-plugin:2.5:resources (default-resources) @ cloud-framework-managed-context
---
[debug] execute contextualize
[INFO] Using 'UTF-8' encoding to copy filtered resources.
[INFO] skip non existing resourceDirectory <http://jenkins.buildacloud.org/job/build-4.5/ws/framework/managed-context/src/main/resources>
[INFO] Copying 3 resources
[INFO] 
[INFO] --- maven-compiler-plugin:2.5.1:compile (default-compile) @ cloud-framework-managed-context
---
[INFO] Compiling 8 source files to <http://jenkins.buildacloud.org/job/build-4.5/ws/framework/managed-context/target/classes>
[INFO] Surefire report directory: <http://jenkins.buildacloud.org/job/build-4.5/ws/quickcloud/target/surefire-reports>

-------------------------------------------------------
 T E S T S
-------------------------------------------------------
[INFO] 
[INFO] --- maven-resources-plugin:2.5:testResources (default-testResources) @ cloud-framework-rest
---
[debug] execute contextualize
[INFO] Using 'UTF-8' encoding to copy filtered resources.
[INFO] skip non existing resourceDirectory <http://jenkins.buildacloud.org/job/build-4.5/ws/framework/rest/test/resources>
[INFO] Copying 3 resources
[INFO] 
[INFO] --- maven-compiler-plugin:2.5.1:testCompile (default-testCompile) @ cloud-framework-rest
---
[INFO] Compiling 1 source file to <http://jenkins.buildacloud.org/job/build-4.5/ws/framework/rest/target/test-classes>

Results :

Tests run: 0, Failures: 0, Errors: 0, Skipped: 0

[INFO] Starting audit...
Audit done.

[INFO] 
[INFO] --- maven-remote-resources-plugin:1.3:process (default) @ cloudstack-service-console-proxy-rdpclient
---
[INFO] 
[INFO] --- maven-resources-plugin:2.5:resources (default-resources) @ cloudstack-service-console-proxy-rdpclient
---
[debug] execute contextualize
[INFO] Using 'UTF-8' encoding to copy filtered resources.
[INFO] Copying 1 resource
[INFO] Copying 3 resources
[INFO] 
[INFO] --- maven-compiler-plugin:2.5.1:compile (default-compile) @ cloudstack-service-console-proxy-rdpclient
---
[INFO] 
[INFO] --- maven-resources-plugin:2.5:testResources (default-testResources) @ cloud-framework-managed-context
---
[debug] execute contextualize
[INFO] Using 'UTF-8' encoding to copy filtered resources.
[INFO] skip non existing resourceDirectory <http://jenkins.buildacloud.org/job/build-4.5/ws/framework/managed-context/src/test/resources>
[INFO] Copying 3 resources
[INFO] 
[INFO] --- maven-compiler-plugin:2.5.1:testCompile (default-testCompile) @ cloud-framework-managed-context
---
[INFO] Compiling 1 source file to <http://jenkins.buildacloud.org/job/build-4.5/ws/framework/managed-context/target/test-classes>
[INFO] Compiling 146 source files to <http://jenkins.buildacloud.org/job/build-4.5/ws/services/console-proxy-rdp/rdpconsole/target/classes>
[INFO] 
[INFO] --- maven-surefire-plugin:2.12:test (default-test) @ cloud-framework-rest ---
[INFO] Surefire report directory: <http://jenkins.buildacloud.org/job/build-4.5/ws/framework/rest/target/surefire-reports>

-------------------------------------------------------
 T E S T S
-------------------------------------------------------
Running org.apache.cloudstack.framework.ws.jackson.CSJacksonAnnotationTest
Tests run: 1, Failures: 0, Errors: 0, Skipped: 1, Time elapsed: 0.698 sec

Results :

Tests run: 1, Failures: 0, Errors: 0, Skipped: 1

[INFO] 
[INFO] --- maven-surefire-plugin:2.12:test (default-test) @ cloud-framework-managed-context
---
[INFO] Surefire report directory: <http://jenkins.buildacloud.org/job/build-4.5/ws/framework/managed-context/target/surefire-reports>

-------------------------------------------------------
 T E S T S
-------------------------------------------------------
Running org.apache.cloudstack.managed.context.impl.DefaultManagedContextTest
SLF4J: Failed to load class "org.slf4j.impl.StaticLoggerBinder".
SLF4J: Defaulting to no-operation (NOP) logger implementation
SLF4J: See http://www.slf4j.org/codes.html#StaticLoggerBinder for further details.
Tests run: 6, Failures: 0, Errors: 0, Skipped: 0, Time elapsed: 0.348 sec

Results :

Tests run: 6, Failures: 0, Errors: 0, Skipped: 0

[INFO]                                                                         
[INFO] ------------------------------------------------------------------------
[INFO] Building Apache CloudStack Utils 4.5.0-SNAPSHOT
[INFO] ------------------------------------------------------------------------
[INFO] 
[INFO] --- maven-clean-plugin:2.5:clean (default-clean) @ cloud-utils ---
[INFO] Deleting <http://jenkins.buildacloud.org/job/build-4.5/ws/utils/target> (includes
= [**/*], excludes = [])
[INFO] Deleting <http://jenkins.buildacloud.org/job/build-4.5/ws/utils> (includes =
[target, dist], excludes = [])
[INFO] 
[INFO] --- maven-checkstyle-plugin:2.11:check (cloudstack-checkstyle) @ cloud-utils ---
[INFO] Starting audit...
Audit done.

[INFO] 
[INFO] --- maven-remote-resources-plugin:1.3:process (default) @ cloud-utils ---
[INFO] 
[INFO] --- maven-resources-plugin:2.5:resources (default-resources) @ cloud-utils ---
[debug] execute contextualize
[INFO] Using 'UTF-8' encoding to copy filtered resources.
[INFO] Copying 1 resource
[INFO] Copying 3 resources
[INFO] 
[INFO] --- maven-compiler-plugin:2.5.1:compile (default-compile) @ cloud-utils ---
[INFO] Compiling 133 source files to <http://jenkins.buildacloud.org/job/build-4.5/ws/utils/target/classes>
[INFO] 
[INFO] --- maven-resources-plugin:2.5:testResources (default-testResources) @ cloudstack-service-console-proxy-rdpclient
---
[debug] execute contextualize
[INFO] Using 'UTF-8' encoding to copy filtered resources.
[INFO] skip non existing resourceDirectory <http://jenkins.buildacloud.org/job/build-4.5/ws/services/console-proxy-rdp/rdpconsole/src/test/resources>
[INFO] Copying 3 resources
[INFO] 
[INFO] --- maven-compiler-plugin:2.5.1:testCompile (default-testCompile) @ cloudstack-service-console-proxy-rdpclient
---
[INFO] Compiling 4 source files to <http://jenkins.buildacloud.org/job/build-4.5/ws/services/console-proxy-rdp/rdpconsole/target/test-classes>
[INFO] 
[INFO] --- maven-surefire-plugin:2.12:test (default-test) @ cloudstack-service-console-proxy-rdpclient
---
[INFO] Surefire report directory: <http://jenkins.buildacloud.org/job/build-4.5/ws/services/console-proxy-rdp/rdpconsole/target/surefire-reports>

-------------------------------------------------------
 T E S T S
-------------------------------------------------------
Running rdpclient.MockServerTest
[INFO] ------------------------------------------------------------------------
[INFO] Reactor Summary:
[INFO] 
[INFO] Apache CloudStack Developer Tools - Checkstyle Configuration  SUCCESS [3.668s]
[INFO] Apache CloudStack ................................. SUCCESS [4.164s]
[INFO] Apache CloudStack Maven Conventions Parent ........ SUCCESS [11.176s]
[INFO] Apache CloudStack Framework - Managed Context ..... SUCCESS [18.622s]
[INFO] Apache CloudStack Utils ........................... FAILURE [13.540s]
[INFO] Apache CloudStack Framework ....................... SUCCESS [1.637s]
[INFO] Apache CloudStack Framework - Event Notification .. SKIPPED
[INFO] Apache CloudStack Framework - Configuration ....... SKIPPED
[INFO] Apache CloudStack API ............................. SKIPPED
[INFO] Apache CloudStack Framework - REST ................ SUCCESS [35.542s]
[INFO] Apache CloudStack Framework - IPC ................. SKIPPED
[INFO] Apache CloudStack Cloud Engine .................... SUCCESS [1.604s]
[INFO] Apache CloudStack Cloud Engine API ................ SKIPPED
[INFO] Apache CloudStack Framework - Security ............ SKIPPED
[INFO] Apache CloudStack Core ............................ SKIPPED
[INFO] Apache CloudStack Agents .......................... SKIPPED
[INFO] Apache CloudStack Framework - Clustering .......... SKIPPED
[INFO] Apache CloudStack Framework - Event Notification .. SKIPPED
[INFO] Apache CloudStack Cloud Engine Schema Component ... SKIPPED
[INFO] Apache CloudStack Framework - Jobs ................ SKIPPED
[INFO] Apache CloudStack Cloud Engine Internal Components API  SKIPPED
[INFO] Apache CloudStack Server .......................... SKIPPED
[INFO] Apache CloudStack Usage Server .................... SKIPPED
[INFO] Apache CloudStack Cloud Engine Orchestration Component  SKIPPED
[INFO] Apache CloudStack Cloud Services .................. SUCCESS [1.662s]
[INFO] Apache CloudStack Secondary Storage ............... SUCCESS [19.295s]
[INFO] Apache CloudStack Secondary Storage Service ....... SKIPPED
[INFO] Apache CloudStack Engine Storage Component ........ SKIPPED
[INFO] Apache CloudStack Engine Storage Volume Component . SKIPPED
[INFO] Apache CloudStack Engine Storage Image Component .. SKIPPED
[INFO] Apache CloudStack Engine Storage Data Motion Component  SKIPPED
[INFO] Apache CloudStack Engine Storage Cache Component .. SKIPPED
[INFO] Apache CloudStack Engine Storage Snapshot Component  SKIPPED
[INFO] Apache CloudStack Cloud Engine API ................ SKIPPED
[INFO] Apache CloudStack Cloud Engine Service ............ SKIPPED
[INFO] Apache CloudStack Plugin POM ...................... SKIPPED
[INFO] Apache CloudStack Plugin - API Rate Limit ......... SKIPPED
[INFO] Apache CloudStack Plugin - Storage Volume default provider  SKIPPED
[INFO] Apache CloudStack Plugin - Storage Volume SolidFire Provider  SKIPPED
[INFO] Apache CloudStack Plugin - API SolidFire .......... SKIPPED
[INFO] Apache CloudStack Plugin - API Discovery .......... SKIPPED
[INFO] Apache CloudStack Plugin - ACL Static Role Based .. SKIPPED
[INFO] Apache CloudStack Plugin - Host Anti-Affinity Processor  SKIPPED
[INFO] Apache CloudStack Plugin - Explicit Dedication Processor  SKIPPED
[INFO] Apache CloudStack Plugin - User Concentrated Pod Deployment Planner  SKIPPED
[INFO] Apache CloudStack Plugin - User Dispersing Deployment Planner  SKIPPED
[INFO] Apache CloudStack Plugin - Implicit Dedication Planner  SKIPPED
[INFO] Apache CloudStack Plugin - Skip Heurestics Planner  SKIPPED
[INFO] Apache CloudStack Plugin - Host Allocator Random .. SKIPPED
[INFO] Apache CloudStack Plugin - Dedicated Resources .... SKIPPED
[INFO] Apache CloudStack Plugin - Hypervisor OracleVM .... SKIPPED
[INFO] Apache CloudStack Plugin - Open vSwitch ........... SKIPPED
[INFO] Apache CloudStack Plugin - Hypervisor XenServer ... SKIPPED
[INFO] Apache CloudStack Plugin - Hypervisor KVM ......... SKIPPED
[INFO] Apache CloudStack Plugin - RabbitMQ Event Bus ..... SKIPPED
[INFO] Apache CloudStack Plugin - In Memory Event Bus .... SKIPPED
[INFO] Apache CloudStack Plugin - Hypervisor Baremetal ... SKIPPED
[INFO] Apache CloudStack Plugin - Hypervisor UCS ......... SKIPPED
[INFO] Apache CloudStack Plugin - Hypervisor Hyper-V ..... SKIPPED
[INFO] Apache CloudStack Plugin - Network Elastic Load Balancer  SKIPPED
[INFO] Apache CloudStack Plugin - Network Internal Load Balancer  SKIPPED
[INFO] Apache CloudStack Framework - Spring Life Cycle ... SKIPPED
[INFO] Apache CloudStack Plugin - Network Juniper Contrail  SKIPPED
[INFO] Apache CloudStack Plugin - Palo Alto .............. SKIPPED
[INFO] Apache CloudStack Plugin - Network Netscaler ...... SKIPPED
[INFO] Apache CloudStack Plugin - Network Nicira NVP ..... SKIPPED
[INFO] Apache CloudStack Plugin - BigSwitch Virtual Network Segment  SKIPPED
[INFO] Apache CloudStack Plugin - Network Brocade VCS .... SKIPPED
[INFO] Apache CloudStack Plugin - Midokura Midonet ....... SKIPPED
[INFO] Apache CloudStack Plugin - Stratosphere SSP ....... SKIPPED
[INFO] Apache CloudStack Plugin - Network Opendaylight ... SKIPPED
[INFO] Apache CloudStack Plugin - Storage Allocator Random  SKIPPED
[INFO] Apache CloudStack Plugin - User Authenticator LDAP  SKIPPED
[INFO] Apache CloudStack Plugin - User Authenticator MD5 . SKIPPED
[INFO] Apache CloudStack Plugin - User Authenticator Plain Text  SKIPPED
[INFO] Apache CloudStack Plugin - User Authenticator SAML2  SKIPPED
[INFO] Apache CloudStack Plugin - User Authenticator SHA256 Salted  SKIPPED
[INFO] Apache CloudStack Plugin - Dns Notifier Example ... SKIPPED
[INFO] Apache CloudStack Plugin - Storage Image S3 ....... SKIPPED
[INFO] Apache CloudStack Plugin - Storage Image Swift provider  SKIPPED
[INFO] Apache CloudStack Plugin - Storage Image default provider  SKIPPED
[INFO] Apache CloudStack Plugin - Storage Image sample provider  SKIPPED
[INFO] Apache CloudStack Plugin - Storage Volume Nexenta Provider  SKIPPED
[INFO] Apache CloudStack Plugin - Storage Volume CloudByte Provider  SKIPPED
[INFO] Apache CloudStack Plugin - Storage Volume sample provider  SKIPPED
[INFO] Apache CloudStack Plugin - SNMP Alerts ............ SKIPPED
[INFO] Apache CloudStack Plugin - Syslog Alerts .......... SKIPPED
[INFO] Apache CloudStack Plugin - Network VXLAN .......... SKIPPED
[INFO] Apache CloudStack Plugin - GloboDNS ............... SKIPPED
[INFO] Apache CloudStack Framework - Spring Module ....... SKIPPED
[INFO] Apache CloudStack Secondary Storage Controller .... SKIPPED
[INFO] Apache CloudStack Console Proxy - RDP Client ...... SKIPPED
[INFO] Apache CloudStack Console Proxy ................... SUCCESS [9.804s]
[INFO] Apache CloudStack Console Proxy - Server .......... SKIPPED
[INFO] Apache CloudStack System VM ....................... SKIPPED
[INFO] Apache CloudStack Client UI ....................... SKIPPED
[INFO] Apache CloudStack Framework - QuickCloud .......... SUCCESS [6.303s]
[INFO] Apache CloudStack AWS API Bridge .................. SKIPPED
[INFO] ------------------------------------------------------------------------
[INFO] BUILD FAILURE
[INFO] ------------------------------------------------------------------------
[INFO] Total time: 1:14.634s (Wall Clock)
[INFO] Finished at: Thu Jan 22 11:24:44 UTC 2015
[INFO] Final Memory: 43M/297M
[INFO] ------------------------------------------------------------------------
[ERROR] Failed to execute goal org.apache.maven.plugins:maven-compiler-plugin:2.5.1:compile
(default-compile) on project cloud-utils: Fatal error compiling: Unknown error trying to execute
the external compiler:
[ERROR] /bin/sh -c cd <http://jenkins.buildacloud.org/job/build-4.5/ws/utils> &&
/usr/lib/jvm/java-1.7.0-openjdk-1.7.0.71-2.5.3.1.el7_0.x86_64/jre/../bin/javac @/tmp/org.codehaus.plexus.compiler.javac.JavacCompiler342420743425855109arguments
-J-Xmx512m -J-Xms128m
[ERROR] -> [Help 1]
[ERROR] 
[ERROR] To see the full stack trace of the errors, re-run Maven with the -e switch.
[ERROR] Re-run Maven using the -X switch to enable full debug logging.
[ERROR] 
[ERROR] For more information about the errors and possible solutions, please read the following
articles:
[ERROR] [Help 1] http://cwiki.apache.org/confluence/display/MAVEN/MojoExecutionException
[ERROR] 
[ERROR] After correcting the problems, you can resume the build with the command
[ERROR]   mvn <goals> -rf :cloud-utils
Build step 'Invoke top-level Maven targets' marked build as failure
Recording test results

Mime
View raw message