cloudstack-dev mailing list archives

Site index · List index
Message view « Date » · « Thread »
Top « Date » · « Thread »
From jenk...@cloudstack.org
Subject Build failed in Jenkins: build-master-noredist #4058
Date Thu, 29 Jan 2015 20:18:52 GMT
See <http://jenkins.buildacloud.org/job/build-master-noredist/4058/changes>

Changes:

[marcus_sorensen] LibvirtComputingResource: make Oracle linux support virtio

[Rohit Yadav] use a preferable protocol that works on most infra

[marcus_sorensen] LibvirtComputingResource: GuestOSName for OracleLinux

[mike.tutkowski] Update hypervisor snapshot reserve for the root volume earlier than when
it is currently being set

------------------------------------------
[...truncated 4104 lines...]
[INFO] This project has been banned from the build due to previous failures.
[INFO] ------------------------------------------------------------------------
[INFO]                                                                         
[INFO] ------------------------------------------------------------------------
[INFO] Skipping Apache CloudStack Plugin - F5
[INFO] This project has been banned from the build due to previous failures.
[INFO] ------------------------------------------------------------------------
[INFO]                                                                         
[INFO] ------------------------------------------------------------------------
[INFO] Skipping Apache CloudStack Plugin - Juniper SRX
[INFO] This project has been banned from the build due to previous failures.
[INFO] ------------------------------------------------------------------------
[INFO]                                                                         
[INFO] ------------------------------------------------------------------------
[INFO] Skipping Apache CloudStack Plugin - Nuage VSP
[INFO] This project has been banned from the build due to previous failures.
[INFO] ------------------------------------------------------------------------
[INFO]                                                                         
[INFO] ------------------------------------------------------------------------
[INFO] Skipping Apache CloudStack Plugin - MySQL HA Strategy
[INFO] This project has been banned from the build due to previous failures.
[INFO] ------------------------------------------------------------------------
[INFO]                                                                         
[INFO] ------------------------------------------------------------------------
[INFO] Skipping Apache CloudStack Engine Storage Component
[INFO] This project has been banned from the build due to previous failures.
[INFO] ------------------------------------------------------------------------
[INFO]                                                                         
[INFO] ------------------------------------------------------------------------
[INFO] Skipping Apache CloudStack Plugin - Hypervisor KVM
[INFO] This project has been banned from the build due to previous failures.
[INFO] ------------------------------------------------------------------------
[INFO] 
[INFO] --- maven-surefire-plugin:2.18.1:test (default-test) @ cloud-plugin-network-vns ---
[INFO] Surefire report directory: <http://jenkins.buildacloud.org/job/build-master-noredist/ws/plugins/network-elements/bigswitch-vns/target/surefire-reports>

-------------------------------------------------------
 T E S T S
-------------------------------------------------------
log4j:WARN No appenders could be found for logger (org.springframework.test.context.junit4.SpringJUnit4ClassRunner).
log4j:WARN Please initialize the log4j system properly.
log4j:WARN See http://logging.apache.org/log4j/1.2/faq.html#noconfig for more info.
Running org.apache.cloudstack.internallbelement.InternalLbElementTest
Running com.cloud.network.resource.BigSwitchVnsResourceTest
log4j:WARN No appenders could be found for logger (org.apache.commons.httpclient.params.DefaultHttpParams).
log4j:WARN Please initialize the log4j system properly.
log4j:WARN See http://logging.apache.org/log4j/1.2/faq.html#noconfig for more info.
Tests run: 16, Failures: 0, Errors: 0, Skipped: 0, Time elapsed: 1.047 sec - in com.cloud.network.resource.BigSwitchVnsResourceTest
Running com.cloud.network.bigswitch.BigSwitchApiTest
[INFO] 
[INFO] --- maven-surefire-plugin:2.18.1:test (default-test) @ cloud-plugin-network-nvp ---
[INFO] Surefire report directory: <http://jenkins.buildacloud.org/job/build-master-noredist/ws/plugins/network-elements/nicira-nvp/target/surefire-reports>

-------------------------------------------------------
 T E S T S
-------------------------------------------------------
[INFO] 
[INFO] --- maven-resources-plugin:2.5:testResources (default-testResources) @ cloud-plugin-network-ssp
---
[debug] execute contextualize
[INFO] Using 'UTF-8' encoding to copy filtered resources.
[INFO] skip non existing resourceDirectory <http://jenkins.buildacloud.org/job/build-master-noredist/ws/plugins/network-elements/stratosphere-ssp/test/resources>
[INFO] Copying 3 resources
[INFO] 
[INFO] --- maven-compiler-plugin:3.2:testCompile (default-testCompile) @ cloud-plugin-network-ssp
---
[INFO] Changes detected - recompiling the module!
[INFO] Compiling 2 source files to <http://jenkins.buildacloud.org/job/build-master-noredist/ws/plugins/network-elements/stratosphere-ssp/target/test-classes>
Tests run: 14, Failures: 0, Errors: 0, Skipped: 0, Time elapsed: 0.735 sec - in com.cloud.network.bigswitch.BigSwitchApiTest

Results :

Tests run: 30, Failures: 0, Errors: 0, Skipped: 0

[INFO] 
[INFO] --- maven-jar-plugin:2.5:jar (default-jar) @ cloud-plugin-network-vns ---
[INFO] Building jar: <http://jenkins.buildacloud.org/job/build-master-noredist/ws/plugins/network-elements/bigswitch-vns/target/cloud-plugin-network-vns-4.6.0-SNAPSHOT.jar>
[INFO] 
[INFO] --- maven-site-plugin:3.3:attach-descriptor (attach-descriptor) @ cloud-plugin-network-vns
---
[INFO] 
[INFO] --- maven-install-plugin:2.3.1:install (default-install) @ cloud-plugin-network-vns
---
[INFO] Installing <http://jenkins.buildacloud.org/job/build-master-noredist/ws/plugins/network-elements/bigswitch-vns/target/cloud-plugin-network-vns-4.6.0-SNAPSHOT.jar>
to /jenkins/.m2/repository/org/apache/cloudstack/cloud-plugin-network-vns/4.6.0-SNAPSHOT/cloud-plugin-network-vns-4.6.0-SNAPSHOT.jar
[INFO] Installing <http://jenkins.buildacloud.org/job/build-master-noredist/ws/plugins/network-elements/bigswitch-vns/pom.xml>
to /jenkins/.m2/repository/org/apache/cloudstack/cloud-plugin-network-vns/4.6.0-SNAPSHOT/cloud-plugin-network-vns-4.6.0-SNAPSHOT.pom
[INFO] 
[INFO] --- maven-resources-plugin:2.5:testResources (default-testResources) @ cloud-plugin-network-vcs
---
[debug] execute contextualize
[INFO] Using 'UTF-8' encoding to copy filtered resources.
[INFO] skip non existing resourceDirectory <http://jenkins.buildacloud.org/job/build-master-noredist/ws/plugins/network-elements/brocade-vcs/test/resources>
[INFO] Copying 3 resources
[INFO] 
[INFO] --- maven-compiler-plugin:3.2:testCompile (default-testCompile) @ cloud-plugin-network-vcs
---
[INFO] Changes detected - recompiling the module!
[INFO] Compiling 3 source files to <http://jenkins.buildacloud.org/job/build-master-noredist/ws/plugins/network-elements/brocade-vcs/target/test-classes>
Running com.cloud.network.element.NiciraNvpElementTest
[INFO] 
[INFO] --- license-maven-plugin:2.7:check (cloudstack-checklicence) @ cloud-plugin-network-opendaylight
---
[INFO] Checking licenses...
[INFO] 
[INFO] --- maven-resources-plugin:2.5:testResources (default-testResources) @ cloud-plugin-network-opendaylight
---
[debug] execute contextualize
[INFO] Using 'UTF-8' encoding to copy filtered resources.
[INFO] skip non existing resourceDirectory <http://jenkins.buildacloud.org/job/build-master-noredist/ws/plugins/network-elements/opendaylight/src/test/resources>
[INFO] Copying 3 resources
[INFO] 
[INFO] --- maven-compiler-plugin:3.2:testCompile (default-testCompile) @ cloud-plugin-network-opendaylight
---
[INFO] Changes detected - recompiling the module!
[INFO] Compiling 6 source files to <http://jenkins.buildacloud.org/job/build-master-noredist/ws/plugins/network-elements/opendaylight/target/test-classes>
[INFO] ------------------------------------------------------------------------
[INFO] Reactor Summary:
[INFO] 
[INFO] Apache CloudStack Developer Tools - Checkstyle Configuration  SUCCESS [0.880s]
[INFO] Apache CloudStack ................................. SUCCESS [1.468s]
[INFO] Apache CloudStack Maven Conventions Parent ........ SUCCESS [1.288s]
[INFO] Apache CloudStack Framework - Managed Context ..... SUCCESS [4.090s]
[INFO] Apache CloudStack Utils ........................... SUCCESS [11.882s]
[INFO] Apache CloudStack Framework ....................... SUCCESS [0.461s]
[INFO] Apache CloudStack Framework - Event Notification .. SUCCESS [10.588s]
[INFO] Apache CloudStack Framework - Configuration ....... SUCCESS [4.531s]
[INFO] Apache CloudStack API ............................. SUCCESS [13.923s]
[INFO] Apache CloudStack Framework - REST ................ SUCCESS [4.862s]
[INFO] Apache CloudStack Framework - IPC ................. SUCCESS [5.065s]
[INFO] Apache CloudStack Cloud Engine .................... SUCCESS [0.228s]
[INFO] Apache CloudStack Cloud Engine API ................ SUCCESS [4.582s]
[INFO] Apache CloudStack Framework - Security ............ SUCCESS [2.484s]
[INFO] Apache CloudStack Core ............................ SUCCESS [22.478s]
[INFO] Apache CloudStack Agents .......................... SUCCESS [8.073s]
[INFO] Apache CloudStack Framework - Clustering .......... SUCCESS [3.409s]
[INFO] Apache CloudStack Framework - Event Notification .. SUCCESS [3.267s]
[INFO] Apache CloudStack Cloud Engine Schema Component ... SUCCESS [15.772s]
[INFO] Apache CloudStack Framework - Jobs ................ SUCCESS [6.751s]
[INFO] Apache CloudStack Cloud Engine Internal Components API  SUCCESS [2.833s]
[INFO] Apache CloudStack Server .......................... SUCCESS [36.977s]
[INFO] Apache CloudStack Usage Server .................... SUCCESS [9.015s]
[INFO] Apache CloudStack Cloud Engine Orchestration Component  SUCCESS [10.978s]
[INFO] Apache CloudStack Cloud Services .................. SUCCESS [0.221s]
[INFO] Apache CloudStack Secondary Storage ............... SUCCESS [3.357s]
[INFO] Apache CloudStack Secondary Storage Service ....... SUCCESS [13.151s]
[INFO] Apache CloudStack Engine Storage Component ........ SKIPPED
[INFO] Apache CloudStack Engine Storage Volume Component . SKIPPED
[INFO] Apache CloudStack Engine Storage Image Component .. SKIPPED
[INFO] Apache CloudStack Engine Storage Data Motion Component  SKIPPED
[INFO] Apache CloudStack Engine Storage Cache Component .. SKIPPED
[INFO] Apache CloudStack Engine Storage Snapshot Component  SKIPPED
[INFO] Apache CloudStack Cloud Engine API ................ SUCCESS [3.099s]
[INFO] Apache CloudStack Cloud Engine Service ............ SKIPPED
[INFO] Apache CloudStack Plugin POM ...................... SUCCESS [0.467s]
[INFO] Apache CloudStack Plugin - API Rate Limit ......... SKIPPED
[INFO] Apache CloudStack Plugin - Storage Volume default provider  SKIPPED
[INFO] Apache CloudStack Plugin - Storage Volume SolidFire Provider  SKIPPED
[INFO] Apache CloudStack Plugin - API SolidFire .......... SKIPPED
[INFO] Apache CloudStack Plugin - API Discovery .......... SUCCESS [14.749s]
[INFO] Apache CloudStack Plugin - ACL Static Role Based .. SUCCESS [7.680s]
[INFO] Apache CloudStack Plugin - Host Anti-Affinity Processor  SUCCESS [7.921s]
[INFO] Apache CloudStack Plugin - Explicit Dedication Processor  SUCCESS [8.121s]
[INFO] Apache CloudStack Plugin - User Concentrated Pod Deployment Planner  SUCCESS [7.324s]
[INFO] Apache CloudStack Plugin - User Dispersing Deployment Planner  SUCCESS [7.623s]
[INFO] Apache CloudStack Plugin - Implicit Dedication Planner  SUCCESS [20.167s]
[INFO] Apache CloudStack Plugin - Skip Heurestics Planner  SUCCESS [6.254s]
[INFO] Apache CloudStack Plugin - Host Allocator Random .. SUCCESS [6.617s]
[INFO] Apache CloudStack Plugin - Dedicated Resources .... SUCCESS [20.380s]
[INFO] Apache CloudStack Plugin - Hypervisor OracleVM .... SUCCESS [8.549s]
[INFO] Apache CloudStack Plugin - Open vSwitch ........... SUCCESS [9.876s]
[INFO] Apache CloudStack Plugin - Hypervisor XenServer ... SKIPPED
[INFO] Apache CloudStack Plugin - Hypervisor KVM ......... SKIPPED
[INFO] Apache CloudStack Plugin - RabbitMQ Event Bus ..... SUCCESS [6.274s]
[INFO] Apache CloudStack Plugin - In Memory Event Bus .... SUCCESS [12.941s]
[INFO] Apache CloudStack Plugin - Hypervisor Baremetal ... SUCCESS [12.894s]
[INFO] Apache CloudStack Plugin - Hypervisor UCS ......... SUCCESS [7.383s]
[INFO] Apache CloudStack Plugin - Hypervisor Hyper-V ..... SUCCESS [13.556s]
[INFO] Apache CloudStack Plugin - Network Elastic Load Balancer  SUCCESS [15.202s]
[INFO] Apache CloudStack Plugin - Network Internal Load Balancer  SKIPPED
[INFO] Apache CloudStack Framework - Spring Life Cycle ... SUCCESS [2.862s]
[INFO] Apache CloudStack Plugin - Network Juniper Contrail  SKIPPED
[INFO] Apache CloudStack Plugin - Palo Alto .............. FAILURE [14.429s]
[INFO] Apache CloudStack Plugin - Network Netscaler ...... SUCCESS [11.351s]
[INFO] Apache CloudStack Plugin - Network Nicira NVP ..... SKIPPED
[INFO] Apache CloudStack Plugin - BigSwitch Virtual Network Segment  SUCCESS [17.180s]
[INFO] Apache CloudStack Plugin - Network Brocade VCS .... SKIPPED
[INFO] Apache CloudStack Plugin - Midokura Midonet ....... SKIPPED
[INFO] Apache CloudStack Plugin - Stratosphere SSP ....... SKIPPED
[INFO] Apache CloudStack Plugin - Network Opendaylight ... SKIPPED
[INFO] Apache CloudStack Plugin - Storage Allocator Random  SKIPPED
[INFO] Apache CloudStack Plugin - User Authenticator LDAP  SKIPPED
[INFO] Apache CloudStack Plugin - User Authenticator MD5 . SKIPPED
[INFO] Apache CloudStack Plugin - User Authenticator Plain Text  SKIPPED
[INFO] Apache CloudStack Plugin - User Authenticator SAML2  SKIPPED
[INFO] Apache CloudStack Plugin - User Authenticator SHA256 Salted  SKIPPED
[INFO] Apache CloudStack Plugin - Dns Notifier Example ... SKIPPED
[INFO] Apache CloudStack Plugin - Storage Image S3 ....... SKIPPED
[INFO] Apache CloudStack Plugin - Storage Image Swift provider  SKIPPED
[INFO] Apache CloudStack Plugin - Storage Image default provider  SKIPPED
[INFO] Apache CloudStack Plugin - Storage Image sample provider  SKIPPED
[INFO] Apache CloudStack Plugin - Storage Volume Nexenta Provider  SKIPPED
[INFO] Apache CloudStack Plugin - Storage Volume CloudByte Provider  SKIPPED
[INFO] Apache CloudStack Plugin - Storage Volume sample provider  SKIPPED
[INFO] Apache CloudStack Plugin - SNMP Alerts ............ SKIPPED
[INFO] Apache CloudStack Plugin - Syslog Alerts .......... SKIPPED
[INFO] Apache CloudStack Plugin - Network VXLAN .......... SKIPPED
[INFO] Apache CloudStack Plugin - GloboDNS ............... SKIPPED
[INFO] Apache CloudStack Plugin - NetApp File System ..... SKIPPED
[INFO] Apache CloudStack Plugin - F5 ..................... SKIPPED
[INFO] Apache CloudStack Plugin - Juniper SRX ............ SKIPPED
[INFO] Apache CloudStack Plugin - Nuage VSP .............. SKIPPED
[INFO] Apache CloudStack VMware Base ..................... SUCCESS [7.313s]
[INFO] Apache CloudStack Plugin - Hypervisor VMware ...... SKIPPED
[INFO] Apache CloudStack Plugin - Cisco VNMC ............. SKIPPED
[INFO] Apache CloudStack Plugin - MySQL HA Strategy ...... SKIPPED
[INFO] Apache CloudStack Framework - Spring Module ....... SUCCESS [9.515s]
[INFO] Apache CloudStack Secondary Storage Controller .... SUCCESS [5.310s]
[INFO] Apache CloudStack Console Proxy - RDP Client ...... SUCCESS [12.046s]
[INFO] Apache CloudStack Console Proxy ................... SUCCESS [3.344s]
[INFO] Apache CloudStack Console Proxy - Server .......... SUCCESS [5.422s]
[INFO] Apache CloudStack System VM ....................... SKIPPED
[INFO] Apache CloudStack Client UI ....................... SKIPPED
[INFO] Apache CloudStack Framework - QuickCloud .......... SUCCESS [1.213s]
[INFO] Apache CloudStack AWS API Bridge .................. SKIPPED
[INFO] ------------------------------------------------------------------------
[INFO] BUILD FAILURE
[INFO] ------------------------------------------------------------------------
[INFO] Total time: 2:50.397s (Wall Clock)
[INFO] Finished at: Thu Jan 29 21:17:12 CET 2015
log4j:WARN No appenders could be found for logger (com.cloud.network.element.NiciraNvpElement).
log4j:WARN Please initialize the log4j system properly.
[INFO] Final Memory: 83M/444Mlog4j:WARN See http://logging.apache.org/log4j/1.2/faq.html#noconfig
for more info.

[INFO] ------------------------------------------------------------------------
Tests run: 3, Failures: 0, Errors: 0, Skipped: 0, Time elapsed: 1.388 sec - in com.cloud.network.element.NiciraNvpElementTest
Running com.cloud.network.nicira.NiciraTagTest
Tests run: 4, Failures: 0, Errors: 0, Skipped: 0, Time elapsed: 0.001 sec - in com.cloud.network.nicira.NiciraTagTest
Running com.cloud.network.nicira.NatRuleTest
Tests run: 1, Failures: 0, Errors: 0, Skipped: 0, Time elapsed: 0 sec - in com.cloud.network.nicira.NatRuleTest
Running com.cloud.network.nicira.NiciraNvpApiTest
[ERROR] Failed to execute goal org.apache.maven.plugins:maven-surefire-plugin:2.18.1:test
(default-test) on project cloud-plugin-network-palo-alto: Execution default-test of goal org.apache.maven.plugins:maven-surefire-plugin:2.18.1:test
failed: The forked VM terminated without properly saying goodbye. VM crash or System.exit
called?
[ERROR] Command was /bin/sh -c cd <http://jenkins.buildacloud.org/job/build-master-noredist/ws/plugins/network-elements/palo-alto>
&& /usr/lib/jvm/java-1.7.0-openjdk-1.7.0.25.x86_64/jre/bin/java -jar <http://jenkins.buildacloud.org/job/build-master-noredist/ws/plugins/network-elements/palo-alto/target/surefire/surefirebooter970100989405713051.jar>
<http://jenkins.buildacloud.org/job/build-master-noredist/ws/plugins/network-elements/palo-alto/target/surefire/surefire2233589165036035822tmp>
<http://jenkins.buildacloud.org/job/build-master-noredist/ws/plugins/network-elements/palo-alto/target/surefire/surefire_231369640087617112772tmp>
[ERROR] -> [Help 1]
[ERROR] 
[ERROR] To see the full stack trace of the errors, re-run Maven with the -e switch.
[ERROR] Re-run Maven using the -X switch to enable full debug logging.
[ERROR] 
[ERROR] For more information about the errors and possible solutions, please read the following
articles:
[ERROR] [Help 1] http://cwiki.apache.org/confluence/display/MAVEN/PluginExecutionException
[ERROR] 
[ERROR] After correcting the problems, you can resume the build with the command
[ERROR]   mvn <goals> -rf :cloud-plugin-network-palo-alto
Destroying 3 processes
Destroying process..
Destroying process..
Destroying process..
Destroyed 3 processes
Build step 'Invoke top-level Maven targets' marked build as failure
Archiving artifacts

Mime
View raw message