cloudstack-dev mailing list archives

Site index · List index
Message view « Date » · « Thread »
Top « Date » · « Thread »
From jenk...@cloudstack.org
Subject Build failed in Jenkins: build-master #2144
Date Wed, 07 Jan 2015 09:17:31 GMT
See <http://jenkins.buildacloud.org/job/build-master/2144/changes>

Changes:

[kishan] Close transaction while fetching recent events

[kishan] For Vm snapshot delete event, check for null size and set it as zero

[kishan] Network Id for direct-network should not be included in usage record response. Direct
network stats have network_id = 0. Ignore network with id = 0 in usage record

------------------------------------------
[...truncated 3290 lines...]
[INFO] ------------------------------------------------------------------------
[INFO] 
[INFO] --- maven-clean-plugin:2.5:clean (default-clean) @ cloud-plugin-network-internallb
---
[INFO] Deleting <http://jenkins.buildacloud.org/job/build-master/ws/plugins/network-elements/internal-loadbalancer>
(includes = [target, dist], excludes = [])
[INFO] 
[INFO] --- maven-checkstyle-plugin:2.11:check (cloudstack-checkstyle) @ cloud-plugin-network-internallb
---
[INFO] Starting audit...
Audit done.

[INFO] 
[INFO] --- maven-remote-resources-plugin:1.3:process (default) @ cloud-plugin-network-internallb
---
[INFO] 
[INFO] --- maven-resources-plugin:2.5:resources (default-resources) @ cloud-plugin-network-internallb
---
[debug] execute contextualize
[INFO] Using 'UTF-8' encoding to copy filtered resources.
[INFO] Copying 1 resource
[INFO] Copying 3 resources
[INFO] 
[INFO] --- maven-compiler-plugin:3.2:compile (default-compile) @ cloud-plugin-network-internallb
---
[INFO] Changes detected - recompiling the module!
[INFO] Compiling 3 source files to <http://jenkins.buildacloud.org/job/build-master/ws/plugins/network-elements/internal-loadbalancer/target/classes>
[INFO] 
[INFO] --- maven-resources-plugin:2.5:testResources (default-testResources) @ cloud-plugin-network-internallb
---
[debug] execute contextualize
[INFO] Using 'UTF-8' encoding to copy filtered resources.
[INFO] Copying 3 resources
[INFO] Copying 3 resources
[INFO] 
[INFO] --- maven-compiler-plugin:3.2:testCompile (default-testCompile) @ cloud-plugin-network-internallb
---
[INFO] Changes detected - recompiling the module!
[INFO] Compiling 6 source files to <http://jenkins.buildacloud.org/job/build-master/ws/plugins/network-elements/internal-loadbalancer/target/test-classes>
[INFO] 
[INFO] --- maven-surefire-plugin:2.18.1:test (default-test) @ cloud-plugin-network-internallb
---
[INFO] Surefire report directory: <http://jenkins.buildacloud.org/job/build-master/ws/plugins/network-elements/internal-loadbalancer/target/surefire-reports>

-------------------------------------------------------
 T E S T S
-------------------------------------------------------
log4j:WARN No appenders could be found for logger (org.springframework.test.context.junit4.SpringJUnit4ClassRunner).
log4j:WARN Please initialize the log4j system properly.
log4j:WARN See http://logging.apache.org/log4j/1.2/faq.html#noconfig for more info.
Running org.apache.cloudstack.internallbelement.InternalLbElementTest
Tests run: 10, Failures: 0, Errors: 0, Skipped: 0, Time elapsed: 1.936 sec - in org.apache.cloudstack.internallbelement.InternalLbElementTest
Running org.apache.cloudstack.internallbelement.InternalLbElementServiceTest
Tests run: 9, Failures: 0, Errors: 0, Skipped: 0, Time elapsed: 0.032 sec - in org.apache.cloudstack.internallbelement.InternalLbElementServiceTest
Running org.apache.cloudstack.internallbvmmgr.InternalLBVMManagerTest
Tests run: 10, Failures: 0, Errors: 0, Skipped: 0, Time elapsed: 0.546 sec - in org.apache.cloudstack.internallbvmmgr.InternalLBVMManagerTest
Running org.apache.cloudstack.internallbvmmgr.InternalLBVMServiceTest
Tests run: 6, Failures: 0, Errors: 0, Skipped: 0, Time elapsed: 0.215 sec - in org.apache.cloudstack.internallbvmmgr.InternalLBVMServiceTest

Results :

Tests run: 35, Failures: 0, Errors: 0, Skipped: 0

[INFO]                                                                         
[INFO] ------------------------------------------------------------------------
[INFO] Building Apache CloudStack Framework - Spring Life Cycle 4.6.0-SNAPSHOT
[INFO] ------------------------------------------------------------------------
[INFO] 
[INFO] --- maven-clean-plugin:2.5:clean (default-clean) @ cloud-framework-spring-lifecycle
---
[INFO] Deleting <http://jenkins.buildacloud.org/job/build-master/ws/framework/spring/lifecycle>
(includes = [target, dist], excludes = [])
[INFO] 
[INFO] --- maven-checkstyle-plugin:2.11:check (cloudstack-checkstyle) @ cloud-framework-spring-lifecycle
---
[INFO] Starting audit...
Audit done.

[INFO] 
[INFO] --- maven-remote-resources-plugin:1.3:process (default) @ cloud-framework-spring-lifecycle
---
[INFO] 
[INFO] --- maven-resources-plugin:2.5:resources (default-resources) @ cloud-framework-spring-lifecycle
---
[debug] execute contextualize
[INFO] Using 'UTF-8' encoding to copy filtered resources.
[INFO] skip non existing resourceDirectory <http://jenkins.buildacloud.org/job/build-master/ws/framework/spring/lifecycle/src/main/resources>
[INFO] Copying 3 resources
[INFO] 
[INFO] --- maven-compiler-plugin:3.2:compile (default-compile) @ cloud-framework-spring-lifecycle
---
[INFO] Changes detected - recompiling the module!
[INFO] Compiling 11 source files to <http://jenkins.buildacloud.org/job/build-master/ws/framework/spring/lifecycle/target/classes>
[INFO] 
[INFO] --- maven-resources-plugin:2.5:testResources (default-testResources) @ cloud-framework-spring-lifecycle
---
[debug] execute contextualize
[INFO] Using 'UTF-8' encoding to copy filtered resources.
[INFO] skip non existing resourceDirectory <http://jenkins.buildacloud.org/job/build-master/ws/framework/spring/lifecycle/src/test/resources>
[INFO] Copying 3 resources
[INFO] 
[INFO] --- maven-compiler-plugin:3.2:testCompile (default-testCompile) @ cloud-framework-spring-lifecycle
---
[INFO] No sources to compile
[INFO] 
[INFO] --- maven-surefire-plugin:2.18.1:test (default-test) @ cloud-framework-spring-lifecycle
---
[INFO]                                                                         
[INFO] ------------------------------------------------------------------------
[INFO] Building Apache CloudStack Plugin - Network Juniper Contrail 4.6.0-SNAPSHOT
[INFO] ------------------------------------------------------------------------
[WARNING] The metadata /jenkins/.m2/repository/joda-time/joda-time/maven-metadata-juniper-contrail.xml
is invalid: end tag name </head> must be the same as start tag <meta> from line
4 (position: TEXT seen ...</style>\n  </head>... @49:10) 
[WARNING] The POM for org.apache.commons:commons-exec:jar:1.1 is invalid, transitive dependencies
(if any) will not be available, enable debug logging for more details
[WARNING] The POM for org.apache.commons:commons-exec:jar:1.3 is invalid, transitive dependencies
(if any) will not be available, enable debug logging for more details
[INFO] 
[INFO] --- maven-clean-plugin:2.5:clean (default-clean) @ cloud-plugin-network-contrail ---
[INFO] Deleting <http://jenkins.buildacloud.org/job/build-master/ws/plugins/network-elements/juniper-contrail>
(includes = [target, dist], excludes = [])
[INFO] 
[INFO] --- maven-checkstyle-plugin:2.11:check (cloudstack-checkstyle) @ cloud-plugin-network-contrail
---
[INFO] Starting audit...
Audit done.

[INFO] 
[INFO] --- maven-remote-resources-plugin:1.3:process (default) @ cloud-plugin-network-contrail
---
[WARNING] Cannot read metadata from '/jenkins/.m2/repository/joda-time/joda-time/maven-metadata-juniper-contrail.xml':
end tag name </head> must be the same as start tag <meta> from line 4 (position:
TEXT seen ...</style>\n  </head>... @49:10) 
[WARNING] Invalid POM for org.apache.commons:commons-exec:jar:1.1, transitive dependencies
(if any) will not be available, enable debug logging for more details
[WARNING] Invalid POM for org.apache.commons:commons-exec:jar:1.3, transitive dependencies
(if any) will not be available, enable debug logging for more details
[WARNING] Cannot read metadata from '/jenkins/.m2/repository/joda-time/joda-time/maven-metadata-juniper-contrail.xml':
end tag name </head> must be the same as start tag <meta> from line 4 (position:
TEXT seen ...</style>\n  </head>... @49:10) 
[WARNING] Invalid project model for artifact [commons-exec:org.apache.commons:1.3]. It will
be ignored by the remote resources Mojo.
[INFO] 
[INFO] --- maven-resources-plugin:2.5:resources (default-resources) @ cloud-plugin-network-contrail
---
[debug] execute contextualize
[INFO] Using 'UTF-8' encoding to copy filtered resources.
[INFO] Copying 3 resources
[INFO] Copying 3 resources
[INFO] 
[INFO] --- maven-compiler-plugin:3.2:compile (default-compile) @ cloud-plugin-network-contrail
---
[INFO] Changes detected - recompiling the module!
[INFO] Compiling 30 source files to <http://jenkins.buildacloud.org/job/build-master/ws/plugins/network-elements/juniper-contrail/target/classes>
[INFO] -------------------------------------------------------------
[ERROR] COMPILATION ERROR : 
[INFO] -------------------------------------------------------------
[ERROR] error: error reading /jenkins/.m2/repository/org/apache/commons/commons-exec/1.3/commons-exec-1.3.jar;
error in opening zip file
[INFO] 1 error
[INFO] -------------------------------------------------------------
[INFO] ------------------------------------------------------------------------
[INFO] Reactor Summary:
[INFO] 
[INFO] Apache CloudStack Developer Tools - Checkstyle Configuration  SUCCESS [2.125s]
[INFO] Apache CloudStack ................................. SUCCESS [0.513s]
[INFO] Apache CloudStack Maven Conventions Parent ........ SUCCESS [0.867s]
[INFO] Apache CloudStack Framework - Managed Context ..... SUCCESS [2.645s]
[INFO] Apache CloudStack Utils ........................... SUCCESS [11.523s]
[INFO] Apache CloudStack Framework ....................... SUCCESS [0.037s]
[INFO] Apache CloudStack Framework - Event Notification .. SUCCESS [5.865s]
[INFO] Apache CloudStack Framework - Configuration ....... SUCCESS [3.788s]
[INFO] Apache CloudStack API ............................. SUCCESS [11.385s]
[INFO] Apache CloudStack Framework - REST ................ SUCCESS [2.296s]
[INFO] Apache CloudStack Framework - IPC ................. SUCCESS [3.738s]
[INFO] Apache CloudStack Cloud Engine .................... SUCCESS [0.030s]
[INFO] Apache CloudStack Cloud Engine API ................ SUCCESS [4.139s]
[INFO] Apache CloudStack Framework - Security ............ SUCCESS [1.978s]
[INFO] Apache CloudStack Core ............................ SUCCESS [8.329s]
[INFO] Apache CloudStack Agents .......................... SUCCESS [4.806s]
[INFO] Apache CloudStack Framework - Clustering .......... SUCCESS [2.392s]
[INFO] Apache CloudStack Framework - Event Notification .. SUCCESS [1.475s]
[INFO] Apache CloudStack Cloud Engine Schema Component ... SUCCESS [10.655s]
[INFO] Apache CloudStack Framework - Jobs ................ SUCCESS [4.237s]
[INFO] Apache CloudStack Cloud Engine Internal Components API  SUCCESS [2.561s]
[INFO] Apache CloudStack Server .......................... SUCCESS [33.268s]
[INFO] Apache CloudStack Usage Server .................... SUCCESS [5.638s]
[INFO] Apache CloudStack Cloud Engine Orchestration Component  SUCCESS [7.549s]
[INFO] Apache CloudStack Cloud Services .................. SUCCESS [0.026s]
[INFO] Apache CloudStack Secondary Storage ............... SUCCESS [0.256s]
[INFO] Apache CloudStack Secondary Storage Service ....... SUCCESS [4.521s]
[INFO] Apache CloudStack Engine Storage Component ........ SUCCESS [5.984s]
[INFO] Apache CloudStack Engine Storage Volume Component . SUCCESS [4.058s]
[INFO] Apache CloudStack Engine Storage Image Component .. SUCCESS [2.436s]
[INFO] Apache CloudStack Engine Storage Data Motion Component  SUCCESS [2.197s]
[INFO] Apache CloudStack Engine Storage Cache Component .. SUCCESS [2.060s]
[INFO] Apache CloudStack Engine Storage Snapshot Component  SUCCESS [7.989s]
[INFO] Apache CloudStack Cloud Engine API ................ SUCCESS [1.542s]
[INFO] Apache CloudStack Cloud Engine Service ............ SUCCESS [0.672s]
[INFO] Apache CloudStack Plugin POM ...................... SUCCESS [0.337s]
[INFO] Apache CloudStack Plugin - API Rate Limit ......... SUCCESS [6.148s]
[INFO] Apache CloudStack Plugin - Storage Volume default provider  SUCCESS [2.273s]
[INFO] Apache CloudStack Plugin - Storage Volume SolidFire Provider  SUCCESS [4.307s]
[INFO] Apache CloudStack Plugin - API SolidFire .......... SUCCESS [2.093s]
[INFO] Apache CloudStack Plugin - API Discovery .......... SUCCESS [4.227s]
[INFO] Apache CloudStack Plugin - ACL Static Role Based .. SUCCESS [1.805s]
[INFO] Apache CloudStack Plugin - Host Anti-Affinity Processor  SUCCESS [1.873s]
[INFO] Apache CloudStack Plugin - Explicit Dedication Processor  SUCCESS [1.981s]
[INFO] Apache CloudStack Plugin - User Concentrated Pod Deployment Planner  SUCCESS [1.800s]
[INFO] Apache CloudStack Plugin - User Dispersing Deployment Planner  SUCCESS [1.879s]
[INFO] Apache CloudStack Plugin - Implicit Dedication Planner  SUCCESS [6.338s]
[INFO] Apache CloudStack Plugin - Skip Heurestics Planner  SUCCESS [1.721s]
[INFO] Apache CloudStack Plugin - Host Allocator Random .. SUCCESS [1.872s]
[INFO] Apache CloudStack Plugin - Dedicated Resources .... SUCCESS [5.919s]
[INFO] Apache CloudStack Plugin - Hypervisor OracleVM .... SUCCESS [2.623s]
[INFO] Apache CloudStack Plugin - Open vSwitch ........... SUCCESS [2.853s]
[INFO] Apache CloudStack Plugin - Hypervisor XenServer ... SUCCESS [7.759s]
[INFO] Apache CloudStack Plugin - Hypervisor KVM ......... SUCCESS [8.014s]
[INFO] Apache CloudStack Plugin - RabbitMQ Event Bus ..... SUCCESS [2.078s]
[INFO] Apache CloudStack Plugin - In Memory Event Bus .... SUCCESS [4.099s]
[INFO] Apache CloudStack Plugin - Hypervisor Baremetal ... SUCCESS [3.576s]
[INFO] Apache CloudStack Plugin - Hypervisor UCS ......... SUCCESS [2.297s]
[INFO] Apache CloudStack Plugin - Hypervisor Hyper-V ..... SUCCESS [4.733s]
[INFO] Apache CloudStack Plugin - Network Elastic Load Balancer  SUCCESS [5.133s]
[INFO] Apache CloudStack Plugin - Network Internal Load Balancer  SUCCESS [7.618s]
[INFO] Apache CloudStack Framework - Spring Life Cycle ... SUCCESS [1.666s]
[INFO] Apache CloudStack Plugin - Network Juniper Contrail  FAILURE [1.856s]
[INFO] Apache CloudStack Plugin - Palo Alto .............. SKIPPED
[INFO] Apache CloudStack Plugin - Network Netscaler ...... SKIPPED
[INFO] Apache CloudStack Plugin - Network Nicira NVP ..... SKIPPED
[INFO] Apache CloudStack Plugin - BigSwitch Virtual Network Segment  SKIPPED
[INFO] Apache CloudStack Plugin - Network Brocade VCS .... SKIPPED
[INFO] Apache CloudStack Plugin - Midokura Midonet ....... SKIPPED
[INFO] Apache CloudStack Plugin - Stratosphere SSP ....... SKIPPED
[INFO] Apache CloudStack Plugin - Network Opendaylight ... SKIPPED
[INFO] Apache CloudStack Plugin - Storage Allocator Random  SKIPPED
[INFO] Apache CloudStack Plugin - User Authenticator LDAP  SKIPPED
[INFO] Apache CloudStack Plugin - User Authenticator MD5 . SKIPPED
[INFO] Apache CloudStack Plugin - User Authenticator Plain Text  SKIPPED
[INFO] Apache CloudStack Plugin - User Authenticator SAML2  SKIPPED
[INFO] Apache CloudStack Plugin - User Authenticator SHA256 Salted  SKIPPED
[INFO] Apache CloudStack Plugin - Dns Notifier Example ... SKIPPED
[INFO] Apache CloudStack Plugin - Storage Image S3 ....... SKIPPED
[INFO] Apache CloudStack Plugin - Storage Image Swift provider  SKIPPED
[INFO] Apache CloudStack Plugin - Storage Image default provider  SKIPPED
[INFO] Apache CloudStack Plugin - Storage Image sample provider  SKIPPED
[INFO] Apache CloudStack Plugin - Storage Volume Nexenta Provider  SKIPPED
[INFO] Apache CloudStack Plugin - Storage Volume CloudByte Provider  SKIPPED
[INFO] Apache CloudStack Plugin - Storage Volume sample provider  SKIPPED
[INFO] Apache CloudStack Plugin - SNMP Alerts ............ SKIPPED
[INFO] Apache CloudStack Plugin - Syslog Alerts .......... SKIPPED
[INFO] Apache CloudStack Plugin - Network VXLAN .......... SKIPPED
[INFO] Apache CloudStack Plugin - GloboDNS ............... SKIPPED
[INFO] Apache CloudStack Framework - Spring Module ....... SKIPPED
[INFO] Apache CloudStack Secondary Storage Controller .... SKIPPED
[INFO] Apache CloudStack Console Proxy - RDP Client ...... SKIPPED
[INFO] Apache CloudStack Console Proxy ................... SKIPPED
[INFO] Apache CloudStack Console Proxy - Server .......... SKIPPED
[INFO] Apache CloudStack System VM ....................... SKIPPED
[INFO] Apache CloudStack Client UI ....................... SKIPPED
[INFO] Apache CloudStack Framework - QuickCloud .......... SKIPPED
[INFO] Apache CloudStack AWS API Bridge .................. SKIPPED
[INFO] ------------------------------------------------------------------------
[INFO] BUILD FAILURE
[INFO] ------------------------------------------------------------------------
[INFO] Total time: 4:24.301s
[INFO] Finished at: Wed Jan 07 10:17:06 CET 2015
[INFO] Final Memory: 64M/328M
[INFO] ------------------------------------------------------------------------
[ERROR] Failed to execute goal org.apache.maven.plugins:maven-compiler-plugin:3.2:compile
(default-compile) on project cloud-plugin-network-contrail: Compilation failure
[ERROR] error: error reading /jenkins/.m2/repository/org/apache/commons/commons-exec/1.3/commons-exec-1.3.jar;
error in opening zip file
[ERROR] -> [Help 1]
[ERROR] 
[ERROR] To see the full stack trace of the errors, re-run Maven with the -e switch.
[ERROR] Re-run Maven using the -X switch to enable full debug logging.
[ERROR] 
[ERROR] For more information about the errors and possible solutions, please read the following
articles:
[ERROR] [Help 1] http://cwiki.apache.org/confluence/display/MAVEN/MojoFailureException
[ERROR] 
[ERROR] After correcting the problems, you can resume the build with the command
[ERROR]   mvn <goals> -rf :cloud-plugin-network-contrail
Build step 'Invoke top-level Maven targets' marked build as failure
Recording test results

Mime
View raw message