cloudstack-dev mailing list archives

Site index · List index
Message view « Date » · « Thread »
Top « Date » · « Thread »
From jenk...@cloudstack.org
Subject Build failed in Jenkins: build-master-noredist #4014
Date Wed, 07 Jan 2015 07:07:48 GMT
See <http://jenkins.buildacloud.org/job/build-master-noredist/4014/changes>

Changes:

[kishan] Skip older records which generate negative duration usage

------------------------------------------
[...truncated 7710 lines...]
[INFO] Copying 3 resources
[INFO] 
[INFO] --- maven-compiler-plugin:3.2:testCompile (default-testCompile) @ cloud-plugin-storage-image-sample
---
[INFO] No sources to compile
[INFO] 
[INFO] --- maven-surefire-plugin:2.18.1:test (default-test) @ cloud-plugin-storage-image-sample
---
[INFO] Tests are skipped.
[INFO] 
[INFO] --- maven-jar-plugin:2.5:jar (default-jar) @ cloud-plugin-storage-image-sample ---
[INFO] Building jar: <http://jenkins.buildacloud.org/job/build-master-noredist/ws/plugins/storage/image/sample/target/cloud-plugin-storage-image-sample-4.6.0-SNAPSHOT.jar>
[INFO] 
[INFO] --- maven-site-plugin:3.3:attach-descriptor (attach-descriptor) @ cloud-plugin-storage-image-sample
---
[INFO] 
[INFO] --- maven-surefire-plugin:2.18.1:test (default) @ cloud-plugin-storage-image-sample
---
[INFO] Tests are skipped.
[INFO] 
[INFO] --- maven-install-plugin:2.3.1:install (default-install) @ cloud-plugin-storage-image-sample
---
[INFO] Installing <http://jenkins.buildacloud.org/job/build-master-noredist/ws/plugins/storage/image/sample/target/cloud-plugin-storage-image-sample-4.6.0-SNAPSHOT.jar>
to /jenkins/.m2/repository/org/apache/cloudstack/cloud-plugin-storage-image-sample/4.6.0-SNAPSHOT/cloud-plugin-storage-image-sample-4.6.0-SNAPSHOT.jar
[INFO] Installing <http://jenkins.buildacloud.org/job/build-master-noredist/ws/plugins/storage/image/sample/pom.xml>
to /jenkins/.m2/repository/org/apache/cloudstack/cloud-plugin-storage-image-sample/4.6.0-SNAPSHOT/cloud-plugin-storage-image-sample-4.6.0-SNAPSHOT.pom
[WARNING] Invalid POM for org.apache.commons:commons-exec:jar:1.1, transitive dependencies
(if any) will not be available, enable debug logging for more details
[WARNING] Invalid POM for org.apache.commons:commons-exec:jar:1.3, transitive dependencies
(if any) will not be available, enable debug logging for more details
[WARNING] Cannot read metadata from '/jenkins/.m2/repository/joda-time/joda-time/maven-metadata-juniper-contrail.xml':
end tag name </head> must be the same as start tag <meta> from line 4 (position:
TEXT seen ...</style>\n  </head>... @49:10) 
[WARNING] Invalid project model for artifact [commons-exec:org.apache.commons:1.3]. It will
be ignored by the remote resources Mojo.
[INFO] 
[INFO] --- maven-surefire-plugin:2.18.1:test (default-test) @ cloud-plugin-storage-volume-solidfire
---
[INFO] Tests are skipped.
[INFO] 
[INFO] --- maven-jar-plugin:2.5:jar (default-jar) @ cloud-plugin-storage-volume-solidfire
---
[INFO] Building jar: <http://jenkins.buildacloud.org/job/build-master-noredist/ws/plugins/storage/volume/solidfire/target/cloud-plugin-storage-volume-solidfire-4.6.0-SNAPSHOT.jar>
[INFO] 
[INFO] --- maven-site-plugin:3.3:attach-descriptor (attach-descriptor) @ cloud-plugin-storage-volume-solidfire
---
[INFO] 
[INFO] --- maven-surefire-plugin:2.18.1:test (default) @ cloud-plugin-storage-volume-solidfire
---
[INFO] Tests are skipped.
[INFO] 
[INFO] --- maven-install-plugin:2.3.1:install (default-install) @ cloud-plugin-storage-volume-solidfire
---
[INFO] Installing <http://jenkins.buildacloud.org/job/build-master-noredist/ws/plugins/storage/volume/solidfire/target/cloud-plugin-storage-volume-solidfire-4.6.0-SNAPSHOT.jar>
to /jenkins/.m2/repository/org/apache/cloudstack/cloud-plugin-storage-volume-solidfire/4.6.0-SNAPSHOT/cloud-plugin-storage-volume-solidfire-4.6.0-SNAPSHOT.jar
[INFO] Installing <http://jenkins.buildacloud.org/job/build-master-noredist/ws/plugins/storage/volume/solidfire/pom.xml>
to /jenkins/.m2/repository/org/apache/cloudstack/cloud-plugin-storage-volume-solidfire/4.6.0-SNAPSHOT/cloud-plugin-storage-volume-solidfire-4.6.0-SNAPSHOT.pom
[INFO]                                                                         
[INFO] ------------------------------------------------------------------------
[INFO] Building Apache CloudStack Plugin - API SolidFire 4.6.0-SNAPSHOT
[INFO] ------------------------------------------------------------------------
[INFO] 
[INFO] --- maven-clean-plugin:2.5:clean (default-clean) @ cloud-plugin-api-solidfire-intg-test
---
[INFO] Deleting <http://jenkins.buildacloud.org/job/build-master-noredist/ws/plugins/api/solidfire-intg-test/target>
(includes = [**/*], excludes = [])
[INFO] Deleting <http://jenkins.buildacloud.org/job/build-master-noredist/ws/plugins/api/solidfire-intg-test>
(includes = [target, dist], excludes = [])
[INFO] 
[INFO] --- maven-checkstyle-plugin:2.11:check (cloudstack-checkstyle) @ cloud-plugin-api-solidfire-intg-test
---
[INFO] Starting audit...
Audit done.

[INFO] 
[INFO] --- maven-remote-resources-plugin:1.3:process (default) @ cloud-plugin-api-solidfire-intg-test
---
[INFO] 
[INFO] --- maven-resources-plugin:2.5:resources (default-resources) @ cloud-plugin-network-contrail
---
[debug] execute contextualize
[INFO] Using 'UTF-8' encoding to copy filtered resources.
[INFO] Copying 3 resources
[INFO] Copying 3 resources
[INFO] 
[INFO] --- maven-compiler-plugin:3.2:compile (default-compile) @ cloud-plugin-network-contrail
---
[INFO] Changes detected - recompiling the module!
[INFO] Compiling 30 source files to <http://jenkins.buildacloud.org/job/build-master-noredist/ws/plugins/network-elements/juniper-contrail/target/classes>
[INFO] 
[INFO] --- maven-resources-plugin:2.5:resources (default-resources) @ cloud-plugin-api-solidfire-intg-test
---
[debug] execute contextualize
[INFO] Using 'UTF-8' encoding to copy filtered resources.
[INFO] Copying 2 resources
[INFO] Copying 3 resources
[INFO] 
[INFO] --- maven-compiler-plugin:3.2:compile (default-compile) @ cloud-plugin-api-solidfire-intg-test
---
[INFO] Changes detected - recompiling the module!
[INFO] Compiling 10 source files to <http://jenkins.buildacloud.org/job/build-master-noredist/ws/plugins/api/solidfire-intg-test/target/classes>
[INFO] -------------------------------------------------------------
[ERROR] COMPILATION ERROR : 
[INFO] -------------------------------------------------------------
[ERROR] error: error reading /jenkins/.m2/repository/org/apache/commons/commons-exec/1.3/commons-exec-1.3.jar;
error in opening zip file
[INFO] 1 error
[INFO] -------------------------------------------------------------
Tests run: 3, Failures: 0, Errors: 0, Skipped: 0, Time elapsed: 2.438 sec - in com.cloud.hypervisor.vmware.VmwareDatacenterApiUnitTest
Running org.apache.cloudstack.storage.motion.VmwareStorageMotionStrategyTest
Tests run: 6, Failures: 0, Errors: 0, Skipped: 0, Time elapsed: 0.642 sec - in org.apache.cloudstack.storage.motion.VmwareStorageMotionStrategyTest

Results :

Tests run: 10, Failures: 0, Errors: 0, Skipped: 0

[INFO] 
[INFO] --- maven-jar-plugin:2.5:jar (default-jar) @ cloud-plugin-hypervisor-vmware ---
[INFO] Building jar: <http://jenkins.buildacloud.org/job/build-master-noredist/ws/plugins/hypervisors/vmware/target/cloud-plugin-hypervisor-vmware-4.6.0-SNAPSHOT.jar>
[INFO] 
[INFO] --- maven-site-plugin:3.3:attach-descriptor (attach-descriptor) @ cloud-plugin-hypervisor-vmware
---
[INFO] 
[INFO] --- maven-install-plugin:2.3.1:install (default-install) @ cloud-plugin-hypervisor-vmware
---
[INFO] Installing <http://jenkins.buildacloud.org/job/build-master-noredist/ws/plugins/hypervisors/vmware/target/cloud-plugin-hypervisor-vmware-4.6.0-SNAPSHOT.jar>
to /jenkins/.m2/repository/org/apache/cloudstack/cloud-plugin-hypervisor-vmware/4.6.0-SNAPSHOT/cloud-plugin-hypervisor-vmware-4.6.0-SNAPSHOT.jar
[INFO] Installing <http://jenkins.buildacloud.org/job/build-master-noredist/ws/plugins/hypervisors/vmware/pom.xml>
to /jenkins/.m2/repository/org/apache/cloudstack/cloud-plugin-hypervisor-vmware/4.6.0-SNAPSHOT/cloud-plugin-hypervisor-vmware-4.6.0-SNAPSHOT.pom
[INFO] 
[INFO] --- maven-resources-plugin:2.5:testResources (default-testResources) @ cloud-plugin-api-solidfire-intg-test
---
[debug] execute contextualize
[INFO] Using 'UTF-8' encoding to copy filtered resources.
[INFO] skip non existing resourceDirectory <http://jenkins.buildacloud.org/job/build-master-noredist/ws/plugins/api/solidfire-intg-test/test/resources>
[INFO] Copying 3 resources
[INFO] 
[INFO] --- maven-compiler-plugin:3.2:testCompile (default-testCompile) @ cloud-plugin-api-solidfire-intg-test
---
[INFO] No sources to compile
[INFO] 
[INFO] --- maven-surefire-plugin:2.18.1:test (default-test) @ cloud-plugin-api-solidfire-intg-test
---
[INFO] 
[INFO] --- maven-jar-plugin:2.5:jar (default-jar) @ cloud-plugin-api-solidfire-intg-test ---
[INFO] Building jar: <http://jenkins.buildacloud.org/job/build-master-noredist/ws/plugins/api/solidfire-intg-test/target/cloud-plugin-api-solidfire-intg-test-4.6.0-SNAPSHOT.jar>
[INFO] 
[INFO] --- maven-site-plugin:3.3:attach-descriptor (attach-descriptor) @ cloud-plugin-api-solidfire-intg-test
---
[INFO] 
[INFO] --- maven-install-plugin:2.3.1:install (default-install) @ cloud-plugin-api-solidfire-intg-test
---
[INFO] Installing <http://jenkins.buildacloud.org/job/build-master-noredist/ws/plugins/api/solidfire-intg-test/target/cloud-plugin-api-solidfire-intg-test-4.6.0-SNAPSHOT.jar>
to /jenkins/.m2/repository/org/apache/cloudstack/cloud-plugin-api-solidfire-intg-test/4.6.0-SNAPSHOT/cloud-plugin-api-solidfire-intg-test-4.6.0-SNAPSHOT.jar
[INFO] Installing <http://jenkins.buildacloud.org/job/build-master-noredist/ws/plugins/api/solidfire-intg-test/pom.xml>
to /jenkins/.m2/repository/org/apache/cloudstack/cloud-plugin-api-solidfire-intg-test/4.6.0-SNAPSHOT/cloud-plugin-api-solidfire-intg-test-4.6.0-SNAPSHOT.pom
[INFO] ------------------------------------------------------------------------
[INFO] Reactor Summary:
[INFO] 
[INFO] Apache CloudStack Developer Tools - Checkstyle Configuration  SUCCESS [0.801s]
[INFO] Apache CloudStack ................................. SUCCESS [1.298s]
[INFO] Apache CloudStack Maven Conventions Parent ........ SUCCESS [1.217s]
[INFO] Apache CloudStack Framework - Managed Context ..... SUCCESS [4.891s]
[INFO] Apache CloudStack Utils ........................... SUCCESS [11.974s]
[INFO] Apache CloudStack Framework ....................... SUCCESS [0.432s]
[INFO] Apache CloudStack Framework - Event Notification .. SUCCESS [9.993s]
[INFO] Apache CloudStack Framework - Configuration ....... SUCCESS [3.758s]
[INFO] Apache CloudStack API ............................. SUCCESS [12.037s]
[INFO] Apache CloudStack Framework - REST ................ SUCCESS [5.433s]
[INFO] Apache CloudStack Framework - IPC ................. SUCCESS [5.278s]
[INFO] Apache CloudStack Cloud Engine .................... SUCCESS [0.429s]
[INFO] Apache CloudStack Cloud Engine API ................ SUCCESS [4.612s]
[INFO] Apache CloudStack Framework - Security ............ SUCCESS [2.357s]
[INFO] Apache CloudStack Core ............................ SUCCESS [20.512s]
[INFO] Apache CloudStack Agents .......................... SUCCESS [7.700s]
[INFO] Apache CloudStack Framework - Clustering .......... SUCCESS [3.205s]
[INFO] Apache CloudStack Framework - Event Notification .. SUCCESS [3.134s]
[INFO] Apache CloudStack Cloud Engine Schema Component ... SUCCESS [13.908s]
[INFO] Apache CloudStack Framework - Jobs ................ SUCCESS [6.408s]
[INFO] Apache CloudStack Cloud Engine Internal Components API  SUCCESS [2.894s]
[INFO] Apache CloudStack Server .......................... SUCCESS [36.454s]
[INFO] Apache CloudStack Usage Server .................... SUCCESS [9.320s]
[INFO] Apache CloudStack Cloud Engine Orchestration Component  SUCCESS [11.278s]
[INFO] Apache CloudStack Cloud Services .................. SUCCESS [0.427s]
[INFO] Apache CloudStack Secondary Storage ............... SUCCESS [3.306s]
[INFO] Apache CloudStack Secondary Storage Service ....... SUCCESS [12.313s]
[INFO] Apache CloudStack Engine Storage Component ........ SUCCESS [14.721s]
[INFO] Apache CloudStack Engine Storage Volume Component . SUCCESS [14.764s]
[INFO] Apache CloudStack Engine Storage Image Component .. SUCCESS [8.683s]
[INFO] Apache CloudStack Engine Storage Data Motion Component  SUCCESS [9.734s]
[INFO] Apache CloudStack Engine Storage Cache Component .. SUCCESS [6.922s]
[INFO] Apache CloudStack Engine Storage Snapshot Component  SUCCESS [28.863s]
[INFO] Apache CloudStack Cloud Engine API ................ SUCCESS [3.074s]
[INFO] Apache CloudStack Cloud Engine Service ............ SUCCESS [17.884s]
[INFO] Apache CloudStack Plugin POM ...................... SUCCESS [0.422s]
[INFO] Apache CloudStack Plugin - API Rate Limit ......... SUCCESS [19.116s]
[INFO] Apache CloudStack Plugin - Storage Volume default provider  SUCCESS [10.289s]
[INFO] Apache CloudStack Plugin - Storage Volume SolidFire Provider  SUCCESS [15.020s]
[INFO] Apache CloudStack Plugin - API SolidFire .......... SUCCESS [3.023s]
[INFO] Apache CloudStack Plugin - API Discovery .......... SUCCESS [14.113s]
[INFO] Apache CloudStack Plugin - ACL Static Role Based .. SUCCESS [7.719s]
[INFO] Apache CloudStack Plugin - Host Anti-Affinity Processor  SUCCESS [7.714s]
[INFO] Apache CloudStack Plugin - Explicit Dedication Processor  SUCCESS [7.855s]
[INFO] Apache CloudStack Plugin - User Concentrated Pod Deployment Planner  SUCCESS [7.537s]
[INFO] Apache CloudStack Plugin - User Dispersing Deployment Planner  SUCCESS [5.594s]
[INFO] Apache CloudStack Plugin - Implicit Dedication Planner  SUCCESS [21.708s]
[INFO] Apache CloudStack Plugin - Skip Heurestics Planner  SUCCESS [6.407s]
[INFO] Apache CloudStack Plugin - Host Allocator Random .. SUCCESS [6.380s]
[INFO] Apache CloudStack Plugin - Dedicated Resources .... SUCCESS [20.146s]
[INFO] Apache CloudStack Plugin - Hypervisor OracleVM .... SUCCESS [7.877s]
[INFO] Apache CloudStack Plugin - Open vSwitch ........... SUCCESS [10.387s]
[INFO] Apache CloudStack Plugin - Hypervisor XenServer ... SUCCESS [27.299s]
[INFO] Apache CloudStack Plugin - Hypervisor KVM ......... SUCCESS [24.011s]
[INFO] Apache CloudStack Plugin - RabbitMQ Event Bus ..... SUCCESS [6.207s]
[INFO] Apache CloudStack Plugin - In Memory Event Bus .... SUCCESS [13.073s]
[INFO] Apache CloudStack Plugin - Hypervisor Baremetal ... SUCCESS [12.546s]
[INFO] Apache CloudStack Plugin - Hypervisor UCS ......... SUCCESS [9.270s]
[INFO] Apache CloudStack Plugin - Hypervisor Hyper-V ..... SUCCESS [16.699s]
[INFO] Apache CloudStack Plugin - Network Elastic Load Balancer  SUCCESS [18.837s]
[INFO] Apache CloudStack Plugin - Network Internal Load Balancer  SUCCESS [27.901s]
[INFO] Apache CloudStack Framework - Spring Life Cycle ... SUCCESS [2.337s]
[INFO] Apache CloudStack Plugin - Network Juniper Contrail  FAILURE [3.983s]
[INFO] Apache CloudStack Plugin - Palo Alto .............. SUCCESS [22.867s]
[INFO] Apache CloudStack Plugin - Network Netscaler ...... SUCCESS [13.145s]
[INFO] Apache CloudStack Plugin - Network Nicira NVP ..... SUCCESS [33.797s]
[INFO] Apache CloudStack Plugin - BigSwitch Virtual Network Segment  SUCCESS [20.595s]
[INFO] Apache CloudStack Plugin - Network Brocade VCS .... SUCCESS [27.584s]
[INFO] Apache CloudStack Plugin - Midokura Midonet ....... SUCCESS [23.257s]
[INFO] Apache CloudStack Plugin - Stratosphere SSP ....... SUCCESS [18.821s]
[INFO] Apache CloudStack Plugin - Network Opendaylight ... SUCCESS [17.693s]
[INFO] Apache CloudStack Plugin - Storage Allocator Random  SUCCESS [6.723s]
[INFO] Apache CloudStack Plugin - User Authenticator LDAP  SUCCESS [9.007s]
[INFO] Apache CloudStack Plugin - User Authenticator MD5 . SUCCESS [13.751s]
[INFO] Apache CloudStack Plugin - User Authenticator Plain Text  SUCCESS [5.108s]
[INFO] Apache CloudStack Plugin - User Authenticator SAML2  SUCCESS [31.284s]
[INFO] Apache CloudStack Plugin - User Authenticator SHA256 Salted  SUCCESS [13.821s]
[INFO] Apache CloudStack Plugin - Dns Notifier Example ... SUCCESS [6.287s]
[INFO] Apache CloudStack Plugin - Storage Image S3 ....... SUCCESS [6.777s]
[INFO] Apache CloudStack Plugin - Storage Image Swift provider  SUCCESS [6.386s]
[INFO] Apache CloudStack Plugin - Storage Image default provider  SUCCESS [6.587s]
[INFO] Apache CloudStack Plugin - Storage Image sample provider  SUCCESS [6.199s]
[INFO] Apache CloudStack Plugin - Storage Volume Nexenta Provider  SUCCESS [15.110s]
[INFO] Apache CloudStack Plugin - Storage Volume CloudByte Provider  SUCCESS [9.914s]
[INFO] Apache CloudStack Plugin - Storage Volume sample provider  SUCCESS [7.045s]
[INFO] Apache CloudStack Plugin - SNMP Alerts ............ SUCCESS [14.651s]
[INFO] Apache CloudStack Plugin - Syslog Alerts .......... SUCCESS [13.208s]
[INFO] Apache CloudStack Plugin - Network VXLAN .......... SUCCESS [16.005s]
[INFO] Apache CloudStack Plugin - GloboDNS ............... SUCCESS [22.866s]
[INFO] Apache CloudStack Plugin - NetApp File System ..... SUCCESS [7.793s]
[INFO] Apache CloudStack Plugin - F5 ..................... SUCCESS [8.286s]
[INFO] Apache CloudStack Plugin - Juniper SRX ............ SUCCESS [8.818s]
[INFO] Apache CloudStack Plugin - Nuage VSP .............. SUCCESS [18.462s]
[INFO] Apache CloudStack VMware Base ..................... SUCCESS [6.979s]
[INFO] Apache CloudStack Plugin - Hypervisor VMware ...... SUCCESS [34.166s]
[INFO] Apache CloudStack Plugin - Cisco VNMC ............. SKIPPED
[INFO] Apache CloudStack Plugin - MySQL HA Strategy ...... SUCCESS [5.783s]
[INFO] Apache CloudStack Framework - Spring Module ....... SUCCESS [9.191s]
[INFO] Apache CloudStack Secondary Storage Controller .... SUCCESS [6.935s]
[INFO] Apache CloudStack Console Proxy - RDP Client ...... SUCCESS [12.100s]
[INFO] Apache CloudStack Console Proxy ................... SUCCESS [3.262s]
[INFO] Apache CloudStack Console Proxy - Server .......... SUCCESS [7.986s]
[INFO] Apache CloudStack System VM ....................... SKIPPED
[INFO] Apache CloudStack Client UI ....................... SKIPPED
[INFO] Apache CloudStack Framework - QuickCloud .......... SUCCESS [1.312s]
[INFO] Apache CloudStack AWS API Bridge .................. SKIPPED
[INFO] ------------------------------------------------------------------------
[INFO] BUILD FAILURE
[INFO] ------------------------------------------------------------------------
[INFO] Total time: 4:09.624s (Wall Clock)
[INFO] Finished at: Wed Jan 07 08:07:47 CET 2015
[INFO] Final Memory: 107M/469M
[INFO] ------------------------------------------------------------------------
[ERROR] Failed to execute goal org.apache.maven.plugins:maven-compiler-plugin:3.2:compile
(default-compile) on project cloud-plugin-network-contrail: Compilation failure
[ERROR] error: error reading /jenkins/.m2/repository/org/apache/commons/commons-exec/1.3/commons-exec-1.3.jar;
error in opening zip file
[ERROR] -> [Help 1]
[ERROR] 
[ERROR] To see the full stack trace of the errors, re-run Maven with the -e switch.
[ERROR] Re-run Maven using the -X switch to enable full debug logging.
[ERROR] 
[ERROR] For more information about the errors and possible solutions, please read the following
articles:
[ERROR] [Help 1] http://cwiki.apache.org/confluence/display/MAVEN/MojoFailureException
[ERROR] 
[ERROR] After correcting the problems, you can resume the build with the command
[ERROR]   mvn <goals> -rf :cloud-plugin-network-contrail
Destroying 1 processes
Destroying process..
Destroyed 1 processes
Build step 'Invoke top-level Maven targets' marked build as failure
Archiving artifacts

Mime
View raw message