cloudstack-dev mailing list archives

Site index · List index
Message view « Date » · « Thread »
Top « Date » · « Thread »
From jenk...@cloudstack.org
Subject Build failed in Jenkins: build-master-simulator #1605
Date Fri, 23 Jan 2015 14:40:36 GMT
See <http://jenkins.buildacloud.org/job/build-master-simulator/1605/changes>

Changes:

[Rohit Yadav] hyperv: fix maven warning, add version to exec plugin

[Rohit Yadav] CLOUDSTACK-8151: Add removeRawUsageRecords API to cleanup old cloud_usage data

------------------------------------------
[...truncated 975 lines...]
Running org.apache.cloudstack.api.agent.test.BackupSnapshotCommandTest
Tests run: 13, Failures: 0, Errors: 0, Skipped: 0, Time elapsed: 0.032 sec - in org.apache.cloudstack.api.agent.test.BackupSnapshotCommandTest
Running org.apache.cloudstack.api.agent.test.CheckOnHostCommandTest
Tests run: 42, Failures: 0, Errors: 0, Skipped: 0, Time elapsed: 0.144 sec - in org.apache.cloudstack.api.agent.test.CheckOnHostCommandTest
Running org.apache.cloudstack.api.agent.test.AnswerTest
Tests run: 4, Failures: 0, Errors: 0, Skipped: 0, Time elapsed: 0.012 sec - in org.apache.cloudstack.api.agent.test.AnswerTest
Running org.apache.cloudstack.api.agent.test.CheckNetworkAnswerTest
Tests run: 4, Failures: 0, Errors: 0, Skipped: 0, Time elapsed: 0.046 sec - in org.apache.cloudstack.api.agent.test.CheckNetworkAnswerTest
Running org.apache.cloudstack.api.agent.test.ChangeAgentAnswerTest
Tests run: 2, Failures: 0, Errors: 0, Skipped: 0, Time elapsed: 0.001 sec - in org.apache.cloudstack.api.agent.test.ChangeAgentAnswerTest
Running org.apache.cloudstack.api.agent.test.CheckNetworkCommandTest
Tests run: 2, Failures: 0, Errors: 0, Skipped: 0, Time elapsed: 0.06 sec - in org.apache.cloudstack.api.agent.test.CheckNetworkCommandTest
Running org.apache.cloudstack.api.agent.test.SnapshotCommandTest
Tests run: 8, Failures: 0, Errors: 0, Skipped: 0, Time elapsed: 0.021 sec - in org.apache.cloudstack.api.agent.test.SnapshotCommandTest
Running org.apache.cloudstack.api.agent.test.CancelCommandTest
Tests run: 3, Failures: 0, Errors: 0, Skipped: 0, Time elapsed: 0.003 sec - in org.apache.cloudstack.api.agent.test.CancelCommandTest
Running org.apache.cloudstack.api.agent.test.CheckHealthCommandTest
Tests run: 2, Failures: 0, Errors: 0, Skipped: 0, Time elapsed: 0.002 sec - in org.apache.cloudstack.api.agent.test.CheckHealthCommandTest
Running org.apache.cloudstack.api.agent.test.BumpUpPriorityCommandTest
Tests run: 2, Failures: 0, Errors: 0, Skipped: 0, Time elapsed: 0.002 sec - in org.apache.cloudstack.api.agent.test.BumpUpPriorityCommandTest
Running org.apache.cloudstack.api.agent.test.CheckHealthAnswerTest
Tests run: 3, Failures: 0, Errors: 0, Skipped: 0, Time elapsed: 0.002 sec - in org.apache.cloudstack.api.agent.test.CheckHealthAnswerTest
Running org.apache.cloudstack.api.agent.test.AgentControlCommandTest
Tests run: 1, Failures: 0, Errors: 0, Skipped: 0, Time elapsed: 0.001 sec - in org.apache.cloudstack.api.agent.test.AgentControlCommandTest
Running org.apache.cloudstack.api.agent.test.AgentControlAnswerTest
Tests run: 1, Failures: 0, Errors: 0, Skipped: 0, Time elapsed: 0.001 sec - in org.apache.cloudstack.api.agent.test.AgentControlAnswerTest
Running org.apache.cloudstack.api.agent.test.AttachVolumeAnswerTest
Tests run: 2, Failures: 0, Errors: 0, Skipped: 0, Time elapsed: 0.002 sec - in org.apache.cloudstack.api.agent.test.AttachVolumeAnswerTest
Running org.apache.cloudstack.api.agent.test.AttachIsoCommandTest
Tests run: 7, Failures: 0, Errors: 0, Skipped: 0, Time elapsed: 0.023 sec - in org.apache.cloudstack.api.agent.test.AttachIsoCommandTest

Results :

Tests run: 139, Failures: 0, Errors: 0, Skipped: 0

[INFO]                                                                         
[INFO] ------------------------------------------------------------------------
[INFO] Building Apache CloudStack Agents 4.6.0-SNAPSHOT
[INFO] ------------------------------------------------------------------------
[INFO] 
[INFO] --- maven-clean-plugin:2.5:clean (default-clean) @ cloud-agent ---
[INFO] Deleting <http://jenkins.buildacloud.org/job/build-master-simulator/ws/agent/target>
(includes = [**/*], excludes = [])
[INFO] Deleting <http://jenkins.buildacloud.org/job/build-master-simulator/ws/agent>
(includes = [target, dist], excludes = [])
[INFO] 
[INFO] --- maven-checkstyle-plugin:2.11:check (cloudstack-checkstyle) @ cloud-agent ---
[INFO] Starting audit...
Audit done.

[INFO] 
[INFO] --- maven-remote-resources-plugin:1.3:process (default) @ cloud-agent ---
[INFO] 
[INFO] --- maven-antrun-plugin:1.8:run (generate-resource) @ cloud-agent ---
[INFO] Executing tasks

main:
     [copy] Copying 1 file to <http://jenkins.buildacloud.org/job/build-master-simulator/ws/agent/target/transformed>
     [copy] Copying 2 files to <http://jenkins.buildacloud.org/job/build-master-simulator/ws/agent/target/transformed>
     [copy] Copying 4 files to <http://jenkins.buildacloud.org/job/build-master-simulator/ws/agent/target/transformed>
[INFO] Executed tasks
[INFO] 
[INFO] --- maven-resources-plugin:2.5:resources (default-resources) @ cloud-agent ---
[debug] execute contextualize
[INFO] Using 'UTF-8' encoding to copy filtered resources.
[INFO] skip non existing resourceDirectory <http://jenkins.buildacloud.org/job/build-master-simulator/ws/agent/resources>
[INFO] Copying 3 resources
[INFO] 
[INFO] --- maven-compiler-plugin:3.2:compile (default-compile) @ cloud-agent ---
[INFO] Changes detected - recompiling the module!
[INFO] Compiling 15 source files to <http://jenkins.buildacloud.org/job/build-master-simulator/ws/agent/target/classes>
[INFO] 
[INFO] --- maven-resources-plugin:2.5:testResources (default-testResources) @ cloud-agent
---
[debug] execute contextualize
[INFO] Using 'UTF-8' encoding to copy filtered resources.
[INFO] skip non existing resourceDirectory <http://jenkins.buildacloud.org/job/build-master-simulator/ws/agent/test/resources>
[INFO] Copying 3 resources
[INFO] 
[INFO] --- maven-compiler-plugin:3.2:testCompile (default-testCompile) @ cloud-agent ---
[INFO] Changes detected - recompiling the module!
[INFO] Compiling 2 source files to <http://jenkins.buildacloud.org/job/build-master-simulator/ws/agent/target/test-classes>
[INFO] 
[INFO] --- maven-surefire-plugin:2.18.1:test (default-test) @ cloud-agent ---
[INFO] Surefire report directory: <http://jenkins.buildacloud.org/job/build-master-simulator/ws/agent/target/surefire-reports>

-------------------------------------------------------
 T E S T S
-------------------------------------------------------
Running com.cloud.agent.AgentShellTest
log4j:WARN No appenders could be found for logger (com.cloud.agent.AgentShell).
log4j:WARN Please initialize the log4j system properly.
log4j:WARN See http://logging.apache.org/log4j/1.2/faq.html#noconfig for more info.
Tests run: 2, Failures: 0, Errors: 0, Skipped: 0, Time elapsed: 0.555 sec - in com.cloud.agent.AgentShellTest
Running com.cloud.agent.dao.impl.PropertiesStorageTest
Tests run: 2, Failures: 0, Errors: 0, Skipped: 0, Time elapsed: 0.306 sec - in com.cloud.agent.dao.impl.PropertiesStorageTest

Results :

Tests run: 4, Failures: 0, Errors: 0, Skipped: 0

[INFO]                                                                         
[INFO] ------------------------------------------------------------------------
[INFO] Building Apache CloudStack Framework - Clustering 4.6.0-SNAPSHOT
[INFO] ------------------------------------------------------------------------
[INFO] 
[INFO] --- maven-clean-plugin:2.5:clean (default-clean) @ cloud-framework-cluster ---
[INFO] Deleting <http://jenkins.buildacloud.org/job/build-master-simulator/ws/framework/cluster/target>
(includes = [**/*], excludes = [])
[INFO] Deleting <http://jenkins.buildacloud.org/job/build-master-simulator/ws/framework/cluster>
(includes = [target, dist], excludes = [])
[INFO] 
[INFO] --- maven-checkstyle-plugin:2.11:check (cloudstack-checkstyle) @ cloud-framework-cluster
---
[INFO] Starting audit...
Audit done.

[INFO] 
[INFO] --- maven-remote-resources-plugin:1.3:process (default) @ cloud-framework-cluster ---
[INFO] 
[INFO] --- maven-resources-plugin:2.5:resources (default-resources) @ cloud-framework-cluster
---
[debug] execute contextualize
[INFO] Using 'UTF-8' encoding to copy filtered resources.
[INFO] Copying 1 resource
[INFO] Copying 3 resources
[INFO] 
[INFO] --- maven-compiler-plugin:3.2:compile (default-compile) @ cloud-framework-cluster ---
[INFO] Changes detected - recompiling the module!
[INFO] Compiling 28 source files to <http://jenkins.buildacloud.org/job/build-master-simulator/ws/framework/cluster/target/classes>
[INFO] 
[INFO] --- maven-resources-plugin:2.5:testResources (default-testResources) @ cloud-framework-cluster
---
[debug] execute contextualize
[INFO] Using 'UTF-8' encoding to copy filtered resources.
[INFO] skip non existing resourceDirectory <http://jenkins.buildacloud.org/job/build-master-simulator/ws/framework/cluster/test/resources>
[INFO] Copying 3 resources
[INFO] 
[INFO] --- maven-compiler-plugin:3.2:testCompile (default-testCompile) @ cloud-framework-cluster
---
[INFO] No sources to compile
[INFO] 
[INFO] --- maven-surefire-plugin:2.18.1:test (default-test) @ cloud-framework-cluster ---
[INFO]                                                                         
[INFO] ------------------------------------------------------------------------
[INFO] Building Apache CloudStack Framework - Event Notification 4.6.0-SNAPSHOT
[INFO] ------------------------------------------------------------------------
[INFO] 
[INFO] --- maven-clean-plugin:2.5:clean (default-clean) @ cloud-framework-events ---
[INFO] Deleting <http://jenkins.buildacloud.org/job/build-master-simulator/ws/framework/events/target>
(includes = [**/*], excludes = [])
[INFO] Deleting <http://jenkins.buildacloud.org/job/build-master-simulator/ws/framework/events>
(includes = [target, dist], excludes = [])
[INFO] 
[INFO] --- maven-checkstyle-plugin:2.11:check (cloudstack-checkstyle) @ cloud-framework-events
---
[INFO] Starting audit...
Audit done.

[INFO] 
[INFO] --- maven-remote-resources-plugin:1.3:process (default) @ cloud-framework-events ---
[INFO] 
[INFO] --- maven-resources-plugin:2.5:resources (default-resources) @ cloud-framework-events
---
[debug] execute contextualize
[INFO] Using 'UTF-8' encoding to copy filtered resources.
[INFO] skip non existing resourceDirectory <http://jenkins.buildacloud.org/job/build-master-simulator/ws/framework/events/resources>
[INFO] Copying 3 resources
[INFO] 
[INFO] --- maven-compiler-plugin:3.2:compile (default-compile) @ cloud-framework-events ---
[INFO] Changes detected - recompiling the module!
[INFO] Compiling 5 source files to <http://jenkins.buildacloud.org/job/build-master-simulator/ws/framework/events/target/classes>
[INFO] 
[INFO] --- maven-resources-plugin:2.5:testResources (default-testResources) @ cloud-framework-events
---
[debug] execute contextualize
[INFO] Using 'UTF-8' encoding to copy filtered resources.
[INFO] skip non existing resourceDirectory <http://jenkins.buildacloud.org/job/build-master-simulator/ws/framework/events/test/resources>
[INFO] Copying 3 resources
[INFO] 
[INFO] --- maven-compiler-plugin:3.2:testCompile (default-testCompile) @ cloud-framework-events
---
[INFO] No sources to compile
[INFO] 
[INFO] --- maven-surefire-plugin:2.18.1:test (default-test) @ cloud-framework-events ---
[INFO]                                                                         
[INFO] ------------------------------------------------------------------------
[INFO] Building Apache CloudStack Cloud Engine Schema Component 4.6.0-SNAPSHOT
[INFO] ------------------------------------------------------------------------
[INFO] 
[INFO] --- maven-clean-plugin:2.5:clean (default-clean) @ cloud-engine-schema ---
[INFO] Deleting <http://jenkins.buildacloud.org/job/build-master-simulator/ws/engine/schema/target>
(includes = [**/*], excludes = [])
[INFO] Deleting <http://jenkins.buildacloud.org/job/build-master-simulator/ws/engine/schema>
(includes = [target, dist], excludes = [])
[INFO] 
[INFO] --- maven-checkstyle-plugin:2.11:check (cloudstack-checkstyle) @ cloud-engine-schema
---
[INFO] Starting audit...
Audit done.

[INFO] 
[INFO] --- maven-remote-resources-plugin:1.3:process (default) @ cloud-engine-schema ---
[INFO] 
[INFO] --- maven-resources-plugin:2.5:resources (default-resources) @ cloud-engine-schema
---
[debug] execute contextualize
[INFO] Using 'UTF-8' encoding to copy filtered resources.
[INFO] Copying 2 resources
[INFO] Copying 3 resources
[INFO] 
[INFO] --- maven-compiler-plugin:3.2:compile (default-compile) @ cloud-engine-schema ---
[INFO] Changes detected - recompiling the module!
[INFO] Compiling 663 source files to <http://jenkins.buildacloud.org/job/build-master-simulator/ws/engine/schema/target/classes>
Build timed out (after 7 minutes). Marking the build as failed.
Build was aborted
Recording test results
[INFO] ------------------------------------------------------------------------
[INFO] Reactor Summary:
[INFO] 
[INFO] Apache CloudStack Developer Tools - Checkstyle Configuration  SUCCESS [4.453s]
[INFO] Apache CloudStack ................................. SUCCESS [4.700s]
[INFO] Apache CloudStack Maven Conventions Parent ........ SUCCESS [7.062s]
[INFO] Apache CloudStack Framework - Managed Context ..... SUCCESS [15.846s]
[INFO] Apache CloudStack Utils ........................... SUCCESS [1:03.782s]
[INFO] Apache CloudStack Framework ....................... SUCCESS [0.162s]
[INFO] Apache CloudStack Framework - Event Notification .. SUCCESS [34.274s]
[INFO] Apache CloudStack Framework - Configuration ....... SUCCESS [22.734s]
[INFO] Apache CloudStack API ............................. SUCCESS [1:08.795s]
[INFO] Apache CloudStack Framework - REST ................ SUCCESS [14.542s]
[INFO] Apache CloudStack Framework - IPC ................. SUCCESS [20.034s]
[INFO] Apache CloudStack Cloud Engine .................... SUCCESS [0.111s]
[INFO] Apache CloudStack Cloud Engine API ................ SUCCESS [23.515s]
[INFO] Apache CloudStack Framework - Security ............ SUCCESS [11.782s]
[INFO] Apache CloudStack Core ............................ SUCCESS [51.080s]
[INFO] Apache CloudStack Agents .......................... SUCCESS [30.137s]
[INFO] Apache CloudStack Framework - Clustering .......... SUCCESS [14.059s]
[INFO] Apache CloudStack Framework - Event Notification .. SUCCESS [9.467s]
[INFO] Apache CloudStack Cloud Engine Schema Component ... FAILURE [31.249s]
[INFO] Apache CloudStack Framework - Jobs ................ SKIPPED
[INFO] Apache CloudStack Cloud Engine Internal Components API  SKIPPED
[INFO] Apache CloudStack Server .......................... SKIPPED
[INFO] Apache CloudStack Cloud Services .................. SKIPPED
[INFO] Apache CloudStack Secondary Storage ............... SKIPPED
[INFO] Apache CloudStack Secondary Storage Service ....... SKIPPED
[INFO] Apache CloudStack Engine Storage Component ........ SKIPPED
[INFO] Apache CloudStack Engine Storage Volume Component . SKIPPED
[INFO] Apache CloudStack Engine Storage Image Component .. SKIPPED
[INFO] Apache CloudStack Engine Storage Snapshot Component  SKIPPED
[INFO] Apache CloudStack Plugin POM ...................... SKIPPED
[INFO] Apache CloudStack Plugin - Hypervisor Simulator ... SKIPPED
[INFO] ------------------------------------------------------------------------
[INFO] BUILD FAILURE
[INFO] ------------------------------------------------------------------------
[INFO] Total time: 7:17.892s
[INFO] Finished at: Fri Jan 23 15:40:04 CET 2015
[INFO] Final Memory: 55M/322M
[INFO] ------------------------------------------------------------------------
[ERROR] Failed to execute goal org.apache.maven.plugins:maven-compiler-plugin:3.2:compile
(default-compile) on project cloud-engine-schema: Compilation failure -> [Help 1]
[ERROR] 
[ERROR] To see the full stack trace of the errors, re-run Maven with the -e switch.
[ERROR] Re-run Maven using the -X switch to enable full debug logging.
[ERROR] 
[ERROR] For more information about the errors and possible solutions, please read the following
articles:
[ERROR] [Help 1] http://cwiki.apache.org/confluence/display/MAVEN/MojoFailureException
[ERROR] 
[ERROR] After correcting the problems, you can resume the build with the command
[ERROR]   mvn <goals> -rf :cloud-engine-schema

Mime
View raw message