cloudstack-dev mailing list archives

Site index · List index
Message view « Date » · « Thread »
Top « Date » · « Thread »
From jenk...@cloudstack.org
Subject Build failed in Jenkins: simulator-singlerun #940
Date Thu, 29 Jan 2015 10:47:04 GMT
See <http://jenkins.buildacloud.org/job/simulator-singlerun/940/changes>

Changes:

[Rohit Yadav] use a preferable protocol that works on most infra

------------------------------------------
[...truncated 3449 lines...]
[INFO] --- maven-compiler-plugin:3.2:testCompile (default-testCompile) @ cloud-plugin-network-ovs
---
[INFO] No sources to compile
[INFO] 
[INFO] --- maven-surefire-plugin:2.18.1:test (default-test) @ cloud-plugin-network-ovs ---
[INFO] 
[INFO] --- maven-jar-plugin:2.5:jar (default-jar) @ cloud-plugin-network-ovs ---
[INFO] Building jar: <http://jenkins.buildacloud.org/job/simulator-singlerun/ws/plugins/network-elements/ovs/target/cloud-plugin-network-ovs-4.6.0-SNAPSHOT.jar>
[INFO] 
[INFO] --- maven-site-plugin:3.3:attach-descriptor (attach-descriptor) @ cloud-plugin-network-ovs
---
[INFO] 
[INFO] --- maven-install-plugin:2.3.1:install (default-install) @ cloud-plugin-network-ovs
---
[INFO] Installing <http://jenkins.buildacloud.org/job/simulator-singlerun/ws/plugins/network-elements/ovs/target/cloud-plugin-network-ovs-4.6.0-SNAPSHOT.jar>
to /var/lib/jenkins/.m2/repository/org/apache/cloudstack/cloud-plugin-network-ovs/4.6.0-SNAPSHOT/cloud-plugin-network-ovs-4.6.0-SNAPSHOT.jar
[INFO] Installing <http://jenkins.buildacloud.org/job/simulator-singlerun/ws/plugins/network-elements/ovs/pom.xml>
to /var/lib/jenkins/.m2/repository/org/apache/cloudstack/cloud-plugin-network-ovs/4.6.0-SNAPSHOT/cloud-plugin-network-ovs-4.6.0-SNAPSHOT.pom
[INFO]                                                                         
[INFO] ------------------------------------------------------------------------
[INFO] Building Apache CloudStack Plugin - Hypervisor XenServer 4.6.0-SNAPSHOT
[INFO] ------------------------------------------------------------------------
[INFO] 
[INFO] --- maven-clean-plugin:2.5:clean (default-clean) @ cloud-plugin-hypervisor-xenserver
---
[INFO] Deleting <http://jenkins.buildacloud.org/job/simulator-singlerun/ws/plugins/hypervisors/xenserver/target>
(includes = [**/*], excludes = [])
[INFO] Deleting <http://jenkins.buildacloud.org/job/simulator-singlerun/ws/plugins/hypervisors/xenserver>
(includes = [target, dist], excludes = [])
[INFO] 
[INFO] --- maven-checkstyle-plugin:2.11:check (cloudstack-checkstyle) @ cloud-plugin-hypervisor-xenserver
---
[INFO] Starting audit...
Audit done.

[INFO] 
[INFO] --- maven-remote-resources-plugin:1.3:process (default) @ cloud-plugin-hypervisor-xenserver
---
[INFO] 
[INFO] --- maven-resources-plugin:2.5:resources (default-resources) @ cloud-plugin-hypervisor-xenserver
---
[debug] execute contextualize
[INFO] Using 'UTF-8' encoding to copy filtered resources.
[INFO] Copying 4 resources
[INFO] Copying 3 resources
[INFO] 
[INFO] --- maven-compiler-plugin:3.2:compile (default-compile) @ cloud-plugin-hypervisor-xenserver
---
[INFO] Changes detected - recompiling the module!
[INFO] Compiling 21 source files to <http://jenkins.buildacloud.org/job/simulator-singlerun/ws/plugins/hypervisors/xenserver/target/classes>
[INFO] 
[INFO] --- maven-resources-plugin:2.5:testResources (default-testResources) @ cloud-plugin-hypervisor-xenserver
---
[debug] execute contextualize
[INFO] Using 'UTF-8' encoding to copy filtered resources.
[INFO] skip non existing resourceDirectory <http://jenkins.buildacloud.org/job/simulator-singlerun/ws/plugins/hypervisors/xenserver/test/resources>
[INFO] Copying 3 resources
[INFO] 
[INFO] --- maven-compiler-plugin:3.2:testCompile (default-testCompile) @ cloud-plugin-hypervisor-xenserver
---
[INFO] Changes detected - recompiling the module!
[INFO] Compiling 2 source files to <http://jenkins.buildacloud.org/job/simulator-singlerun/ws/plugins/hypervisors/xenserver/target/test-classes>
[INFO] 
[INFO] --- maven-surefire-plugin:2.18.1:test (default-test) @ cloud-plugin-hypervisor-xenserver
---
[INFO] Surefire report directory: <http://jenkins.buildacloud.org/job/simulator-singlerun/ws/plugins/hypervisors/xenserver/target/surefire-reports>

-------------------------------------------------------
 T E S T S
-------------------------------------------------------
Running com.cloud.ha.XenServerFencerTest
Tests run: 1, Failures: 0, Errors: 0, Skipped: 0, Time elapsed: 0.059 sec - in com.cloud.ha.XenServerFencerTest
Running com.cloud.hypervisor.xenserver.resource.CitrixResourceBaseTest
log4j:WARN No appenders could be found for logger (com.cloud.hypervisor.xenserver.resource.XenServerConnectionPool).
log4j:WARN Please initialize the log4j system properly.
log4j:WARN See http://logging.apache.org/log4j/1.2/faq.html#noconfig for more info.
Tests run: 4, Failures: 0, Errors: 0, Skipped: 0, Time elapsed: 1.16 sec - in com.cloud.hypervisor.xenserver.resource.CitrixResourceBaseTest

Results :

Tests run: 5, Failures: 0, Errors: 0, Skipped: 0

[INFO] 
[INFO] --- maven-jar-plugin:2.5:jar (default-jar) @ cloud-plugin-hypervisor-xenserver ---
[INFO] Building jar: <http://jenkins.buildacloud.org/job/simulator-singlerun/ws/plugins/hypervisors/xenserver/target/cloud-plugin-hypervisor-xenserver-4.6.0-SNAPSHOT.jar>
[INFO] 
[INFO] --- maven-site-plugin:3.3:attach-descriptor (attach-descriptor) @ cloud-plugin-hypervisor-xenserver
---
[INFO] 
[INFO] --- maven-install-plugin:2.3.1:install (default-install) @ cloud-plugin-hypervisor-xenserver
---
[INFO] Installing <http://jenkins.buildacloud.org/job/simulator-singlerun/ws/plugins/hypervisors/xenserver/target/cloud-plugin-hypervisor-xenserver-4.6.0-SNAPSHOT.jar>
to /var/lib/jenkins/.m2/repository/org/apache/cloudstack/cloud-plugin-hypervisor-xenserver/4.6.0-SNAPSHOT/cloud-plugin-hypervisor-xenserver-4.6.0-SNAPSHOT.jar
[INFO] Installing <http://jenkins.buildacloud.org/job/simulator-singlerun/ws/plugins/hypervisors/xenserver/pom.xml>
to /var/lib/jenkins/.m2/repository/org/apache/cloudstack/cloud-plugin-hypervisor-xenserver/4.6.0-SNAPSHOT/cloud-plugin-hypervisor-xenserver-4.6.0-SNAPSHOT.pom
[INFO]                                                                         
[INFO] ------------------------------------------------------------------------
[INFO] Building Apache CloudStack Plugin - Hypervisor KVM 4.6.0-SNAPSHOT
[INFO] ------------------------------------------------------------------------
[WARNING] The POM for org.libvirt:libvirt:jar:0.5.1 is missing, no dependency information
available
[INFO] 
[INFO] --- maven-clean-plugin:2.5:clean (default-clean) @ cloud-plugin-hypervisor-kvm ---
[INFO] Deleting <http://jenkins.buildacloud.org/job/simulator-singlerun/ws/plugins/hypervisors/kvm/target>
(includes = [**/*], excludes = [])
[INFO] Deleting <http://jenkins.buildacloud.org/job/simulator-singlerun/ws/plugins/hypervisors/kvm>
(includes = [target, dist], excludes = [])
[INFO] 
[INFO] --- maven-checkstyle-plugin:2.11:check (cloudstack-checkstyle) @ cloud-plugin-hypervisor-kvm
---
[INFO] Starting audit...
Audit done.

[INFO] 
[INFO] --- maven-remote-resources-plugin:1.3:process (default) @ cloud-plugin-hypervisor-kvm
---
[WARNING] Missing POM for org.libvirt:libvirt:jar:0.5.1
[INFO] 
[INFO] --- maven-resources-plugin:2.5:resources (default-resources) @ cloud-plugin-hypervisor-kvm
---
[debug] execute contextualize
[INFO] Using 'UTF-8' encoding to copy filtered resources.
[INFO] Copying 2 resources
[INFO] Copying 3 resources
[INFO] 
[INFO] --- maven-compiler-plugin:3.2:compile (default-compile) @ cloud-plugin-hypervisor-kvm
---
[INFO] Changes detected - recompiling the module!
[INFO] Compiling 37 source files to <http://jenkins.buildacloud.org/job/simulator-singlerun/ws/plugins/hypervisors/kvm/target/classes>
[INFO] -------------------------------------------------------------
[ERROR] COMPILATION ERROR : 
[INFO] -------------------------------------------------------------
[ERROR] <http://jenkins.buildacloud.org/job/simulator-singlerun/ws/plugins/hypervisors/kvm/src/com/cloud/hypervisor/kvm/resource/LibvirtComputingResource.java>:[4751,56]
error: cannot find symbol
[INFO] 1 error
[INFO] -------------------------------------------------------------
[INFO] ------------------------------------------------------------------------
[INFO] Reactor Summary:
[INFO] 
[INFO] Apache CloudStack Developer Tools - Checkstyle Configuration  SUCCESS [3.168s]
[INFO] Apache CloudStack ................................. SUCCESS [2.738s]
[INFO] Apache CloudStack Maven Conventions Parent ........ SUCCESS [1.428s]
[INFO] Apache CloudStack Framework - Managed Context ..... SUCCESS [4.890s]
[INFO] Apache CloudStack Utils ........................... SUCCESS [20.426s]
[INFO] Apache CloudStack Framework ....................... SUCCESS [0.096s]
[INFO] Apache CloudStack Framework - Event Notification .. SUCCESS [10.188s]
[INFO] Apache CloudStack Framework - Configuration ....... SUCCESS [6.367s]
[INFO] Apache CloudStack API ............................. SUCCESS [24.466s]
[INFO] Apache CloudStack Framework - REST ................ SUCCESS [3.839s]
[INFO] Apache CloudStack Framework - IPC ................. SUCCESS [6.145s]
[INFO] Apache CloudStack Cloud Engine .................... SUCCESS [0.054s]
[INFO] Apache CloudStack Cloud Engine API ................ SUCCESS [6.813s]
[INFO] Apache CloudStack Framework - Security ............ SUCCESS [3.390s]
[INFO] Apache CloudStack Core ............................ SUCCESS [33.126s]
[INFO] Apache CloudStack Agents .......................... SUCCESS [10.298s]
[INFO] Apache CloudStack Framework - Clustering .......... SUCCESS [5.318s]
[INFO] Apache CloudStack Framework - Event Notification .. SUCCESS [2.351s]
[INFO] Apache CloudStack Cloud Engine Schema Component ... SUCCESS [19.997s]
[INFO] Apache CloudStack Framework - Jobs ................ SUCCESS [6.919s]
[INFO] Apache CloudStack Cloud Engine Internal Components API  SUCCESS [3.937s]
[INFO] Apache CloudStack Server .......................... SUCCESS [1:02.511s]
[INFO] Apache CloudStack Usage Server .................... SUCCESS [11.036s]
[INFO] Apache CloudStack Cloud Engine Orchestration Component  SUCCESS [11.727s]
[INFO] Apache CloudStack Cloud Services .................. SUCCESS [0.056s]
[INFO] Apache CloudStack Secondary Storage ............... SUCCESS [0.417s]
[INFO] Apache CloudStack Secondary Storage Service ....... SUCCESS [7.767s]
[INFO] Apache CloudStack Engine Storage Component ........ SUCCESS [10.315s]
[INFO] Apache CloudStack Engine Storage Volume Component . SUCCESS [5.914s]
[INFO] Apache CloudStack Engine Storage Image Component .. SUCCESS [3.428s]
[INFO] Apache CloudStack Engine Storage Data Motion Component  SUCCESS [3.988s]
[INFO] Apache CloudStack Engine Storage Cache Component .. SUCCESS [2.688s]
[INFO] Apache CloudStack Engine Storage Snapshot Component  SUCCESS [12.877s]
[INFO] Apache CloudStack Cloud Engine API ................ SUCCESS [2.368s]
[INFO] Apache CloudStack Cloud Engine Service ............ SUCCESS [6.985s]
[INFO] Apache CloudStack Plugin POM ...................... SUCCESS [0.632s]
[INFO] Apache CloudStack Plugin - API Rate Limit ......... SUCCESS [8.759s]
[INFO] Apache CloudStack Plugin - Storage Volume default provider  SUCCESS [3.662s]
[INFO] Apache CloudStack Plugin - Storage Volume SolidFire Provider  SUCCESS [7.061s]
[INFO] Apache CloudStack Plugin - API SolidFire .......... SUCCESS [3.281s]
[INFO] Apache CloudStack Plugin - API Discovery .......... SUCCESS [5.813s]
[INFO] Apache CloudStack Plugin - ACL Static Role Based .. SUCCESS [2.495s]
[INFO] Apache CloudStack Plugin - Host Anti-Affinity Processor  SUCCESS [2.562s]
[INFO] Apache CloudStack Plugin - Explicit Dedication Processor  SUCCESS [3.008s]
[INFO] Apache CloudStack Plugin - User Concentrated Pod Deployment Planner  SUCCESS [2.406s]
[INFO] Apache CloudStack Plugin - User Dispersing Deployment Planner  SUCCESS [2.820s]
[INFO] Apache CloudStack Plugin - Implicit Dedication Planner  SUCCESS [8.925s]
[INFO] Apache CloudStack Plugin - Skip Heurestics Planner  SUCCESS [2.559s]
[INFO] Apache CloudStack Plugin - Host Allocator Random .. SUCCESS [2.640s]
[INFO] Apache CloudStack Plugin - Dedicated Resources .... SUCCESS [8.148s]
[INFO] Apache CloudStack Plugin - Hypervisor OracleVM .... SUCCESS [3.978s]
[INFO] Apache CloudStack Plugin - Open vSwitch ........... SUCCESS [4.568s]
[INFO] Apache CloudStack Plugin - Hypervisor XenServer ... SUCCESS [12.139s]
[INFO] Apache CloudStack Plugin - Hypervisor KVM ......... FAILURE [7.802s]
[INFO] Apache CloudStack Plugin - RabbitMQ Event Bus ..... SKIPPED
[INFO] Apache CloudStack Plugin - In Memory Event Bus .... SKIPPED
[INFO] Apache CloudStack Plugin - Hypervisor Baremetal ... SKIPPED
[INFO] Apache CloudStack Plugin - Hypervisor UCS ......... SKIPPED
[INFO] Apache CloudStack Plugin - Hypervisor Hyper-V ..... SKIPPED
[INFO] Apache CloudStack Plugin - Network Elastic Load Balancer  SKIPPED
[INFO] Apache CloudStack Plugin - Network Internal Load Balancer  SKIPPED
[INFO] Apache CloudStack Framework - Spring Life Cycle ... SKIPPED
[INFO] Apache CloudStack Plugin - Network Juniper Contrail  SKIPPED
[INFO] Apache CloudStack Plugin - Palo Alto .............. SKIPPED
[INFO] Apache CloudStack Plugin - Network Netscaler ...... SKIPPED
[INFO] Apache CloudStack Plugin - Network Nicira NVP ..... SKIPPED
[INFO] Apache CloudStack Plugin - BigSwitch Virtual Network Segment  SKIPPED
[INFO] Apache CloudStack Plugin - Network Brocade VCS .... SKIPPED
[INFO] Apache CloudStack Plugin - Midokura Midonet ....... SKIPPED
[INFO] Apache CloudStack Plugin - Stratosphere SSP ....... SKIPPED
[INFO] Apache CloudStack Plugin - Network Opendaylight ... SKIPPED
[INFO] Apache CloudStack Plugin - Storage Allocator Random  SKIPPED
[INFO] Apache CloudStack Plugin - User Authenticator LDAP  SKIPPED
[INFO] Apache CloudStack Plugin - User Authenticator MD5 . SKIPPED
[INFO] Apache CloudStack Plugin - User Authenticator Plain Text  SKIPPED
[INFO] Apache CloudStack Plugin - User Authenticator SAML2  SKIPPED
[INFO] Apache CloudStack Plugin - User Authenticator SHA256 Salted  SKIPPED
[INFO] Apache CloudStack Plugin - Dns Notifier Example ... SKIPPED
[INFO] Apache CloudStack Plugin - Storage Image S3 ....... SKIPPED
[INFO] Apache CloudStack Plugin - Storage Image Swift provider  SKIPPED
[INFO] Apache CloudStack Plugin - Storage Image default provider  SKIPPED
[INFO] Apache CloudStack Plugin - Storage Image sample provider  SKIPPED
[INFO] Apache CloudStack Plugin - Storage Volume Nexenta Provider  SKIPPED
[INFO] Apache CloudStack Plugin - Storage Volume CloudByte Provider  SKIPPED
[INFO] Apache CloudStack Plugin - Storage Volume sample provider  SKIPPED
[INFO] Apache CloudStack Plugin - SNMP Alerts ............ SKIPPED
[INFO] Apache CloudStack Plugin - Syslog Alerts .......... SKIPPED
[INFO] Apache CloudStack Plugin - Network VXLAN .......... SKIPPED
[INFO] Apache CloudStack Plugin - GloboDNS ............... SKIPPED
[INFO] Apache CloudStack Plugin - Hypervisor Simulator ... SKIPPED
[INFO] Apache CloudStack Framework - Spring Module ....... SKIPPED
[INFO] Apache CloudStack Secondary Storage Controller .... SKIPPED
[INFO] Apache CloudStack Console Proxy - RDP Client ...... SKIPPED
[INFO] Apache CloudStack Console Proxy ................... SKIPPED
[INFO] Apache CloudStack Console Proxy - Server .......... SKIPPED
[INFO] Apache CloudStack System VM ....................... SKIPPED
[INFO] Apache CloudStack Client UI ....................... SKIPPED
[INFO] Apache CloudStack Framework - QuickCloud .......... SKIPPED
[INFO] Apache CloudStack Test ............................ SKIPPED
[INFO] Apache CloudStack Developer Mode .................. SKIPPED
[INFO] Apache CloudStack Developer Tools ................. SKIPPED
[INFO] Apache CloudStack apidocs ......................... SKIPPED
[INFO] Apache CloudStack marvin .......................... SKIPPED
[INFO] Apache CloudStack DevCloud ........................ SKIPPED
[INFO] Apache CloudStack DevCloud-KVM .................... SKIPPED
[INFO] ------------------------------------------------------------------------
[INFO] BUILD FAILURE
[INFO] ------------------------------------------------------------------------
[INFO] Total time: 6:54.769s
[INFO] Finished at: Thu Jan 29 05:47:25 EST 2015
[INFO] Final Memory: 70M/394M
[INFO] ------------------------------------------------------------------------
[ERROR] Failed to execute goal org.apache.maven.plugins:maven-compiler-plugin:3.2:compile
(default-compile) on project cloud-plugin-hypervisor-kvm: Compilation failure
[ERROR] <http://jenkins.buildacloud.org/job/simulator-singlerun/ws/plugins/hypervisors/kvm/src/com/cloud/hypervisor/kvm/resource/LibvirtComputingResource.java>:[4751,56]
error: cannot find symbol
[ERROR] -> [Help 1]
[ERROR] 
[ERROR] To see the full stack trace of the errors, re-run Maven with the -e switch.
[ERROR] Re-run Maven using the -X switch to enable full debug logging.
[ERROR] 
[ERROR] For more information about the errors and possible solutions, please read the following
articles:
[ERROR] [Help 1] http://cwiki.apache.org/confluence/display/MAVEN/MojoFailureException
[ERROR] 
[ERROR] After correcting the problems, you can resume the build with the command
[ERROR]   mvn <goals> -rf :cloud-plugin-hypervisor-kvm
Build step 'Invoke top-level Maven targets' marked build as failure
[locks-and-latches] Releasing all the locks
[locks-and-latches] All the locks released
[xUnit] [INFO] - Starting to record.
[xUnit] [INFO] - Processing JUnit
[xUnit] [INFO] - [JUnit] - 1 test report file(s) were found with the pattern 'xunit.xml' relative
to '<http://jenkins.buildacloud.org/job/simulator-singlerun/ws/'> for the testing framework
'JUnit'.
[xUnit] [ERROR] - Test reports were found but not all of them are new. Did all the tests run?
  * <http://jenkins.buildacloud.org/job/simulator-singlerun/ws/xunit.xml> is 15 hr old

[xUnit] [INFO] - Failing BUILD.
[xUnit] [INFO] - There are errors when processing test results.
[xUnit] [INFO] - Skipping tests recording.
[xUnit] [INFO] - Stop build.

Mime
View raw message