cloudstack-dev mailing list archives

Site index · List index
Message view « Date » · « Thread »
Top « Date » · « Thread »
From jenk...@cloudstack.org
Subject Build failed in Jenkins: build-master-noredist #4018
Date Wed, 07 Jan 2015 17:08:01 GMT
See <http://jenkins.buildacloud.org/job/build-master-noredist/4018/changes>

Changes:

[brian.federle] UI validation: Fix asterisk showing up on non-required fields

------------------------------------------
[...truncated 7710 lines...]
[INFO] Tests are skipped.
[INFO] 
[INFO] --- maven-install-plugin:2.3.1:install (default-install) @ cloud-plugin-storage-volume-solidfire
---
[INFO] Installing <http://jenkins.buildacloud.org/job/build-master-noredist/ws/plugins/storage/volume/solidfire/target/cloud-plugin-storage-volume-solidfire-4.6.0-SNAPSHOT.jar>
to /jenkins/.m2/repository/org/apache/cloudstack/cloud-plugin-storage-volume-solidfire/4.6.0-SNAPSHOT/cloud-plugin-storage-volume-solidfire-4.6.0-SNAPSHOT.jar
[INFO] Installing <http://jenkins.buildacloud.org/job/build-master-noredist/ws/plugins/storage/volume/solidfire/pom.xml>
to /jenkins/.m2/repository/org/apache/cloudstack/cloud-plugin-storage-volume-solidfire/4.6.0-SNAPSHOT/cloud-plugin-storage-volume-solidfire-4.6.0-SNAPSHOT.pom
[INFO]                                                                         
[INFO] ------------------------------------------------------------------------
[INFO] Building Apache CloudStack Plugin - API SolidFire 4.6.0-SNAPSHOT
[INFO] ------------------------------------------------------------------------
[INFO] 
[INFO] --- maven-site-plugin:3.3:attach-descriptor (attach-descriptor) @ cloud-plugin-storage-volume-cloudbyte
---
[INFO] 
[INFO] --- maven-surefire-plugin:2.18.1:test (default) @ cloud-plugin-storage-volume-cloudbyte
---
[INFO] Tests are skipped.
[INFO] 
[INFO] --- maven-install-plugin:2.3.1:install (default-install) @ cloud-plugin-storage-volume-cloudbyte
---
[INFO] Installing <http://jenkins.buildacloud.org/job/build-master-noredist/ws/plugins/storage/volume/cloudbyte/target/cloud-plugin-storage-volume-cloudbyte-4.6.0-SNAPSHOT.jar>
to /jenkins/.m2/repository/org/apache/cloudstack/cloud-plugin-storage-volume-cloudbyte/4.6.0-SNAPSHOT/cloud-plugin-storage-volume-cloudbyte-4.6.0-SNAPSHOT.jar
[INFO] Installing <http://jenkins.buildacloud.org/job/build-master-noredist/ws/plugins/storage/volume/cloudbyte/pom.xml>
to /jenkins/.m2/repository/org/apache/cloudstack/cloud-plugin-storage-volume-cloudbyte/4.6.0-SNAPSHOT/cloud-plugin-storage-volume-cloudbyte-4.6.0-SNAPSHOT.pom
[INFO] 
[INFO] --- maven-clean-plugin:2.5:clean (default-clean) @ cloud-plugin-api-solidfire-intg-test
---
[INFO] Deleting <http://jenkins.buildacloud.org/job/build-master-noredist/ws/plugins/api/solidfire-intg-test/target>
(includes = [**/*], excludes = [])
[INFO] Deleting <http://jenkins.buildacloud.org/job/build-master-noredist/ws/plugins/api/solidfire-intg-test>
(includes = [target, dist], excludes = [])
[INFO] 
[INFO] --- maven-checkstyle-plugin:2.11:check (cloudstack-checkstyle) @ cloud-plugin-api-solidfire-intg-test
---
[INFO] 
[INFO] --- maven-resources-plugin:2.5:resources (default-resources) @ cloud-plugin-network-contrail
---
[debug] execute contextualize
[INFO] Using 'UTF-8' encoding to copy filtered resources.
[INFO] Copying 3 resources
[INFO] Copying 3 resources
[INFO] 
[INFO] --- maven-compiler-plugin:3.2:compile (default-compile) @ cloud-plugin-network-contrail
---
[INFO] Changes detected - recompiling the module!
[INFO] Compiling 30 source files to <http://jenkins.buildacloud.org/job/build-master-noredist/ws/plugins/network-elements/juniper-contrail/target/classes>
[INFO] Starting audit...
Audit done.

[INFO] 
[INFO] --- maven-remote-resources-plugin:1.3:process (default) @ cloud-plugin-api-solidfire-intg-test
---
[INFO] 
[INFO] --- maven-resources-plugin:2.5:testResources (default-testResources) @ cloud-plugin-storage-image-sample
---
[debug] execute contextualize
[INFO] Using 'UTF-8' encoding to copy filtered resources.
[INFO] skip non existing resourceDirectory <http://jenkins.buildacloud.org/job/build-master-noredist/ws/plugins/storage/image/sample/test/resources>
[INFO] Copying 3 resources
[INFO] 
[INFO] --- maven-compiler-plugin:3.2:testCompile (default-testCompile) @ cloud-plugin-storage-image-sample
---
[INFO] No sources to compile
[INFO] 
[INFO] --- maven-surefire-plugin:2.18.1:test (default-test) @ cloud-plugin-storage-image-sample
---
[INFO] Tests are skipped.
[INFO] 
[INFO] --- maven-jar-plugin:2.5:jar (default-jar) @ cloud-plugin-storage-image-sample ---
[INFO] Building jar: <http://jenkins.buildacloud.org/job/build-master-noredist/ws/plugins/storage/image/sample/target/cloud-plugin-storage-image-sample-4.6.0-SNAPSHOT.jar>
[INFO] 
[INFO] --- maven-site-plugin:3.3:attach-descriptor (attach-descriptor) @ cloud-plugin-storage-image-sample
---
[INFO] 
[INFO] --- maven-surefire-plugin:2.18.1:test (default) @ cloud-plugin-storage-image-sample
---
[INFO] Tests are skipped.
[INFO] 
[INFO] --- maven-install-plugin:2.3.1:install (default-install) @ cloud-plugin-storage-image-sample
---
[INFO] Installing <http://jenkins.buildacloud.org/job/build-master-noredist/ws/plugins/storage/image/sample/target/cloud-plugin-storage-image-sample-4.6.0-SNAPSHOT.jar>
to /jenkins/.m2/repository/org/apache/cloudstack/cloud-plugin-storage-image-sample/4.6.0-SNAPSHOT/cloud-plugin-storage-image-sample-4.6.0-SNAPSHOT.jar
[INFO] Installing <http://jenkins.buildacloud.org/job/build-master-noredist/ws/plugins/storage/image/sample/pom.xml>
to /jenkins/.m2/repository/org/apache/cloudstack/cloud-plugin-storage-image-sample/4.6.0-SNAPSHOT/cloud-plugin-storage-image-sample-4.6.0-SNAPSHOT.pom
[INFO] 
[INFO] --- maven-resources-plugin:2.5:resources (default-resources) @ cloud-plugin-api-solidfire-intg-test
---
[debug] execute contextualize
[INFO] Using 'UTF-8' encoding to copy filtered resources.
[INFO] Copying 2 resources
[INFO] Copying 3 resources
[INFO] 
[INFO] --- maven-compiler-plugin:3.2:compile (default-compile) @ cloud-plugin-api-solidfire-intg-test
---
[INFO] Changes detected - recompiling the module!
[INFO] Compiling 10 source files to <http://jenkins.buildacloud.org/job/build-master-noredist/ws/plugins/api/solidfire-intg-test/target/classes>
[INFO] -------------------------------------------------------------
[ERROR] COMPILATION ERROR : 
[INFO] -------------------------------------------------------------
[ERROR] error: error reading /jenkins/.m2/repository/org/apache/commons/commons-exec/1.3/commons-exec-1.3.jar;
error in opening zip file
[INFO] 1 error
[INFO] -------------------------------------------------------------
Tests run: 3, Failures: 0, Errors: 0, Skipped: 0, Time elapsed: 2.648 sec - in com.cloud.hypervisor.vmware.VmwareDatacenterApiUnitTest
Running org.apache.cloudstack.storage.motion.VmwareStorageMotionStrategyTest
Tests run: 6, Failures: 0, Errors: 0, Skipped: 0, Time elapsed: 0.585 sec - in org.apache.cloudstack.storage.motion.VmwareStorageMotionStrategyTest

Results :

Tests run: 10, Failures: 0, Errors: 0, Skipped: 0

[INFO] 
[INFO] --- maven-jar-plugin:2.5:jar (default-jar) @ cloud-plugin-hypervisor-vmware ---
[INFO] Building jar: <http://jenkins.buildacloud.org/job/build-master-noredist/ws/plugins/hypervisors/vmware/target/cloud-plugin-hypervisor-vmware-4.6.0-SNAPSHOT.jar>
[INFO] 
[INFO] --- maven-site-plugin:3.3:attach-descriptor (attach-descriptor) @ cloud-plugin-hypervisor-vmware
---
[INFO] 
[INFO] --- maven-install-plugin:2.3.1:install (default-install) @ cloud-plugin-hypervisor-vmware
---
[INFO] Installing <http://jenkins.buildacloud.org/job/build-master-noredist/ws/plugins/hypervisors/vmware/target/cloud-plugin-hypervisor-vmware-4.6.0-SNAPSHOT.jar>
to /jenkins/.m2/repository/org/apache/cloudstack/cloud-plugin-hypervisor-vmware/4.6.0-SNAPSHOT/cloud-plugin-hypervisor-vmware-4.6.0-SNAPSHOT.jar
[INFO] Installing <http://jenkins.buildacloud.org/job/build-master-noredist/ws/plugins/hypervisors/vmware/pom.xml>
to /jenkins/.m2/repository/org/apache/cloudstack/cloud-plugin-hypervisor-vmware/4.6.0-SNAPSHOT/cloud-plugin-hypervisor-vmware-4.6.0-SNAPSHOT.pom
[INFO] 
[INFO] --- maven-resources-plugin:2.5:testResources (default-testResources) @ cloud-plugin-api-solidfire-intg-test
---
[debug] execute contextualize
[INFO] Using 'UTF-8' encoding to copy filtered resources.
[INFO] skip non existing resourceDirectory <http://jenkins.buildacloud.org/job/build-master-noredist/ws/plugins/api/solidfire-intg-test/test/resources>
[INFO] Copying 3 resources
[INFO] 
[INFO] --- maven-compiler-plugin:3.2:testCompile (default-testCompile) @ cloud-plugin-api-solidfire-intg-test
---
[INFO] No sources to compile
[INFO] 
[INFO] --- maven-surefire-plugin:2.18.1:test (default-test) @ cloud-plugin-api-solidfire-intg-test
---
[INFO] 
[INFO] --- maven-jar-plugin:2.5:jar (default-jar) @ cloud-plugin-api-solidfire-intg-test ---
[INFO] Building jar: <http://jenkins.buildacloud.org/job/build-master-noredist/ws/plugins/api/solidfire-intg-test/target/cloud-plugin-api-solidfire-intg-test-4.6.0-SNAPSHOT.jar>
[INFO] 
[INFO] --- maven-site-plugin:3.3:attach-descriptor (attach-descriptor) @ cloud-plugin-api-solidfire-intg-test
---
[INFO] 
[INFO] --- maven-install-plugin:2.3.1:install (default-install) @ cloud-plugin-api-solidfire-intg-test
---
[INFO] Installing <http://jenkins.buildacloud.org/job/build-master-noredist/ws/plugins/api/solidfire-intg-test/target/cloud-plugin-api-solidfire-intg-test-4.6.0-SNAPSHOT.jar>
to /jenkins/.m2/repository/org/apache/cloudstack/cloud-plugin-api-solidfire-intg-test/4.6.0-SNAPSHOT/cloud-plugin-api-solidfire-intg-test-4.6.0-SNAPSHOT.jar
[INFO] Installing <http://jenkins.buildacloud.org/job/build-master-noredist/ws/plugins/api/solidfire-intg-test/pom.xml>
to /jenkins/.m2/repository/org/apache/cloudstack/cloud-plugin-api-solidfire-intg-test/4.6.0-SNAPSHOT/cloud-plugin-api-solidfire-intg-test-4.6.0-SNAPSHOT.pom
[INFO] ------------------------------------------------------------------------
[INFO] Reactor Summary:
[INFO] 
[INFO] Apache CloudStack Developer Tools - Checkstyle Configuration  SUCCESS [0.777s]
[INFO] Apache CloudStack ................................. SUCCESS [1.318s]
[INFO] Apache CloudStack Maven Conventions Parent ........ SUCCESS [1.357s]
[INFO] Apache CloudStack Framework - Managed Context ..... SUCCESS [4.662s]
[INFO] Apache CloudStack Utils ........................... SUCCESS [12.451s]
[INFO] Apache CloudStack Framework ....................... SUCCESS [0.431s]
[INFO] Apache CloudStack Framework - Event Notification .. SUCCESS [9.406s]
[INFO] Apache CloudStack Framework - Configuration ....... SUCCESS [3.761s]
[INFO] Apache CloudStack API ............................. SUCCESS [12.380s]
[INFO] Apache CloudStack Framework - REST ................ SUCCESS [5.733s]
[INFO] Apache CloudStack Framework - IPC ................. SUCCESS [5.017s]
[INFO] Apache CloudStack Cloud Engine .................... SUCCESS [0.430s]
[INFO] Apache CloudStack Cloud Engine API ................ SUCCESS [4.744s]
[INFO] Apache CloudStack Framework - Security ............ SUCCESS [2.691s]
[INFO] Apache CloudStack Core ............................ SUCCESS [21.873s]
[INFO] Apache CloudStack Agents .......................... SUCCESS [7.773s]
[INFO] Apache CloudStack Framework - Clustering .......... SUCCESS [3.384s]
[INFO] Apache CloudStack Framework - Event Notification .. SUCCESS [3.301s]
[INFO] Apache CloudStack Cloud Engine Schema Component ... SUCCESS [14.080s]
[INFO] Apache CloudStack Framework - Jobs ................ SUCCESS [6.888s]
[INFO] Apache CloudStack Cloud Engine Internal Components API  SUCCESS [2.666s]
[INFO] Apache CloudStack Server .......................... SUCCESS [37.502s]
[INFO] Apache CloudStack Usage Server .................... SUCCESS [9.804s]
[INFO] Apache CloudStack Cloud Engine Orchestration Component  SUCCESS [11.739s]
[INFO] Apache CloudStack Cloud Services .................. SUCCESS [0.429s]
[INFO] Apache CloudStack Secondary Storage ............... SUCCESS [3.656s]
[INFO] Apache CloudStack Secondary Storage Service ....... SUCCESS [12.247s]
[INFO] Apache CloudStack Engine Storage Component ........ SUCCESS [16.524s]
[INFO] Apache CloudStack Engine Storage Volume Component . SUCCESS [13.849s]
[INFO] Apache CloudStack Engine Storage Image Component .. SUCCESS [9.543s]
[INFO] Apache CloudStack Engine Storage Data Motion Component  SUCCESS [8.905s]
[INFO] Apache CloudStack Engine Storage Cache Component .. SUCCESS [7.253s]
[INFO] Apache CloudStack Engine Storage Snapshot Component  SUCCESS [28.358s]
[INFO] Apache CloudStack Cloud Engine API ................ SUCCESS [3.340s]
[INFO] Apache CloudStack Cloud Engine Service ............ SUCCESS [18.722s]
[INFO] Apache CloudStack Plugin POM ...................... SUCCESS [0.434s]
[INFO] Apache CloudStack Plugin - API Rate Limit ......... SUCCESS [19.702s]
[INFO] Apache CloudStack Plugin - Storage Volume default provider  SUCCESS [9.220s]
[INFO] Apache CloudStack Plugin - Storage Volume SolidFire Provider  SUCCESS [14.925s]
[INFO] Apache CloudStack Plugin - API SolidFire .......... SUCCESS [3.495s]
[INFO] Apache CloudStack Plugin - API Discovery .......... SUCCESS [14.373s]
[INFO] Apache CloudStack Plugin - ACL Static Role Based .. SUCCESS [7.708s]
[INFO] Apache CloudStack Plugin - Host Anti-Affinity Processor  SUCCESS [8.288s]
[INFO] Apache CloudStack Plugin - Explicit Dedication Processor  SUCCESS [8.073s]
[INFO] Apache CloudStack Plugin - User Concentrated Pod Deployment Planner  SUCCESS [8.184s]
[INFO] Apache CloudStack Plugin - User Dispersing Deployment Planner  SUCCESS [6.409s]
[INFO] Apache CloudStack Plugin - Implicit Dedication Planner  SUCCESS [22.500s]
[INFO] Apache CloudStack Plugin - Skip Heurestics Planner  SUCCESS [7.033s]
[INFO] Apache CloudStack Plugin - Host Allocator Random .. SUCCESS [6.688s]
[INFO] Apache CloudStack Plugin - Dedicated Resources .... SUCCESS [21.480s]
[INFO] Apache CloudStack Plugin - Hypervisor OracleVM .... SUCCESS [8.539s]
[INFO] Apache CloudStack Plugin - Open vSwitch ........... SUCCESS [9.568s]
[INFO] Apache CloudStack Plugin - Hypervisor XenServer ... SUCCESS [29.116s]
[INFO] Apache CloudStack Plugin - Hypervisor KVM ......... SUCCESS [21.776s]
[INFO] Apache CloudStack Plugin - RabbitMQ Event Bus ..... SUCCESS [6.077s]
[INFO] Apache CloudStack Plugin - In Memory Event Bus .... SUCCESS [14.496s]
[INFO] Apache CloudStack Plugin - Hypervisor Baremetal ... SUCCESS [13.955s]
[INFO] Apache CloudStack Plugin - Hypervisor UCS ......... SUCCESS [8.854s]
[INFO] Apache CloudStack Plugin - Hypervisor Hyper-V ..... SUCCESS [14.312s]
[INFO] Apache CloudStack Plugin - Network Elastic Load Balancer  SUCCESS [17.943s]
[INFO] Apache CloudStack Plugin - Network Internal Load Balancer  SUCCESS [28.043s]
[INFO] Apache CloudStack Framework - Spring Life Cycle ... SUCCESS [2.247s]
[INFO] Apache CloudStack Plugin - Network Juniper Contrail  FAILURE [3.732s]
[INFO] Apache CloudStack Plugin - Palo Alto .............. SUCCESS [23.220s]
[INFO] Apache CloudStack Plugin - Network Netscaler ...... SUCCESS [12.083s]
[INFO] Apache CloudStack Plugin - Network Nicira NVP ..... SUCCESS [35.458s]
[INFO] Apache CloudStack Plugin - BigSwitch Virtual Network Segment  SUCCESS [19.065s]
[INFO] Apache CloudStack Plugin - Network Brocade VCS .... SUCCESS [26.511s]
[INFO] Apache CloudStack Plugin - Midokura Midonet ....... SUCCESS [21.039s]
[INFO] Apache CloudStack Plugin - Stratosphere SSP ....... SUCCESS [19.674s]
[INFO] Apache CloudStack Plugin - Network Opendaylight ... SUCCESS [18.585s]
[INFO] Apache CloudStack Plugin - Storage Allocator Random  SUCCESS [5.784s]
[INFO] Apache CloudStack Plugin - User Authenticator LDAP  SUCCESS [9.193s]
[INFO] Apache CloudStack Plugin - User Authenticator MD5 . SUCCESS [13.999s]
[INFO] Apache CloudStack Plugin - User Authenticator Plain Text  SUCCESS [5.009s]
[INFO] Apache CloudStack Plugin - User Authenticator SAML2  SUCCESS [31.914s]
[INFO] Apache CloudStack Plugin - User Authenticator SHA256 Salted  SUCCESS [15.268s]
[INFO] Apache CloudStack Plugin - Dns Notifier Example ... SUCCESS [5.929s]
[INFO] Apache CloudStack Plugin - Storage Image S3 ....... SUCCESS [6.598s]
[INFO] Apache CloudStack Plugin - Storage Image Swift provider  SUCCESS [6.721s]
[INFO] Apache CloudStack Plugin - Storage Image default provider  SUCCESS [6.292s]
[INFO] Apache CloudStack Plugin - Storage Image sample provider  SUCCESS [6.351s]
[INFO] Apache CloudStack Plugin - Storage Volume Nexenta Provider  SUCCESS [13.790s]
[INFO] Apache CloudStack Plugin - Storage Volume CloudByte Provider  SUCCESS [9.755s]
[INFO] Apache CloudStack Plugin - Storage Volume sample provider  SUCCESS [6.568s]
[INFO] Apache CloudStack Plugin - SNMP Alerts ............ SUCCESS [14.200s]
[INFO] Apache CloudStack Plugin - Syslog Alerts .......... SUCCESS [12.081s]
[INFO] Apache CloudStack Plugin - Network VXLAN .......... SUCCESS [16.118s]
[INFO] Apache CloudStack Plugin - GloboDNS ............... SUCCESS [23.798s]
[INFO] Apache CloudStack Plugin - NetApp File System ..... SUCCESS [8.589s]
[INFO] Apache CloudStack Plugin - F5 ..................... SUCCESS [8.665s]
[INFO] Apache CloudStack Plugin - Juniper SRX ............ SUCCESS [10.085s]
[INFO] Apache CloudStack Plugin - Nuage VSP .............. SUCCESS [18.520s]
[INFO] Apache CloudStack VMware Base ..................... SUCCESS [7.528s]
[INFO] Apache CloudStack Plugin - Hypervisor VMware ...... SUCCESS [34.019s]
[INFO] Apache CloudStack Plugin - Cisco VNMC ............. SKIPPED
[INFO] Apache CloudStack Plugin - MySQL HA Strategy ...... SUCCESS [6.065s]
[INFO] Apache CloudStack Framework - Spring Module ....... SUCCESS [9.347s]
[INFO] Apache CloudStack Secondary Storage Controller .... SUCCESS [6.477s]
[INFO] Apache CloudStack Console Proxy - RDP Client ...... SUCCESS [12.201s]
[INFO] Apache CloudStack Console Proxy ................... SUCCESS [3.437s]
[INFO] Apache CloudStack Console Proxy - Server .......... SUCCESS [7.536s]
[INFO] Apache CloudStack System VM ....................... SKIPPED
[INFO] Apache CloudStack Client UI ....................... SKIPPED
[INFO] Apache CloudStack Framework - QuickCloud .......... SUCCESS [1.412s]
[INFO] Apache CloudStack AWS API Bridge .................. SKIPPED
[INFO] ------------------------------------------------------------------------
[INFO] BUILD FAILURE
[INFO] ------------------------------------------------------------------------
[INFO] Total time: 4:12.983s (Wall Clock)
[INFO] Finished at: Wed Jan 07 18:07:59 CET 2015
[INFO] Final Memory: 105M/449M
[INFO] ------------------------------------------------------------------------
[ERROR] Failed to execute goal org.apache.maven.plugins:maven-compiler-plugin:3.2:compile
(default-compile) on project cloud-plugin-network-contrail: Compilation failure
[ERROR] error: error reading /jenkins/.m2/repository/org/apache/commons/commons-exec/1.3/commons-exec-1.3.jar;
error in opening zip file
[ERROR] -> [Help 1]
[ERROR] 
[ERROR] To see the full stack trace of the errors, re-run Maven with the -e switch.
[ERROR] Re-run Maven using the -X switch to enable full debug logging.
[ERROR] 
[ERROR] For more information about the errors and possible solutions, please read the following
articles:
[ERROR] [Help 1] http://cwiki.apache.org/confluence/display/MAVEN/MojoFailureException
[ERROR] 
[ERROR] After correcting the problems, you can resume the build with the command
[ERROR]   mvn <goals> -rf :cloud-plugin-network-contrail
Destroying 1 processes
Destroying process..
Destroyed 1 processes
Build step 'Invoke top-level Maven targets' marked build as failure
Archiving artifacts

Mime
View raw message