cloudstack-dev mailing list archives

Site index · List index
Message view « Date » · « Thread »
Top « Date » · « Thread »
From jenk...@cloudstack.org
Subject Build failed in Jenkins: build-master-noredist #3943
Date Thu, 11 Dec 2014 19:58:45 GMT
See <http://jenkins.buildacloud.org/job/build-master-noredist/3943/changes>

Changes:

[w.zhou] CLOUDSTACK-8051: fix NPE in updateNetwork due to static nat rules exist but no StaticNat
provider

[min.chen] CLOUDSTACK-8061: Extracting volume when it is in migrating state causes

------------------------------------------
[...truncated 7844 lines...]
[INFO] 
[INFO] --- maven-site-plugin:3.3:attach-descriptor (attach-descriptor) @ cloud-plugin-storage-image-s3
---
[INFO] 
[INFO] --- maven-install-plugin:2.3.1:install (default-install) @ cloud-plugin-storage-image-s3
---
[INFO] Installing <http://jenkins.buildacloud.org/job/build-master-noredist/ws/plugins/storage/image/s3/target/cloud-plugin-storage-image-s3-4.6.0-SNAPSHOT.jar>
to /jenkins/.m2/repository/org/apache/cloudstack/cloud-plugin-storage-image-s3/4.6.0-SNAPSHOT/cloud-plugin-storage-image-s3-4.6.0-SNAPSHOT.jar
[INFO] Installing <http://jenkins.buildacloud.org/job/build-master-noredist/ws/plugins/storage/image/s3/pom.xml>
to /jenkins/.m2/repository/org/apache/cloudstack/cloud-plugin-storage-image-s3/4.6.0-SNAPSHOT/cloud-plugin-storage-image-s3-4.6.0-SNAPSHOT.pom
[INFO]                                                                         
[INFO] ------------------------------------------------------------------------
[INFO] Building Apache CloudStack Plugin - Network Juniper Contrail 4.6.0-SNAPSHOT
[INFO] ------------------------------------------------------------------------
[WARNING] The POM for net.juniper.contrail:juniper-contrail-api:jar:1.0-SNAPSHOT is missing,
no dependency information available
[INFO] 
[INFO] --- maven-resources-plugin:2.5:resources (default-resources) @ cloud-plugin-storage-image-sample
---
[debug] execute contextualize
[INFO] Using 'UTF-8' encoding to copy filtered resources.
[INFO] skip non existing resourceDirectory <http://jenkins.buildacloud.org/job/build-master-noredist/ws/plugins/storage/image/sample/resources>
[INFO] Copying 3 resources
[INFO] 
[INFO] --- maven-compiler-plugin:2.5.1:compile (default-compile) @ cloud-plugin-storage-image-sample
---
[INFO] Compiling 3 source files to <http://jenkins.buildacloud.org/job/build-master-noredist/ws/plugins/storage/image/sample/target/classes>
[INFO] 
[INFO] --- maven-surefire-plugin:2.12:test (default-test) @ cloud-plugin-storage-volume-nexenta
---
[INFO] Tests are skipped.
[INFO] 
[INFO] --- maven-jar-plugin:2.4:jar (default-jar) @ cloud-plugin-storage-volume-nexenta ---
[INFO] Building jar: <http://jenkins.buildacloud.org/job/build-master-noredist/ws/plugins/storage/volume/nexenta/target/cloud-plugin-storage-volume-nexenta-4.6.0-SNAPSHOT.jar>
[INFO] Starting audit...
Audit done.

[INFO] 
[INFO] --- maven-remote-resources-plugin:1.3:process (default) @ cloud-plugin-storage-volume-cloudbyte
---
[INFO] 
[INFO] --- maven-site-plugin:3.3:attach-descriptor (attach-descriptor) @ cloud-plugin-storage-volume-nexenta
---
[INFO] 
[INFO] --- maven-surefire-plugin:2.12:test (default) @ cloud-plugin-storage-volume-nexenta
---
[INFO] Tests are skipped.
[INFO] 
[INFO] --- maven-install-plugin:2.3.1:install (default-install) @ cloud-plugin-storage-volume-nexenta
---
[INFO] Installing <http://jenkins.buildacloud.org/job/build-master-noredist/ws/plugins/storage/volume/nexenta/target/cloud-plugin-storage-volume-nexenta-4.6.0-SNAPSHOT.jar>
to /jenkins/.m2/repository/org/apache/cloudstack/cloud-plugin-storage-volume-nexenta/4.6.0-SNAPSHOT/cloud-plugin-storage-volume-nexenta-4.6.0-SNAPSHOT.jar
[INFO] Installing <http://jenkins.buildacloud.org/job/build-master-noredist/ws/plugins/storage/volume/nexenta/pom.xml>
to /jenkins/.m2/repository/org/apache/cloudstack/cloud-plugin-storage-volume-nexenta/4.6.0-SNAPSHOT/cloud-plugin-storage-volume-nexenta-4.6.0-SNAPSHOT.pom
[INFO] 
[INFO] --- maven-resources-plugin:2.5:resources (default-resources) @ cloud-plugin-storage-volume-solidfire
---
[debug] execute contextualize
[INFO] Using 'UTF-8' encoding to copy filtered resources.
[INFO] Copying 2 resources
[INFO] Copying 3 resources
[INFO] 
[INFO] --- maven-compiler-plugin:2.5.1:compile (default-compile) @ cloud-plugin-storage-volume-solidfire
---
[INFO] Compiling 9 source files to <http://jenkins.buildacloud.org/job/build-master-noredist/ws/plugins/storage/volume/solidfire/target/classes>
[INFO] 
[INFO] --- maven-resources-plugin:2.5:resources (default-resources) @ cloud-plugin-storage-volume-cloudbyte
---
[debug] execute contextualize
[INFO] Using 'UTF-8' encoding to copy filtered resources.
[INFO] Copying 2 resources
[INFO] Copying 3 resources
[INFO] 
[INFO] --- maven-compiler-plugin:2.5.1:compile (default-compile) @ cloud-plugin-storage-volume-cloudbyte
---
[INFO] Compiling 13 source files to <http://jenkins.buildacloud.org/job/build-master-noredist/ws/plugins/storage/volume/cloudbyte/target/classes>
[INFO] 
[INFO] --- maven-surefire-plugin:2.12:test (default-test) @ cloud-plugin-hypervisor-vmware
---
[INFO] Surefire report directory: <http://jenkins.buildacloud.org/job/build-master-noredist/ws/plugins/hypervisors/vmware/target/surefire-reports>

-------------------------------------------------------
 T E S T S
-------------------------------------------------------
[INFO] 
[INFO] --- maven-resources-plugin:2.5:testResources (default-testResources) @ cloud-plugin-storage-image-default
---
[debug] execute contextualize
[INFO] Using 'UTF-8' encoding to copy filtered resources.
[INFO] skip non existing resourceDirectory <http://jenkins.buildacloud.org/job/build-master-noredist/ws/plugins/storage/image/default/test/resources>
[INFO] Copying 3 resources
[INFO] 
[INFO] --- maven-compiler-plugin:2.5.1:testCompile (default-testCompile) @ cloud-plugin-storage-image-default
---
[INFO] No sources to compile
[INFO] 
[INFO] --- maven-surefire-plugin:2.12:test (default-test) @ cloud-plugin-storage-image-default
---
[INFO] Tests are skipped.
[INFO] 
[INFO] --- maven-jar-plugin:2.4:jar (default-jar) @ cloud-plugin-storage-image-default ---
[INFO] Building jar: <http://jenkins.buildacloud.org/job/build-master-noredist/ws/plugins/storage/image/default/target/cloud-plugin-storage-image-default-4.6.0-SNAPSHOT.jar>
[INFO] 
[INFO] --- maven-site-plugin:3.3:attach-descriptor (attach-descriptor) @ cloud-plugin-storage-image-default
---
[INFO] 
[INFO] --- maven-surefire-plugin:2.12:test (default) @ cloud-plugin-storage-image-default
---
[INFO] Tests are skipped.
[INFO] 
[INFO] --- maven-install-plugin:2.3.1:install (default-install) @ cloud-plugin-storage-image-default
---
[INFO] Installing <http://jenkins.buildacloud.org/job/build-master-noredist/ws/plugins/storage/image/default/target/cloud-plugin-storage-image-default-4.6.0-SNAPSHOT.jar>
to /jenkins/.m2/repository/org/apache/cloudstack/cloud-plugin-storage-image-default/4.6.0-SNAPSHOT/cloud-plugin-storage-image-default-4.6.0-SNAPSHOT.jar
[INFO] Installing <http://jenkins.buildacloud.org/job/build-master-noredist/ws/plugins/storage/image/default/pom.xml>
to /jenkins/.m2/repository/org/apache/cloudstack/cloud-plugin-storage-image-default/4.6.0-SNAPSHOT/cloud-plugin-storage-image-default-4.6.0-SNAPSHOT.pom
[INFO] 
[INFO] --- maven-resources-plugin:2.5:testResources (default-testResources) @ cloud-plugin-storage-image-sample
---
[debug] execute contextualize
[INFO] Using 'UTF-8' encoding to copy filtered resources.
[INFO] skip non existing resourceDirectory <http://jenkins.buildacloud.org/job/build-master-noredist/ws/plugins/storage/image/sample/test/resources>
[INFO] Copying 3 resources
[INFO] 
[INFO] --- maven-compiler-plugin:2.5.1:testCompile (default-testCompile) @ cloud-plugin-storage-image-sample
---
[INFO] No sources to compile
[INFO] 
[INFO] --- maven-surefire-plugin:2.12:test (default-test) @ cloud-plugin-storage-image-sample
---
[INFO] Tests are skipped.
[INFO] 
[INFO] --- maven-jar-plugin:2.4:jar (default-jar) @ cloud-plugin-storage-image-sample ---
[INFO] Building jar: <http://jenkins.buildacloud.org/job/build-master-noredist/ws/plugins/storage/image/sample/target/cloud-plugin-storage-image-sample-4.6.0-SNAPSHOT.jar>
[INFO] 
[INFO] --- maven-site-plugin:3.3:attach-descriptor (attach-descriptor) @ cloud-plugin-storage-image-sample
---
[INFO] 
[INFO] --- maven-surefire-plugin:2.12:test (default) @ cloud-plugin-storage-image-sample ---
[INFO] Tests are skipped.
[INFO] 
[INFO] --- maven-install-plugin:2.3.1:install (default-install) @ cloud-plugin-storage-image-sample
---
[INFO] Installing <http://jenkins.buildacloud.org/job/build-master-noredist/ws/plugins/storage/image/sample/target/cloud-plugin-storage-image-sample-4.6.0-SNAPSHOT.jar>
to /jenkins/.m2/repository/org/apache/cloudstack/cloud-plugin-storage-image-sample/4.6.0-SNAPSHOT/cloud-plugin-storage-image-sample-4.6.0-SNAPSHOT.jar
[INFO] Installing <http://jenkins.buildacloud.org/job/build-master-noredist/ws/plugins/storage/image/sample/pom.xml>
to /jenkins/.m2/repository/org/apache/cloudstack/cloud-plugin-storage-image-sample/4.6.0-SNAPSHOT/cloud-plugin-storage-image-sample-4.6.0-SNAPSHOT.pom
Running com.cloud.hypervisor.vmware.resource.VmwareResourceTest
log4j:WARN No appenders could be found for logger (com.cloud.serializer.GsonHelper).
log4j:WARN Please initialize the log4j system properly.
log4j:WARN See http://logging.apache.org/log4j/1.2/faq.html#noconfig for more info.
[INFO] ------------------------------------------------------------------------
[INFO] Reactor Summary:
[INFO] 
[INFO] Apache CloudStack Developer Tools - Checkstyle Configuration  SUCCESS [1.322s]
[INFO] Apache CloudStack ................................. SUCCESS [2.103s]
[INFO] Apache CloudStack Maven Conventions Parent ........ SUCCESS [1.641s]
[INFO] Apache CloudStack Framework - Managed Context ..... SUCCESS [5.568s]
[INFO] Apache CloudStack Utils ........................... SUCCESS [22.767s]
[INFO] Apache CloudStack Framework ....................... SUCCESS [0.703s]
[INFO] Apache CloudStack Framework - Event Notification .. SUCCESS [15.710s]
[INFO] Apache CloudStack Framework - Configuration ....... SUCCESS [5.330s]
[INFO] Apache CloudStack API ............................. SUCCESS [16.587s]
[INFO] Apache CloudStack Framework - REST ................ SUCCESS [7.472s]
[INFO] Apache CloudStack Framework - IPC ................. SUCCESS [7.754s]
[INFO] Apache CloudStack Cloud Engine .................... SUCCESS [0.260s]
[INFO] Apache CloudStack Cloud Engine API ................ SUCCESS [7.064s]
[INFO] Apache CloudStack Framework - Security ............ SUCCESS [4.745s]
[INFO] Apache CloudStack Core ............................ SUCCESS [32.489s]
[INFO] Apache CloudStack Agents .......................... SUCCESS [10.727s]
[INFO] Apache CloudStack Framework - Clustering .......... SUCCESS [5.740s]
[INFO] Apache CloudStack Framework - Event Notification .. SUCCESS [4.290s]
[INFO] Apache CloudStack Cloud Engine Schema Component ... SUCCESS [27.386s]
[INFO] Apache CloudStack Framework - Jobs ................ SUCCESS [7.519s]
[INFO] Apache CloudStack Cloud Engine Internal Components API  SUCCESS [5.721s]
[INFO] Apache CloudStack Server .......................... SUCCESS [57.156s]
[INFO] Apache CloudStack Usage Server .................... SUCCESS [16.094s]
[INFO] Apache CloudStack Cloud Engine Orchestration Component  SUCCESS [18.934s]
[INFO] Apache CloudStack Cloud Services .................. SUCCESS [0.698s]
[INFO] Apache CloudStack Secondary Storage ............... SUCCESS [3.963s]
[INFO] Apache CloudStack Secondary Storage Service ....... SUCCESS [28.066s]
[INFO] Apache CloudStack Engine Storage Component ........ SUCCESS [36.301s]
[INFO] Apache CloudStack Engine Storage Volume Component . SUCCESS [28.959s]
[INFO] Apache CloudStack Engine Storage Image Component .. SUCCESS [21.841s]
[INFO] Apache CloudStack Engine Storage Data Motion Component  SUCCESS [9.744s]
[INFO] Apache CloudStack Engine Storage Cache Component .. SUCCESS [18.636s]
[INFO] Apache CloudStack Engine Storage Snapshot Component  SUCCESS [38.473s]
[INFO] Apache CloudStack Cloud Engine API ................ SUCCESS [5.596s]
[INFO] Apache CloudStack Cloud Engine Service ............ SUCCESS [34.492s]
[INFO] Apache CloudStack Plugin POM ...................... SUCCESS [1.499s]
[INFO] Apache CloudStack Plugin - API Rate Limit ......... SUCCESS [40.465s]
[INFO] Apache CloudStack Plugin - Storage Volume default provider  SUCCESS [8.557s]
[INFO] Apache CloudStack Plugin - Storage Volume SolidFire Provider  SKIPPED
[INFO] Apache CloudStack Plugin - API SolidFire .......... SKIPPED
[INFO] Apache CloudStack Plugin - API Discovery .......... SUCCESS [31.173s]
[INFO] Apache CloudStack Plugin - ACL Static Role Based .. SUCCESS [16.808s]
[INFO] Apache CloudStack Plugin - Host Anti-Affinity Processor  SUCCESS [16.857s]
[INFO] Apache CloudStack Plugin - Explicit Dedication Processor  SUCCESS [17.608s]
[INFO] Apache CloudStack Plugin - User Concentrated Pod Deployment Planner  SUCCESS [17.431s]
[INFO] Apache CloudStack Plugin - User Dispersing Deployment Planner  SUCCESS [17.748s]
[INFO] Apache CloudStack Plugin - Implicit Dedication Planner  SUCCESS [45.800s]
[INFO] Apache CloudStack Plugin - Skip Heurestics Planner  SUCCESS [16.399s]
[INFO] Apache CloudStack Plugin - Host Allocator Random .. SUCCESS [16.247s]
[INFO] Apache CloudStack Plugin - Dedicated Resources .... SUCCESS [42.055s]
[INFO] Apache CloudStack Plugin - Hypervisor OracleVM .... SUCCESS [22.430s]
[INFO] Apache CloudStack Plugin - Open vSwitch ........... SUCCESS [22.431s]
[INFO] Apache CloudStack Plugin - Hypervisor XenServer ... SUCCESS [44.518s]
[INFO] Apache CloudStack Plugin - Hypervisor KVM ......... SUCCESS [52.516s]
[INFO] Apache CloudStack Plugin - RabbitMQ Event Bus ..... SUCCESS [15.684s]
[INFO] Apache CloudStack Plugin - In Memory Event Bus .... SUCCESS [27.527s]
[INFO] Apache CloudStack Plugin - Hypervisor Baremetal ... SUCCESS [30.568s]
[INFO] Apache CloudStack Plugin - Hypervisor UCS ......... SUCCESS [19.985s]
[INFO] Apache CloudStack Plugin - Hypervisor Hyper-V ..... SUCCESS [36.699s]
[INFO] Apache CloudStack Plugin - Network Elastic Load Balancer  SUCCESS [37.122s]
[INFO] Apache CloudStack Plugin - Network Internal Load Balancer  SUCCESS [56.707s]
[INFO] Apache CloudStack Framework - Spring Life Cycle ... SUCCESS [2.862s]
[INFO] Apache CloudStack Plugin - Network Juniper Contrail  FAILURE [0.110s]
[INFO] Apache CloudStack Plugin - Palo Alto .............. SUCCESS [46.735s]
[INFO] Apache CloudStack Plugin - Network Netscaler ...... SUCCESS [26.277s]
[INFO] Apache CloudStack Plugin - Network Nicira NVP ..... SUCCESS [1:06.508s]
[INFO] Apache CloudStack Plugin - BigSwitch Virtual Network Segment  SUCCESS [41.771s]
[INFO] Apache CloudStack Plugin - Network Brocade VCS .... SUCCESS [56.832s]
[INFO] Apache CloudStack Plugin - Midokura Midonet ....... SUCCESS [25.569s]
[INFO] Apache CloudStack Plugin - Stratosphere SSP ....... SUCCESS [38.804s]
[INFO] Apache CloudStack Plugin - Network Opendaylight ... SUCCESS [35.976s]
[INFO] Apache CloudStack Plugin - Storage Allocator Random  SUCCESS [11.328s]
[INFO] Apache CloudStack Plugin - User Authenticator LDAP  SUCCESS [22.407s]
[INFO] Apache CloudStack Plugin - User Authenticator MD5 . SUCCESS [26.852s]
[INFO] Apache CloudStack Plugin - User Authenticator Plain Text  SUCCESS [13.909s]
[INFO] Apache CloudStack Plugin - User Authenticator SAML2  SUCCESS [1:02.908s]
[INFO] Apache CloudStack Plugin - User Authenticator SHA256 Salted  SUCCESS [26.688s]
[INFO] Apache CloudStack Plugin - Dns Notifier Example ... SUCCESS [13.442s]
[INFO] Apache CloudStack Plugin - Storage Image S3 ....... SUCCESS [9.189s]
[INFO] Apache CloudStack Plugin - Storage Image Swift provider  SUCCESS [7.650s]
[INFO] Apache CloudStack Plugin - Storage Image default provider  SUCCESS [6.250s]
[INFO] Apache CloudStack Plugin - Storage Image sample provider  SUCCESS [4.697s]
[INFO] Apache CloudStack Plugin - Storage Volume Nexenta Provider  SUCCESS [13.771s]
[INFO] Apache CloudStack Plugin - Storage Volume CloudByte Provider  SKIPPED
[INFO] Apache CloudStack Plugin - Storage Volume sample provider  SUCCESS [7.823s]
[INFO] Apache CloudStack Plugin - SNMP Alerts ............ SUCCESS [23.295s]
[INFO] Apache CloudStack Plugin - Syslog Alerts .......... SUCCESS [20.582s]
[INFO] Apache CloudStack Plugin - Network VXLAN .......... SUCCESS [26.878s]
[INFO] Apache CloudStack Plugin - GloboDNS ............... SUCCESS [44.680s]
[INFO] Apache CloudStack Plugin - NetApp File System ..... SUCCESS [15.742s]
[INFO] Apache CloudStack Plugin - F5 ..................... SUCCESS [18.459s]
[INFO] Apache CloudStack Plugin - Juniper SRX ............ SUCCESS [21.857s]
[INFO] Apache CloudStack Plugin - Nuage VSP .............. SUCCESS [39.949s]
[INFO] Apache CloudStack VMware Base ..................... SUCCESS [12.231s]
[INFO] Apache CloudStack Plugin - Hypervisor VMware ...... SKIPPED
[INFO] Apache CloudStack Plugin - Cisco VNMC ............. SKIPPED
[INFO] Apache CloudStack Plugin - MySQL HA Strategy ...... SUCCESS [14.439s]
[INFO] Apache CloudStack Framework - Spring Module ....... SUCCESS [15.515s]
[INFO] Apache CloudStack Secondary Storage Controller .... SUCCESS [17.189s]
[INFO] Apache CloudStack Console Proxy - RDP Client ...... SUCCESS [19.903s]
[INFO] Apache CloudStack Console Proxy ................... SUCCESS [3.690s]
[INFO] Apache CloudStack Console Proxy - Server .......... SUCCESS [12.484s]
[INFO] Apache CloudStack System VM ....................... SKIPPED
[INFO] Apache CloudStack Client UI ....................... SKIPPED
[INFO] Apache CloudStack Framework - QuickCloud .......... SUCCESS [1.980s]
[INFO] Apache CloudStack AWS API Bridge .................. SKIPPED
[INFO] ------------------------------------------------------------------------
[INFO] BUILD FAILURE
[INFO] ------------------------------------------------------------------------
[INFO] Total time: 7:04.429s (Wall Clock)
[INFO] Finished at: Thu Dec 11 20:59:09 CET 2014
Tests run: 1, Failures: 0, Errors: 0, Skipped: 0, Time elapsed: 2.361 sec
[INFO] Final Memory: 100M/473M
[INFO] ------------------------------------------------------------------------
Running com.cloud.hypervisor.vmware.VmwareDatacenterApiUnitTest
[ERROR] Failed to execute goal on project cloud-plugin-network-contrail: Could not resolve
dependencies for project org.apache.cloudstack:cloud-plugin-network-contrail:jar:4.6.0-SNAPSHOT:
Failure to find net.juniper.contrail:juniper-contrail-api:jar:1.0-SNAPSHOT in http://juniper.github.io/contrail-maven/snapshots
was cached in the local repository, resolution will not be reattempted until the update interval
of juniper-contrail has elapsed or updates are forced -> [Help 1]
[ERROR] 
[ERROR] To see the full stack trace of the errors, re-run Maven with the -e switch.
[ERROR] Re-run Maven using the -X switch to enable full debug logging.
[ERROR] 
[ERROR] For more information about the errors and possible solutions, please read the following
articles:
[ERROR] [Help 1] http://cwiki.apache.org/confluence/display/MAVEN/DependencyResolutionException
[ERROR] 
[ERROR] After correcting the problems, you can resume the build with the command
[ERROR]   mvn <goals> -rf :cloud-plugin-network-contrail
[INFO] 
[INFO] --- maven-resources-plugin:2.5:testResources (default-testResources) @ cloud-plugin-storage-volume-solidfire
---
Build step 'Invoke top-level Maven targets' marked build as failure
Archiving artifacts

Mime
View raw message