cloudstack-dev mailing list archives

Site index · List index
Message view « Date » · « Thread »
Top « Date » · « Thread »
From jenk...@cloudstack.org
Subject Build failed in Jenkins: simulator-singlerun #810
Date Thu, 18 Dec 2014 12:30:07 GMT
See <http://jenkins.buildacloud.org/job/simulator-singlerun/810/changes>

Changes:

[talluri] CLOUDSTACK-8053: Fix loop termination - test_vpc_host_maintenance.py

[talluri] CLOUDSTACK-8049: Tagging test cases which cannot be run on simulator accordingly

[talluri] CLOUDSTACK-8048: Fix test_ss_limits.py

[jayapal] CLOUDSTACK-8030: Updated router to come up egress default ALLOW

[Rohit Yadav] CLOUDSTACK-7974: remove old hostname entry for a VM when adding a VM

[talluri] CLOUDSTACK-8057: test_dedicate_guest_vlan_range.py - Marking a test as invalid

[talluri] CLOUDSTACK-8059: test_host_high_availability.py - Adding necessary code to check
the hosts in cluster and update the host with appropriate tags to make it HA enabled

[Rohit Yadav] CLOUDSTACK-8014: Fix NPE searching including removed templates

[w.zhou] CLOUDSTACK-2823: pass cmdline info to system vms for 30 times

[talluri] CLOUDSTACK-8062: test_multiple_ip_ranges.py - Fix the test case to avoid using same
vlan IP range in each test case

[talluri] CLOUDSTACK:8018: Fix test_redundant_router.test_redundantVR_internals - The SSH
to router was being done from wrong host

[talluri] CLOUDSTACK:8058: Fix test_reset_ssh_keypair.py for EIP setup

[min.chen] CLOUDSTACK-8061: Extracting volume when it is in migrating state causes

[w.zhou] CLOUDSTACK-255: fix NPE in createPortForwardingRule due to no PortForwarding provider

[talluri] CLOUDSTACK-8055: Tagging test cases which can't be run on simulator accordingly

[talluri] CLOUDSTACK-8068: Fixing test script issue in test_ps_project_limits.py

[talluri] CLOUDSTACK-8055: Tagging test cases which can't be run on simulator accordingly

[talluri] CLOUDSTACK-8069: Fixed test script in test_tags.py

[Rohit Yadav] CLOUDSTACK-8067: Fixed NPEs in MS log related to console proxy VM

[Rohit Yadav] CLOUDSTACK-8070: Upgrade router.ram.size using encryption util

[jayapal] CLOUDSTACK-8072: Fixed NPE in deleting default ACL items in default ACL

[mike.tutkowski] When deleting primary storage that's based on the SolidFireShared plug-in
(which uses a shared-IOPS approach), remove the volume from the volume access group it's in

[Daan Hoogland] use directIO flags when dd'ing template

[jessicawang] CLOUDSTACK-8076: UI > Templates menu > Template/ISO > "Filter by" dropdown
> add a new option, "shared", which will list shared templates when being selected.

[brian.federle] CLOUDSTACK-8075: Front-end support for shared templates/ISOs

[jessicawang] CLOUDSTACK-8075: UI > Instances menu > Add Instance > Select template/ISO
> add a new tab "shared" which will list shared templates/ISOs when being clicked.

[min.chen] CLOUDSTACK-8077: Not able to deploy VM using a shared template.

[talluri] CLOUDSTACK-8074: Fixed maint/test_multiple_ip_ranges.py

[talluri] CLOUDSTACK-8081: Fixed VM snapshot test cases in test_escalation_instances.py and
also dealt cleanup issues

[talluri] CLOUDSTACK-8055: test_portable_ip.py - Tagging test case which can't be run on simulator

[talluri] CLOUDSTACK-8071: Fixed api key issue in test_snapshots_improvement.py

[jessicawang] CLOUDSTACK-8075: UI > Instances menu > Add Instance > Select template/ISO
> "shared" tab > select a shared template, click Next button => fix error "unable
to find matched template object".

[prachi.damle] CLOUDSTACK-8079: If the cluster capacity threshold is reached, HA-enabled VM
is not migrated on another host during HA

[prachi.damle] CLOUDSTACK-8078: [Automation] Deletion of Affinity Groups - CloudRuntimeException:
No Event Pubish can be wrapped within DB Transaction!

[prachi.damle] CLOUDSTACK-8022: [Automation] Deletion of Domain with Cleanup set to "true"
fails

[sudison] add event for volume migration

[sudison] if local storage is in maitenance mode or removed, won't change its

[sudison] if concurrent snapshot happening on the same vm, throw invalid parameter

[Daan Hoogland] CLOUDSTACK-7184 config value for xen heartbeat timeout

------------------------------------------
[...truncated 8728 lines...]
[INFO] Building Apache CloudStack DevCloud-KVM 4.6.0-SNAPSHOT
[INFO] ------------------------------------------------------------------------
[INFO] 
[INFO] --- maven-clean-plugin:2.5:clean (default-clean) @ cloud-devcloud-kvm ---
[INFO] Deleting <http://jenkins.buildacloud.org/job/simulator-singlerun/ws/tools/devcloud-kvm/target>
(includes = [**/*], excludes = [])
[INFO] Deleting <http://jenkins.buildacloud.org/job/simulator-singlerun/ws/tools/devcloud-kvm>
(includes = [target, dist], excludes = [])
[INFO] 
[INFO] --- maven-checkstyle-plugin:2.11:check (cloudstack-checkstyle) @ cloud-devcloud-kvm
---
[INFO] Starting audit...
Audit done.

[INFO] 
[INFO] --- maven-remote-resources-plugin:1.3:process (default) @ cloud-devcloud-kvm ---
[INFO] 
[INFO] --- maven-site-plugin:3.3:attach-descriptor (attach-descriptor) @ cloud-devcloud-kvm
---
[INFO] 
[INFO] --- maven-install-plugin:2.3.1:install (default-install) @ cloud-devcloud-kvm ---
[INFO] Installing <http://jenkins.buildacloud.org/job/simulator-singlerun/ws/tools/devcloud-kvm/pom.xml>
to /var/lib/jenkins/.m2/repository/org/apache/cloudstack/cloud-devcloud-kvm/4.6.0-SNAPSHOT/cloud-devcloud-kvm-4.6.0-SNAPSHOT.pom
[INFO] ------------------------------------------------------------------------
[INFO] Reactor Summary:
[INFO] 
[INFO] Apache CloudStack Developer Tools - Checkstyle Configuration  SUCCESS [3.559s]
[INFO] Apache CloudStack ................................. SUCCESS [2.916s]
[INFO] Apache CloudStack Maven Conventions Parent ........ SUCCESS [1.089s]
[INFO] Apache CloudStack Framework - Managed Context ..... SUCCESS [4.782s]
[INFO] Apache CloudStack Utils ........................... SUCCESS [26.938s]
[INFO] Apache CloudStack Framework ....................... SUCCESS [0.090s]
[INFO] Apache CloudStack Framework - Event Notification .. SUCCESS [11.491s]
[INFO] Apache CloudStack Framework - Configuration ....... SUCCESS [5.650s]
[INFO] Apache CloudStack API ............................. SUCCESS [26.321s]
[INFO] Apache CloudStack Framework - REST ................ SUCCESS [4.341s]
[INFO] Apache CloudStack Framework - IPC ................. SUCCESS [6.151s]
[INFO] Apache CloudStack Cloud Engine .................... SUCCESS [0.051s]
[INFO] Apache CloudStack Cloud Engine API ................ SUCCESS [8.311s]
[INFO] Apache CloudStack Framework - Security ............ SUCCESS [3.332s]
[INFO] Apache CloudStack Core ............................ SUCCESS [31.354s]
[INFO] Apache CloudStack Agents .......................... SUCCESS [13.760s]
[INFO] Apache CloudStack Framework - Clustering .......... SUCCESS [4.446s]
[INFO] Apache CloudStack Framework - Event Notification .. SUCCESS [2.776s]
[INFO] Apache CloudStack Cloud Engine Schema Component ... SUCCESS [24.934s]
[INFO] Apache CloudStack Framework - Jobs ................ SUCCESS [7.505s]
[INFO] Apache CloudStack Cloud Engine Internal Components API  SUCCESS [4.406s]
[INFO] Apache CloudStack Server .......................... SUCCESS [1:06.050s]
[INFO] Apache CloudStack Usage Server .................... SUCCESS [11.647s]
[INFO] Apache CloudStack Cloud Engine Orchestration Component  SUCCESS [14.961s]
[INFO] Apache CloudStack Cloud Services .................. SUCCESS [0.092s]
[INFO] Apache CloudStack Secondary Storage ............... SUCCESS [0.456s]
[INFO] Apache CloudStack Secondary Storage Service ....... SUCCESS [7.208s]
[INFO] Apache CloudStack Engine Storage Component ........ SUCCESS [10.201s]
[INFO] Apache CloudStack Engine Storage Volume Component . SUCCESS [5.685s]
[INFO] Apache CloudStack Engine Storage Image Component .. SUCCESS [4.013s]
[INFO] Apache CloudStack Engine Storage Data Motion Component  SUCCESS [3.857s]
[INFO] Apache CloudStack Engine Storage Cache Component .. SUCCESS [3.304s]
[INFO] Apache CloudStack Engine Storage Snapshot Component  SUCCESS [9.568s]
[INFO] Apache CloudStack Cloud Engine API ................ SUCCESS [2.850s]
[INFO] Apache CloudStack Cloud Engine Service ............ SUCCESS [6.842s]
[INFO] Apache CloudStack Plugin POM ...................... SUCCESS [0.592s]
[INFO] Apache CloudStack Plugin - API Rate Limit ......... SUCCESS [9.205s]
[INFO] Apache CloudStack Plugin - Storage Volume default provider  SUCCESS [3.300s]
[INFO] Apache CloudStack Plugin - Storage Volume SolidFire Provider  SUCCESS [6.985s]
[INFO] Apache CloudStack Plugin - API SolidFire .......... SUCCESS [3.961s]
[INFO] Apache CloudStack Plugin - API Discovery .......... SUCCESS [5.781s]
[INFO] Apache CloudStack Plugin - ACL Static Role Based .. SUCCESS [3.021s]
[INFO] Apache CloudStack Plugin - Host Anti-Affinity Processor  SUCCESS [3.096s]
[INFO] Apache CloudStack Plugin - Explicit Dedication Processor  SUCCESS [3.166s]
[INFO] Apache CloudStack Plugin - User Concentrated Pod Deployment Planner  SUCCESS [3.074s]
[INFO] Apache CloudStack Plugin - User Dispersing Deployment Planner  SUCCESS [3.082s]
[INFO] Apache CloudStack Plugin - Implicit Dedication Planner  SUCCESS [9.843s]
[INFO] Apache CloudStack Plugin - Skip Heurestics Planner  SUCCESS [2.985s]
[INFO] Apache CloudStack Plugin - Host Allocator Random .. SUCCESS [3.044s]
[INFO] Apache CloudStack Plugin - Dedicated Resources .... SUCCESS [8.874s]
[INFO] Apache CloudStack Plugin - Hypervisor OracleVM .... SUCCESS [5.423s]
[INFO] Apache CloudStack Plugin - Open vSwitch ........... SUCCESS [5.137s]
[INFO] Apache CloudStack Plugin - Hypervisor XenServer ... SUCCESS [13.059s]
[INFO] Apache CloudStack Plugin - Hypervisor KVM ......... SUCCESS [13.020s]
[INFO] Apache CloudStack Plugin - RabbitMQ Event Bus ..... SUCCESS [3.952s]
[INFO] Apache CloudStack Plugin - In Memory Event Bus .... SUCCESS [5.600s]
[INFO] Apache CloudStack Plugin - Hypervisor Baremetal ... SUCCESS [6.026s]
[INFO] Apache CloudStack Plugin - Hypervisor UCS ......... SUCCESS [3.825s]
[INFO] Apache CloudStack Plugin - Hypervisor Hyper-V ..... SUCCESS [8.195s]
[INFO] Apache CloudStack Plugin - Network Elastic Load Balancer  SUCCESS [7.308s]
[INFO] Apache CloudStack Plugin - Network Internal Load Balancer  SUCCESS [11.859s]
[INFO] Apache CloudStack Framework - Spring Life Cycle ... SUCCESS [3.592s]
[INFO] Apache CloudStack Plugin - Network Juniper Contrail  SUCCESS [16.924s]
[INFO] Apache CloudStack Plugin - Palo Alto .............. SUCCESS [9.758s]
[INFO] Apache CloudStack Plugin - Network Netscaler ...... SUCCESS [5.585s]
[INFO] Apache CloudStack Plugin - Network Nicira NVP ..... SUCCESS [13.524s]
[INFO] Apache CloudStack Plugin - BigSwitch Virtual Network Segment  SUCCESS [8.529s]
[INFO] Apache CloudStack Plugin - Network Brocade VCS .... SUCCESS [12.174s]
[INFO] Apache CloudStack Plugin - Midokura Midonet ....... SUCCESS [9.693s]
[INFO] Apache CloudStack Plugin - Stratosphere SSP ....... SUCCESS [7.936s]
[INFO] Apache CloudStack Plugin - Network Opendaylight ... SUCCESS [7.919s]
[INFO] Apache CloudStack Plugin - Storage Allocator Random  SUCCESS [3.118s]
[INFO] Apache CloudStack Plugin - User Authenticator LDAP  SUCCESS [4.814s]
[INFO] Apache CloudStack Plugin - User Authenticator MD5 . SUCCESS [5.845s]
[INFO] Apache CloudStack Plugin - User Authenticator Plain Text  SUCCESS [3.182s]
[INFO] Apache CloudStack Plugin - User Authenticator SAML2  SUCCESS [14.510s]
[INFO] Apache CloudStack Plugin - User Authenticator SHA256 Salted  SUCCESS [5.825s]
[INFO] Apache CloudStack Plugin - Dns Notifier Example ... SUCCESS [3.021s]
[INFO] Apache CloudStack Plugin - Storage Image S3 ....... SUCCESS [3.387s]
[INFO] Apache CloudStack Plugin - Storage Image Swift provider  SUCCESS [2.947s]
[INFO] Apache CloudStack Plugin - Storage Image default provider  SUCCESS [2.887s]
[INFO] Apache CloudStack Plugin - Storage Image sample provider  SUCCESS [3.206s]
[INFO] Apache CloudStack Plugin - Storage Volume Nexenta Provider  SUCCESS [5.377s]
[INFO] Apache CloudStack Plugin - Storage Volume CloudByte Provider  SUCCESS [4.985s]
[INFO] Apache CloudStack Plugin - Storage Volume sample provider  SUCCESS [3.261s]
[INFO] Apache CloudStack Plugin - SNMP Alerts ............ SUCCESS [6.646s]
[INFO] Apache CloudStack Plugin - Syslog Alerts .......... SUCCESS [5.234s]
[INFO] Apache CloudStack Plugin - Network VXLAN .......... SUCCESS [6.421s]
[INFO] Apache CloudStack Plugin - GloboDNS ............... SUCCESS [11.574s]
[INFO] Apache CloudStack Plugin - Hypervisor Simulator ... SUCCESS [6.641s]
[INFO] Apache CloudStack Framework - Spring Module ....... SUCCESS [9.153s]
[INFO] Apache CloudStack Secondary Storage Controller .... SUCCESS [3.945s]
[INFO] Apache CloudStack Console Proxy - RDP Client ...... SUCCESS [11.085s]
[INFO] Apache CloudStack Console Proxy ................... SUCCESS [0.589s]
[INFO] Apache CloudStack Console Proxy - Server .......... SUCCESS [6.944s]
[INFO] Apache CloudStack System VM ....................... SUCCESS [11.084s]
[INFO] Apache CloudStack Client UI ....................... SUCCESS [30.683s]
[INFO] Apache CloudStack Framework - QuickCloud .......... SUCCESS [2.469s]
[INFO] Apache CloudStack Test ............................ SUCCESS [1.547s]
[INFO] Apache CloudStack Developer Mode .................. SUCCESS [2.165s]
[INFO] Apache CloudStack Developer Tools ................. SUCCESS [0.519s]
[INFO] Apache CloudStack apidocs ......................... SUCCESS [41.317s]
[INFO] Apache CloudStack marvin .......................... SUCCESS [6.831s]
[INFO] Apache CloudStack DevCloud ........................ SUCCESS [1.532s]
[INFO] Apache CloudStack DevCloud-KVM .................... SUCCESS [0.572s]
[INFO] ------------------------------------------------------------------------
[INFO] BUILD SUCCESS
[INFO] ------------------------------------------------------------------------
[INFO] Total time: 13:46.752s
[INFO] Finished at: Thu Dec 18 07:28:30 EST 2014
[INFO] Final Memory: 92M/406M
[INFO] ------------------------------------------------------------------------
[simulator-singlerun] $ mvn -P developer,simulator -Ddeploydb -pl developer
[INFO] Scanning for projects...
[INFO]                                                                         
[INFO] ------------------------------------------------------------------------
[INFO] Building Apache CloudStack Developer Mode 4.6.0-SNAPSHOT
[INFO] ------------------------------------------------------------------------
[INFO] 
[INFO] --- maven-checkstyle-plugin:2.11:check (cloudstack-checkstyle) @ cloud-developer ---
[INFO] Starting audit...
Audit done.

[INFO] 
[INFO] --- properties-maven-plugin:1.0-alpha-2:read-project-properties (default) @ cloud-developer
---
[WARNING] Ignoring missing properties file: <http://jenkins.buildacloud.org/job/simulator-singlerun/ws/developer/../utils/conf/db.properties.override>
[INFO] 
[INFO] --- maven-remote-resources-plugin:1.3:process (default) @ cloud-developer ---
[INFO] 
[INFO] --- maven-antrun-plugin:1.7:run (default) @ cloud-developer ---
[INFO] Executing tasks

main:
[INFO] Executed tasks
[INFO] 
[INFO] >>> exec-maven-plugin:1.2.1:java (create-schema) @ cloud-developer >>>
[INFO] 
[INFO] --- maven-checkstyle-plugin:2.11:check (cloudstack-checkstyle) @ cloud-developer ---
[INFO] Starting audit...
Audit done.

[INFO] 
[INFO] <<< exec-maven-plugin:1.2.1:java (create-schema) @ cloud-developer <<<
[INFO] 
[INFO] --- exec-maven-plugin:1.2.1:java (create-schema) @ cloud-developer ---
log4j:WARN No appenders could be found for logger (org.springframework.core.env.StandardEnvironment).
log4j:WARN Please initialize the log4j system properly.
log4j:WARN See http://logging.apache.org/log4j/1.2/faq.html#noconfig for more info.
========> WARNING: Provided file does not exist: <http://jenkins.buildacloud.org/job/simulator-singlerun/ws/developer/../utils/conf/db.properties.override>
========> WARNING: Provided file does not exist: <http://jenkins.buildacloud.org/job/simulator-singlerun/ws/developer/developer-prefill.sql.override>
========> Initializing database=cloud with host=localhost port=3306 username=cloud password=cloud
============> Running query: drop database if exists `cloud`
============> Running query: create database `cloud`
============> Running query: GRANT ALL ON cloud.* to 'cloud'@`localhost` identified by
'cloud'
============> Running query: GRANT ALL ON cloud.* to 'cloud'@`%` identified by 'cloud'
========> Initializing database=cloud_usage with host=localhost port=3306 username=cloud
password=cloud
============> Running query: drop database if exists `cloud_usage`
============> Running query: create database `cloud_usage`
============> Running query: GRANT ALL ON cloud_usage.* to 'cloud'@`localhost` identified
by 'cloud'
============> Running query: GRANT ALL ON cloud_usage.* to 'cloud'@`%` identified by 'cloud'
========> Initializing database=cloudbridge with host=localhost port=3306 username=cloud
password=cloud
============> Running query: drop database if exists `cloudbridge`
============> Running query: create database `cloudbridge`
============> Running query: GRANT ALL ON cloudbridge.* to 'cloud'@`localhost` identified
by 'cloud'
============> Running query: GRANT ALL ON cloudbridge.* to 'cloud'@`%` identified by 'cloud'
========> Processing SQL file at <http://jenkins.buildacloud.org/job/simulator-singlerun/ws/developer/target/db/create-schema.sql>
========> Processing SQL file at <http://jenkins.buildacloud.org/job/simulator-singlerun/ws/developer/target/db/create-schema-premium.sql>
========> Processing SQL file at <http://jenkins.buildacloud.org/job/simulator-singlerun/ws/developer/target/db/templates.sql>
========> Processing SQL file at <http://jenkins.buildacloud.org/job/simulator-singlerun/ws/developer/target/db/cloudbridge_schema.sql>
========> Processing SQL file at <http://jenkins.buildacloud.org/job/simulator-singlerun/ws/developer/target/db/cloudbridge_multipart.sql>
========> Processing SQL file at <http://jenkins.buildacloud.org/job/simulator-singlerun/ws/developer/target/db/cloudbridge_index.sql>
========> Processing SQL file at <http://jenkins.buildacloud.org/job/simulator-singlerun/ws/developer/target/db/cloudbridge_multipart_alter.sql>
========> Processing SQL file at <http://jenkins.buildacloud.org/job/simulator-singlerun/ws/developer/target/db/cloudbridge_bucketpolicy.sql>
========> Processing SQL file at <http://jenkins.buildacloud.org/job/simulator-singlerun/ws/developer/target/db/cloudbridge_policy_alter.sql>
========> Processing SQL file at <http://jenkins.buildacloud.org/job/simulator-singlerun/ws/developer/target/db/cloudbridge_offering.sql>
========> Processing SQL file at <http://jenkins.buildacloud.org/job/simulator-singlerun/ws/developer/target/db/cloudbridge_offering_alter.sql>
========> Processing SQL file at <http://jenkins.buildacloud.org/job/simulator-singlerun/ws/developer/developer-prefill.sql>
========> Processing upgrade: com.cloud.upgrade.DatabaseUpgradeChecker
[WARNING] 
java.lang.reflect.InvocationTargetException
	at sun.reflect.NativeMethodAccessorImpl.invoke0(Native Method)
	at sun.reflect.NativeMethodAccessorImpl.invoke(NativeMethodAccessorImpl.java:57)
	at sun.reflect.DelegatingMethodAccessorImpl.invoke(DelegatingMethodAccessorImpl.java:43)
	at java.lang.reflect.Method.invoke(Method.java:606)
	at org.codehaus.mojo.exec.ExecJavaMojo$1.run(ExecJavaMojo.java:297)
	at java.lang.Thread.run(Thread.java:744)
Caused by: com.cloud.utils.exception.CloudRuntimeException: Unable to upgrade the database
	at com.cloud.upgrade.DatabaseUpgradeChecker.upgrade(DatabaseUpgradeChecker.java:402)
	at com.cloud.upgrade.DatabaseUpgradeChecker.check(DatabaseUpgradeChecker.java:498)
	at com.cloud.upgrade.DatabaseCreator.main(DatabaseCreator.java:217)
	... 6 more
Caused by: com.cloud.utils.exception.CloudRuntimeException: Unable to execute upgrade script:
<http://jenkins.buildacloud.org/job/simulator-singlerun/ws/developer/target/db/db/schema-442to450.sql>
	at com.cloud.upgrade.DatabaseUpgradeChecker.runScript(DatabaseUpgradeChecker.java:314)
	at com.cloud.upgrade.DatabaseUpgradeChecker.upgrade(DatabaseUpgradeChecker.java:371)
	... 8 more
Caused by: com.mysql.jdbc.exceptions.jdbc4.MySQLSyntaxErrorException: Unknown column 'default'
in 'field list'
	at com.cloud.utils.db.ScriptRunner.runScript(ScriptRunner.java:185)
	at com.cloud.utils.db.ScriptRunner.runScript(ScriptRunner.java:87)
	at com.cloud.upgrade.DatabaseUpgradeChecker.runScript(DatabaseUpgradeChecker.java:305)
	... 9 more
[INFO] ------------------------------------------------------------------------
[INFO] BUILD FAILURE
[INFO] ------------------------------------------------------------------------
[INFO] Total time: 2:07.317s
[INFO] Finished at: Thu Dec 18 07:30:42 EST 2014
[INFO] Final Memory: 47M/204M
[INFO] ------------------------------------------------------------------------
[WARNING] The requested profile "simulator" could not be activated because it does not exist.
[ERROR] Failed to execute goal org.codehaus.mojo:exec-maven-plugin:1.2.1:java (create-schema)
on project cloud-developer: An exception occured while executing the Java class. null: InvocationTargetException:
Unable to upgrade the database: Unable to execute upgrade script: <http://jenkins.buildacloud.org/job/simulator-singlerun/ws/developer/target/db/db/schema-442to450.sql>:
Unknown column 'default' in 'field list' -> [Help 1]
[ERROR] 
[ERROR] To see the full stack trace of the errors, re-run Maven with the -e switch.
[ERROR] Re-run Maven using the -X switch to enable full debug logging.
[ERROR] 
[ERROR] For more information about the errors and possible solutions, please read the following
articles:
[ERROR] [Help 1] http://cwiki.apache.org/confluence/display/MAVEN/MojoExecutionException
Build step 'Invoke top-level Maven targets' marked build as failure
[locks-and-latches] Releasing all the locks
[locks-and-latches] All the locks released
[xUnit] [INFO] - Starting to record.
[xUnit] [INFO] - Processing JUnit
[xUnit] [INFO] - [JUnit] - 1 test report file(s) were found with the pattern 'xunit.xml' relative
to '<http://jenkins.buildacloud.org/job/simulator-singlerun/ws/'> for the testing framework
'JUnit'.
[xUnit] [ERROR] - Test reports were found but not all of them are new. Did all the tests run?
  * <http://jenkins.buildacloud.org/job/simulator-singlerun/ws/xunit.xml> is 56 min
old

[xUnit] [INFO] - Failing BUILD.
[xUnit] [INFO] - There are errors when processing test results.
[xUnit] [INFO] - Skipping tests recording.
[xUnit] [INFO] - Stop build.

Mime
View raw message