cloudstack-dev mailing list archives

Site index · List index
Message view « Date » · « Thread »
Top « Date » · « Thread »
From jenk...@cloudstack.org
Subject Build failed in Jenkins: build-4.5-simulator #121
Date Mon, 15 Dec 2014 11:51:08 GMT
See <http://jenkins.buildacloud.org/job/build-4.5-simulator/121/changes>

Changes:

[jayapal] CLOUDSTACK-8072: Fixed NPE in deleting default ACL items in default ACL

------------------------------------------
[...truncated 1484 lines...]
[INFO] 
[INFO] --- maven-clean-plugin:2.5:clean (default-clean) @ cloud-secondary-storage ---
[INFO] Deleting <http://jenkins.buildacloud.org/job/build-4.5-simulator/ws/services/secondary-storage/server/target>
(includes = [**/*], excludes = [])
[INFO] Deleting <http://jenkins.buildacloud.org/job/build-4.5-simulator/ws/services/secondary-storage/server>
(includes = [target, dist], excludes = [])
[INFO] 
[INFO] --- maven-checkstyle-plugin:2.11:check (cloudstack-checkstyle) @ cloud-secondary-storage
---
[INFO] Starting audit...
Audit done.

[INFO] 
[INFO] --- maven-remote-resources-plugin:1.3:process (default) @ cloud-secondary-storage ---
[INFO] 
[INFO] --- maven-resources-plugin:2.5:resources (default-resources) @ cloud-secondary-storage
---
[debug] execute contextualize
[INFO] Using 'UTF-8' encoding to copy filtered resources.
[INFO] Copying 2 resources
[INFO] Copying 3 resources
[INFO] 
[INFO] --- maven-compiler-plugin:2.5.1:compile (default-compile) @ cloud-secondary-storage
---
[INFO] Compiling 10 source files to <http://jenkins.buildacloud.org/job/build-4.5-simulator/ws/services/secondary-storage/server/target/classes>
[INFO] 
[INFO] --- maven-resources-plugin:2.5:testResources (default-testResources) @ cloud-secondary-storage
---
[debug] execute contextualize
[INFO] Using 'UTF-8' encoding to copy filtered resources.
[INFO] skip non existing resourceDirectory <http://jenkins.buildacloud.org/job/build-4.5-simulator/ws/services/secondary-storage/server/test/resources>
[INFO] Copying 3 resources
[INFO] 
[INFO] --- maven-compiler-plugin:2.5.1:testCompile (default-testCompile) @ cloud-secondary-storage
---
[INFO] Compiling 2 source files to <http://jenkins.buildacloud.org/job/build-4.5-simulator/ws/services/secondary-storage/server/target/test-classes>
[INFO] 
[INFO] --- maven-surefire-plugin:2.12:test (default-test) @ cloud-secondary-storage ---
[INFO] Tests are skipped.
[INFO]                                                                         
[INFO] ------------------------------------------------------------------------
[INFO] Building Apache CloudStack Engine Storage Component 4.5.0-SNAPSHOT
[INFO] ------------------------------------------------------------------------
[INFO] 
[INFO] --- maven-clean-plugin:2.5:clean (default-clean) @ cloud-engine-storage ---
[INFO] Deleting <http://jenkins.buildacloud.org/job/build-4.5-simulator/ws/engine/storage/target>
(includes = [**/*], excludes = [])
[INFO] Deleting <http://jenkins.buildacloud.org/job/build-4.5-simulator/ws/engine/storage>
(includes = [target, dist], excludes = [])
[INFO] 
[INFO] --- maven-checkstyle-plugin:2.11:check (cloudstack-checkstyle) @ cloud-engine-storage
---
[INFO] Starting audit...
Audit done.

[INFO] 
[INFO] --- maven-remote-resources-plugin:1.3:process (default) @ cloud-engine-storage ---
[INFO] 
[INFO] --- maven-resources-plugin:2.5:resources (default-resources) @ cloud-engine-storage
---
[debug] execute contextualize
[INFO] Using 'UTF-8' encoding to copy filtered resources.
[INFO] Copying 3 resources
[INFO] Copying 3 resources
[INFO] 
[INFO] --- maven-compiler-plugin:2.5.1:compile (default-compile) @ cloud-engine-storage ---
[INFO] Compiling 60 source files to <http://jenkins.buildacloud.org/job/build-4.5-simulator/ws/engine/storage/target/classes>
[INFO] 
[INFO] --- maven-resources-plugin:2.5:testResources (default-testResources) @ cloud-engine-storage
---
[debug] execute contextualize
[INFO] Using 'UTF-8' encoding to copy filtered resources.
[INFO] skip non existing resourceDirectory <http://jenkins.buildacloud.org/job/build-4.5-simulator/ws/engine/storage/test/resources>
[INFO] Copying 3 resources
[INFO] 
[INFO] --- maven-compiler-plugin:2.5.1:testCompile (default-testCompile) @ cloud-engine-storage
---
[INFO] Compiling 1 source file to <http://jenkins.buildacloud.org/job/build-4.5-simulator/ws/engine/storage/target/test-classes>
[INFO] 
[INFO] --- maven-surefire-plugin:2.12:test (default-test) @ cloud-engine-storage ---
[INFO] Surefire report directory: <http://jenkins.buildacloud.org/job/build-4.5-simulator/ws/engine/storage/target/surefire-reports>

-------------------------------------------------------
 T E S T S
-------------------------------------------------------
Running org.apache.cloudstack.engine.subsystem.api.storage.StrategyPriorityTest
Tests run: 3, Failures: 0, Errors: 0, Skipped: 0, Time elapsed: 2.457 sec

Results :

Tests run: 3, Failures: 0, Errors: 0, Skipped: 0

[INFO]                                                                         
[INFO] ------------------------------------------------------------------------
[INFO] Building Apache CloudStack Engine Storage Volume Component 4.5.0-SNAPSHOT
[INFO] ------------------------------------------------------------------------
[INFO] 
[INFO] --- maven-clean-plugin:2.5:clean (default-clean) @ cloud-engine-storage-volume ---
[INFO] Deleting <http://jenkins.buildacloud.org/job/build-4.5-simulator/ws/engine/storage/volume/target>
(includes = [**/*], excludes = [])
[INFO] Deleting <http://jenkins.buildacloud.org/job/build-4.5-simulator/ws/engine/storage/volume>
(includes = [target, dist], excludes = [])
[INFO] 
[INFO] --- maven-checkstyle-plugin:2.11:check (cloudstack-checkstyle) @ cloud-engine-storage-volume
---
[INFO] Starting audit...
Audit done.

[INFO] 
[INFO] --- maven-remote-resources-plugin:1.3:process (default) @ cloud-engine-storage-volume
---
[INFO] 
[INFO] --- maven-resources-plugin:2.5:resources (default-resources) @ cloud-engine-storage-volume
---
[debug] execute contextualize
[INFO] Using 'UTF-8' encoding to copy filtered resources.
[INFO] Copying 1 resource
[INFO] Copying 3 resources
[INFO] 
[INFO] --- maven-compiler-plugin:2.5.1:compile (default-compile) @ cloud-engine-storage-volume
---
[INFO] Compiling 10 source files to <http://jenkins.buildacloud.org/job/build-4.5-simulator/ws/engine/storage/volume/target/classes>
[INFO] 
[INFO] --- maven-resources-plugin:2.5:testResources (default-testResources) @ cloud-engine-storage-volume
---
[debug] execute contextualize
[INFO] Using 'UTF-8' encoding to copy filtered resources.
[INFO] skip non existing resourceDirectory <http://jenkins.buildacloud.org/job/build-4.5-simulator/ws/engine/storage/volume/test/resources>
[INFO] Copying 3 resources
[INFO] 
[INFO] --- maven-compiler-plugin:2.5.1:testCompile (default-testCompile) @ cloud-engine-storage-volume
---
[INFO] Compiling 5 source files to <http://jenkins.buildacloud.org/job/build-4.5-simulator/ws/engine/storage/volume/target/test-classes>
[INFO] 
[INFO] --- maven-surefire-plugin:2.12:test (default-test) @ cloud-engine-storage-volume ---
[INFO] Tests are skipped.
[INFO]                                                                         
[INFO] ------------------------------------------------------------------------
[INFO] Building Apache CloudStack Engine Storage Image Component 4.5.0-SNAPSHOT
[INFO] ------------------------------------------------------------------------
[INFO] 
[INFO] --- maven-clean-plugin:2.5:clean (default-clean) @ cloud-engine-storage-image ---
[INFO] Deleting <http://jenkins.buildacloud.org/job/build-4.5-simulator/ws/engine/storage/image/target>
(includes = [**/*], excludes = [])
[INFO] Deleting <http://jenkins.buildacloud.org/job/build-4.5-simulator/ws/engine/storage/image>
(includes = [target, dist], excludes = [])
[INFO] 
[INFO] --- maven-checkstyle-plugin:2.11:check (cloudstack-checkstyle) @ cloud-engine-storage-image
---
[INFO] Starting audit...
Audit done.

[INFO] 
[INFO] --- maven-remote-resources-plugin:1.3:process (default) @ cloud-engine-storage-image
---
[INFO] 
[INFO] --- maven-resources-plugin:2.5:resources (default-resources) @ cloud-engine-storage-image
---
[debug] execute contextualize
[INFO] Using 'UTF-8' encoding to copy filtered resources.
[INFO] Copying 1 resource
[INFO] Copying 3 resources
[INFO] 
[INFO] --- maven-compiler-plugin:2.5.1:compile (default-compile) @ cloud-engine-storage-image
---
[INFO] Compiling 6 source files to <http://jenkins.buildacloud.org/job/build-4.5-simulator/ws/engine/storage/image/target/classes>
[INFO] 
[INFO] --- maven-resources-plugin:2.5:testResources (default-testResources) @ cloud-engine-storage-image
---
[debug] execute contextualize
[INFO] Using 'UTF-8' encoding to copy filtered resources.
[INFO] skip non existing resourceDirectory <http://jenkins.buildacloud.org/job/build-4.5-simulator/ws/engine/storage/image/test/resources>
[INFO] Copying 3 resources
[INFO] 
[INFO] --- maven-compiler-plugin:2.5.1:testCompile (default-testCompile) @ cloud-engine-storage-image
---
[INFO] No sources to compile
[INFO] 
[INFO] --- maven-surefire-plugin:2.12:test (default-test) @ cloud-engine-storage-image ---
[INFO] Surefire report directory: <http://jenkins.buildacloud.org/job/build-4.5-simulator/ws/engine/storage/image/target/surefire-reports>

-------------------------------------------------------
 T E S T S
-------------------------------------------------------

Results :

Tests run: 0, Failures: 0, Errors: 0, Skipped: 0

[INFO]                                                                         
[INFO] ------------------------------------------------------------------------
[INFO] Building Apache CloudStack Engine Storage Snapshot Component 4.5.0-SNAPSHOT
[INFO] ------------------------------------------------------------------------
[INFO] 
[INFO] --- maven-clean-plugin:2.5:clean (default-clean) @ cloud-engine-storage-snapshot ---
[INFO] Deleting <http://jenkins.buildacloud.org/job/build-4.5-simulator/ws/engine/storage/snapshot/target>
(includes = [**/*], excludes = [])
[INFO] Deleting <http://jenkins.buildacloud.org/job/build-4.5-simulator/ws/engine/storage/snapshot>
(includes = [target, dist], excludes = [])
[INFO] 
[INFO] --- maven-checkstyle-plugin:2.11:check (cloudstack-checkstyle) @ cloud-engine-storage-snapshot
---
[INFO] Starting audit...
Audit done.

[INFO] 
[INFO] --- maven-remote-resources-plugin:1.3:process (default) @ cloud-engine-storage-snapshot
---
[INFO] 
[INFO] --- maven-resources-plugin:2.5:resources (default-resources) @ cloud-engine-storage-snapshot
---
[debug] execute contextualize
[INFO] Using 'UTF-8' encoding to copy filtered resources.
[INFO] Copying 2 resources
[INFO] Copying 3 resources
[INFO] 
[INFO] --- maven-compiler-plugin:2.5.1:compile (default-compile) @ cloud-engine-storage-snapshot
---
[INFO] Compiling 8 source files to <http://jenkins.buildacloud.org/job/build-4.5-simulator/ws/engine/storage/snapshot/target/classes>
[INFO] 
[INFO] --- maven-resources-plugin:2.5:testResources (default-testResources) @ cloud-engine-storage-snapshot
---
[debug] execute contextualize
[INFO] Using 'UTF-8' encoding to copy filtered resources.
[INFO] Copying 2 resources
[INFO] Copying 3 resources
[INFO] 
[INFO] --- maven-compiler-plugin:2.5.1:testCompile (default-testCompile) @ cloud-engine-storage-snapshot
---
[INFO] Compiling 2 source files to <http://jenkins.buildacloud.org/job/build-4.5-simulator/ws/engine/storage/snapshot/target/test-classes>
Build timed out (after 11 minutes). Marking the build as failed.
Build was aborted
Recording test results
[INFO] ------------------------------------------------------------------------
[INFO] Reactor Summary:
[INFO] 
[INFO] Apache CloudStack Developer Tools - Checkstyle Configuration  SUCCESS [4.984s]
[INFO] Apache CloudStack ................................. SUCCESS [5.059s]
[INFO] Apache CloudStack Maven Conventions Parent ........ SUCCESS [7.223s]
[INFO] Apache CloudStack Framework - Managed Context ..... SUCCESS [16.829s]
[INFO] Apache CloudStack Utils ........................... SUCCESS [1:04.505s]
[INFO] Apache CloudStack Framework ....................... SUCCESS [0.277s]
[INFO] Apache CloudStack Framework - Event Notification .. SUCCESS [36.041s]
[INFO] Apache CloudStack Framework - Configuration ....... SUCCESS [22.811s]
[INFO] Apache CloudStack API ............................. SUCCESS [1:10.116s]
[INFO] Apache CloudStack Framework - REST ................ SUCCESS [15.673s]
[INFO] Apache CloudStack Framework - IPC ................. SUCCESS [22.917s]
[INFO] Apache CloudStack Cloud Engine .................... SUCCESS [0.113s]
[INFO] Apache CloudStack Cloud Engine API ................ SUCCESS [19.401s]
[INFO] Apache CloudStack Framework - Security ............ SUCCESS [10.948s]
[INFO] Apache CloudStack Core ............................ SUCCESS [46.597s]
[INFO] Apache CloudStack Agents .......................... SUCCESS [27.928s]
[INFO] Apache CloudStack Framework - Clustering .......... SUCCESS [13.663s]
[INFO] Apache CloudStack Framework - Event Notification .. SUCCESS [8.160s]
[INFO] Apache CloudStack Cloud Engine Schema Component ... SUCCESS [59.257s]
[INFO] Apache CloudStack Framework - Jobs ................ SUCCESS [24.064s]
[INFO] Apache CloudStack Cloud Engine Internal Components API  SUCCESS [12.115s]
[INFO] Apache CloudStack Server .......................... SUCCESS [1:35.590s]
[INFO] Apache CloudStack Cloud Services .................. SUCCESS [0.177s]
[INFO] Apache CloudStack Secondary Storage ............... SUCCESS [1.592s]
[INFO] Apache CloudStack Secondary Storage Service ....... SUCCESS [28.126s]
[INFO] Apache CloudStack Engine Storage Component ........ SUCCESS [32.580s]
[INFO] Apache CloudStack Engine Storage Volume Component . SUCCESS [16.489s]
[INFO] Apache CloudStack Engine Storage Image Component .. SUCCESS [11.374s]
[INFO] Apache CloudStack Engine Storage Snapshot Component  FAILURE [13.928s]
[INFO] Apache CloudStack Plugin POM ...................... SKIPPED
[INFO] Apache CloudStack Plugin - Hypervisor Simulator ... SKIPPED
[INFO] ------------------------------------------------------------------------
[INFO] BUILD FAILURE
[INFO] ------------------------------------------------------------------------
[INFO] Total time: 11:39.741s
[INFO] Finished at: Mon Dec 15 12:51:05 CET 2014
[INFO] Final Memory: 56M/383M
[INFO] ------------------------------------------------------------------------
[ERROR] Failed to execute goal org.apache.maven.plugins:maven-compiler-plugin:2.5.1:testCompile
(default-testCompile) on project cloud-engine-storage-snapshot: Fatal error compiling: Unknown
error trying to execute the external compiler:
[ERROR] /bin/sh -c cd <http://jenkins.buildacloud.org/job/build-4.5-simulator/ws/engine/storage/snapshot>
&& /usr/lib/jvm/java-1.7.0-openjdk-1.7.0.25.x86_64/jre/../bin/javac @/tmp/org.codehaus.plexus.compiler.javac.JavacCompiler410279735506893506arguments
-J-Xmx512m -J-Xms128m
[ERROR] -> [Help 1]
[ERROR] 
[ERROR] To see the full stack trace of the errors, re-run Maven with the -e switch.
[ERROR] Re-run Maven using the -X switch to enable full debug logging.
[ERROR] 
[ERROR] For more information about the errors and possible solutions, please read the following
articles:
[ERROR] [Help 1] http://cwiki.apache.org/confluence/display/MAVEN/MojoExecutionException
[ERROR] 
[ERROR] After correcting the problems, you can resume the build with the command
[ERROR]   mvn <goals> -rf :cloud-engine-storage-snapshot

Mime
View raw message