cloudstack-dev mailing list archives

Site index · List index
Message view « Date » · « Thread »
Top « Date » · « Thread »
From jenk...@cloudstack.org
Subject Build failed in Jenkins: build-4.5 #223
Date Thu, 11 Dec 2014 12:33:35 GMT
See <http://jenkins.buildacloud.org/job/build-4.5/223/changes>

Changes:

[talluri] CLOUDSTACK-8062: test_multiple_ip_ranges.py - Fix the test case to avoid using same
vlan IP range in each test case

[talluri] CLOUDSTACK:8018: Fix test_redundant_router.test_redundantVR_internals - The SSH
to router was being done from wrong host

[talluri] CLOUDSTACK:8058: Fix test_reset_ssh_keypair.py for EIP setup

------------------------------------------
[...truncated 19378 lines...]
[INFO] 
[INFO] --- maven-surefire-plugin:2.12:test (default-test) @ cloud-plugin-storage-image-s3
---
[INFO] Surefire report directory: <http://jenkins.buildacloud.org/job/build-4.5/ws/plugins/storage/image/s3/target/surefire-reports>

-------------------------------------------------------
 T E S T S
-------------------------------------------------------
[INFO] 
[INFO] --- maven-resources-plugin:2.5:resources (default-resources) @ cloud-plugin-storage-image-default
---
[debug] execute contextualize
[INFO] Using 'UTF-8' encoding to copy filtered resources.
[INFO] Copying 2 resources
[INFO] Copying 3 resources
[INFO] 
[INFO] --- maven-compiler-plugin:2.5.1:compile (default-compile) @ cloud-plugin-storage-image-default
---
[INFO] Compiling 3 source files to <http://jenkins.buildacloud.org/job/build-4.5/ws/plugins/storage/image/default/target/classes>
log4j:WARN No appenders could be found for logger (com.cloud.network.element.MidoNetElement).
log4j:WARN Please initialize the log4j system properly.
log4j:WARN See http://logging.apache.org/log4j/1.2/faq.html#noconfig for more info.
Tests run: 2, Failures: 0, Errors: 0, Skipped: 0, Time elapsed: 3.377 sec

Results :

Tests run: 2, Failures: 0, Errors: 0, Skipped: 0

[INFO]                                                                         
[INFO] ------------------------------------------------------------------------
[INFO] Building Apache CloudStack Plugin - Storage Image sample provider 4.5.0-SNAPSHOT
[INFO] ------------------------------------------------------------------------
[INFO] 
[INFO] --- maven-clean-plugin:2.5:clean (default-clean) @ cloud-plugin-storage-image-sample
---
[INFO] Deleting <http://jenkins.buildacloud.org/job/build-4.5/ws/plugins/storage/image/sample>
(includes = [target, dist], excludes = [])
[INFO] 
[INFO] --- maven-checkstyle-plugin:2.11:check (cloudstack-checkstyle) @ cloud-plugin-storage-image-sample
---
[INFO] 
[INFO] --- maven-resources-plugin:2.5:testResources (default-testResources) @ cloud-plugin-storage-image-swift
---
[debug] execute contextualize
[INFO] Using 'UTF-8' encoding to copy filtered resources.
[INFO] skip non existing resourceDirectory <http://jenkins.buildacloud.org/job/build-4.5/ws/plugins/storage/image/swift/test/resources>
[INFO] Copying 3 resources
[INFO] 
[INFO] --- maven-compiler-plugin:2.5.1:testCompile (default-testCompile) @ cloud-plugin-storage-image-swift
---
[INFO] No sources to compile
[INFO] 
[INFO] --- maven-surefire-plugin:2.12:test (default-test) @ cloud-plugin-storage-image-swift
---
[INFO] Tests are skipped.

Results :

Tests run: 0, Failures: 0, Errors: 0, Skipped: 0

[INFO] Starting audit...
Audit done.

[INFO] 
[INFO] --- maven-remote-resources-plugin:1.3:process (default) @ cloud-plugin-storage-image-sample
---
[INFO] 
[INFO] --- maven-resources-plugin:2.5:resources (default-resources) @ cloud-plugin-storage-image-sample
---
[debug] execute contextualize
[INFO] Using 'UTF-8' encoding to copy filtered resources.
[INFO] skip non existing resourceDirectory <http://jenkins.buildacloud.org/job/build-4.5/ws/plugins/storage/image/sample/resources>
[INFO] Copying 3 resources
[INFO] 
[INFO] --- maven-compiler-plugin:2.5.1:compile (default-compile) @ cloud-plugin-storage-image-sample
---
[INFO] Compiling 3 source files to <http://jenkins.buildacloud.org/job/build-4.5/ws/plugins/storage/image/sample/target/classes>
Tests run: 4, Failures: 0, Errors: 0, Skipped: 0, Time elapsed: 4.394 sec
Running com.cloud.ha.XenServerFencerTest
Tests run: 1, Failures: 0, Errors: 0, Skipped: 0, Time elapsed: 0.014 sec

Results :

Tests run: 5, Failures: 0, Errors: 0, Skipped: 0

[INFO]                                                                         
[INFO] ------------------------------------------------------------------------
[INFO] Building Apache CloudStack Plugin - Network Juniper Contrail 4.5.0-SNAPSHOT
[INFO] ------------------------------------------------------------------------
[WARNING] The POM for net.juniper.contrail:juniper-contrail-api:jar:1.0-SNAPSHOT is missing,
no dependency information available
[INFO] 
[INFO] --- license-maven-plugin:2.5:check (cloudstack-checklicence) @ cloud-plugin-storage-volume-cloudbyte
---
[INFO] Checking licenses...
[INFO] 
[INFO] --- maven-resources-plugin:2.5:testResources (default-testResources) @ cloud-plugin-storage-volume-cloudbyte
---
[debug] execute contextualize
[INFO] Using 'UTF-8' encoding to copy filtered resources.
[INFO] skip non existing resourceDirectory <http://jenkins.buildacloud.org/job/build-4.5/ws/plugins/storage/volume/cloudbyte/test/resources>
[INFO] Copying 3 resources
[INFO] 
[INFO] --- maven-compiler-plugin:2.5.1:testCompile (default-testCompile) @ cloud-plugin-storage-volume-cloudbyte
---
[INFO] No sources to compile
[INFO] 
[INFO] --- maven-surefire-plugin:2.12:test (default-test) @ cloud-plugin-storage-volume-cloudbyte
---
[INFO] Tests are skipped.
[INFO] 
[INFO] --- maven-resources-plugin:2.5:testResources (default-testResources) @ cloud-plugin-storage-volume-solidfire
---
[debug] execute contextualize
[INFO] Using 'UTF-8' encoding to copy filtered resources.
[INFO] skip non existing resourceDirectory <http://jenkins.buildacloud.org/job/build-4.5/ws/plugins/storage/volume/solidfire/test/resources>
[INFO] Copying 3 resources
[INFO] 
[INFO] --- maven-compiler-plugin:2.5.1:testCompile (default-testCompile) @ cloud-plugin-storage-volume-solidfire
---
[INFO] Compiling 4 source files to <http://jenkins.buildacloud.org/job/build-4.5/ws/plugins/storage/volume/solidfire/target/test-classes>
[INFO] 
[INFO] --- maven-resources-plugin:2.5:testResources (default-testResources) @ cloud-plugin-storage-image-default
---
[debug] execute contextualize
[INFO] Using 'UTF-8' encoding to copy filtered resources.
[INFO] skip non existing resourceDirectory <http://jenkins.buildacloud.org/job/build-4.5/ws/plugins/storage/image/default/test/resources>
[INFO] Copying 3 resources
[INFO] 
[INFO] --- maven-compiler-plugin:2.5.1:testCompile (default-testCompile) @ cloud-plugin-storage-image-default
---
[INFO] No sources to compile
[INFO] 
[INFO] --- maven-surefire-plugin:2.12:test (default-test) @ cloud-plugin-storage-image-default
---
[INFO] Tests are skipped.
[INFO] 
[INFO] --- maven-resources-plugin:2.5:testResources (default-testResources) @ cloud-plugin-storage-image-sample
---
[debug] execute contextualize
[INFO] Using 'UTF-8' encoding to copy filtered resources.
[INFO] skip non existing resourceDirectory <http://jenkins.buildacloud.org/job/build-4.5/ws/plugins/storage/image/sample/test/resources>
[INFO] Copying 3 resources
[INFO] 
[INFO] --- maven-compiler-plugin:2.5.1:testCompile (default-testCompile) @ cloud-plugin-storage-image-sample
---
[INFO] No sources to compile
[INFO] 
[INFO] --- maven-surefire-plugin:2.12:test (default-test) @ cloud-plugin-storage-image-sample
---
[INFO] Tests are skipped.
[INFO] 
[INFO] --- maven-surefire-plugin:2.12:test (default-test) @ cloud-plugin-storage-volume-solidfire
---
[INFO] Tests are skipped.
[INFO] ------------------------------------------------------------------------
[INFO] Reactor Summary:
[INFO] 
[INFO] Apache CloudStack Developer Tools - Checkstyle Configuration  SUCCESS [0.870s]
[INFO] Apache CloudStack ................................. SUCCESS [0.853s]
[INFO] Apache CloudStack Maven Conventions Parent ........ SUCCESS [2.103s]
[INFO] Apache CloudStack Framework - Managed Context ..... SUCCESS [4.122s]
[INFO] Apache CloudStack Utils ........................... SUCCESS [14.127s]
[INFO] Apache CloudStack Framework ....................... SUCCESS [0.167s]
[INFO] Apache CloudStack Framework - Event Notification .. SUCCESS [8.336s]
[INFO] Apache CloudStack Framework - Configuration ....... SUCCESS [3.399s]
[INFO] Apache CloudStack API ............................. SUCCESS [10.630s]
[INFO] Apache CloudStack Framework - REST ................ SUCCESS [6.351s]
[INFO] Apache CloudStack Framework - IPC ................. SUCCESS [3.817s]
[INFO] Apache CloudStack Cloud Engine .................... SUCCESS [0.160s]
[INFO] Apache CloudStack Cloud Engine API ................ SUCCESS [4.165s]
[INFO] Apache CloudStack Framework - Security ............ SUCCESS [2.498s]
[INFO] Apache CloudStack Core ............................ SUCCESS [10.226s]
[INFO] Apache CloudStack Agents .......................... SUCCESS [5.395s]
[INFO] Apache CloudStack Framework - Clustering .......... SUCCESS [2.977s]
[INFO] Apache CloudStack Framework - Event Notification .. SUCCESS [3.061s]
[INFO] Apache CloudStack Cloud Engine Schema Component ... SUCCESS [12.590s]
[INFO] Apache CloudStack Framework - Jobs ................ SUCCESS [4.651s]
[INFO] Apache CloudStack Cloud Engine Internal Components API  SUCCESS [2.560s]
[INFO] Apache CloudStack Server .......................... SUCCESS [35.258s]
[INFO] Apache CloudStack Usage Server .................... SUCCESS [9.086s]
[INFO] Apache CloudStack Cloud Engine Orchestration Component  SUCCESS [10.424s]
[INFO] Apache CloudStack Cloud Services .................. SUCCESS [0.158s]
[INFO] Apache CloudStack Secondary Storage ............... SUCCESS [3.413s]
[INFO] Apache CloudStack Secondary Storage Service ....... SUCCESS [13.058s]
[INFO] Apache CloudStack Engine Storage Component ........ SUCCESS [15.444s]
[INFO] Apache CloudStack Engine Storage Volume Component . SUCCESS [12.810s]
[INFO] Apache CloudStack Engine Storage Image Component .. SUCCESS [9.049s]
[INFO] Apache CloudStack Engine Storage Data Motion Component  SUCCESS [8.716s]
[INFO] Apache CloudStack Engine Storage Cache Component .. SUCCESS [7.845s]
[INFO] Apache CloudStack Engine Storage Snapshot Component  SUCCESS [20.885s]
[INFO] Apache CloudStack Cloud Engine API ................ SUCCESS [3.324s]
[INFO] Apache CloudStack Cloud Engine Service ............ SUCCESS [3.097s]
[INFO] Apache CloudStack Plugin POM ...................... SUCCESS [0.415s]
[INFO] Apache CloudStack Plugin - API Rate Limit ......... SUCCESS [20.628s]
[INFO] Apache CloudStack Plugin - Storage Volume default provider  SUCCESS [7.740s]
[INFO] Apache CloudStack Plugin - Storage Volume SolidFire Provider  SUCCESS [12.384s]
[INFO] Apache CloudStack Plugin - API SolidFire .......... SKIPPED
[INFO] Apache CloudStack Plugin - API Discovery .......... SUCCESS [13.450s]
[INFO] Apache CloudStack Plugin - ACL Static Role Based .. SUCCESS [7.632s]
[INFO] Apache CloudStack Plugin - Host Anti-Affinity Processor  SUCCESS [8.660s]
[INFO] Apache CloudStack Plugin - Explicit Dedication Processor  SUCCESS [7.743s]
[INFO] Apache CloudStack Plugin - User Concentrated Pod Deployment Planner  SUCCESS [8.701s]
[INFO] Apache CloudStack Plugin - User Dispersing Deployment Planner  SUCCESS [6.917s]
[INFO] Apache CloudStack Plugin - Implicit Dedication Planner  SUCCESS [22.987s]
[INFO] Apache CloudStack Plugin - Skip Heurestics Planner  SUCCESS [6.614s]
[INFO] Apache CloudStack Plugin - Host Allocator Random .. SUCCESS [7.731s]
[INFO] Apache CloudStack Plugin - Dedicated Resources .... SUCCESS [21.264s]
[INFO] Apache CloudStack Plugin - Hypervisor OracleVM .... SUCCESS [10.190s]
[INFO] Apache CloudStack Plugin - Open vSwitch ........... SUCCESS [10.380s]
[INFO] Apache CloudStack Plugin - Hypervisor XenServer ... SUCCESS [26.331s]
[INFO] Apache CloudStack Plugin - Hypervisor KVM ......... SUCCESS [20.595s]
[INFO] Apache CloudStack Plugin - RabbitMQ Event Bus ..... SUCCESS [6.369s]
[INFO] Apache CloudStack Plugin - In Memory Event Bus .... SUCCESS [11.348s]
[INFO] Apache CloudStack Plugin - Hypervisor Baremetal ... SUCCESS [12.710s]
[INFO] Apache CloudStack Plugin - Hypervisor UCS ......... SUCCESS [9.334s]
[INFO] Apache CloudStack Plugin - Hypervisor Hyper-V ..... SUCCESS [18.172s]
[INFO] Apache CloudStack Plugin - Network Elastic Load Balancer  SUCCESS [18.974s]
[INFO] Apache CloudStack Plugin - Network Internal Load Balancer  SUCCESS [29.352s]
[INFO] Apache CloudStack Framework - Spring Life Cycle ... SUCCESS [2.209s]
[INFO] Apache CloudStack Plugin - Network Juniper Contrail  FAILURE [0.065s]
[INFO] Apache CloudStack Plugin - Palo Alto .............. SUCCESS [24.596s]
[INFO] Apache CloudStack Plugin - Network Netscaler ...... SUCCESS [13.143s]
[INFO] Apache CloudStack Plugin - Network Nicira NVP ..... SUCCESS [27.414s]
[INFO] Apache CloudStack Plugin - BigSwitch Virtual Network Segment  SUCCESS [20.009s]
[INFO] Apache CloudStack Plugin - Network Brocade VCS .... SUCCESS [28.284s]
[INFO] Apache CloudStack Plugin - Midokura Midonet ....... SUCCESS [19.919s]
[INFO] Apache CloudStack Plugin - Stratosphere SSP ....... SUCCESS [19.977s]
[INFO] Apache CloudStack Plugin - Network Opendaylight ... SUCCESS [18.874s]
[INFO] Apache CloudStack Plugin - Storage Allocator Random  SUCCESS [6.811s]
[INFO] Apache CloudStack Plugin - User Authenticator LDAP  SUCCESS [11.780s]
[INFO] Apache CloudStack Plugin - User Authenticator MD5 . SUCCESS [14.085s]
[INFO] Apache CloudStack Plugin - User Authenticator Plain Text  SUCCESS [7.268s]
[INFO] Apache CloudStack Plugin - User Authenticator SAML2  SUCCESS [28.661s]
[INFO] Apache CloudStack Plugin - User Authenticator SHA256 Salted  SUCCESS [15.153s]
[INFO] Apache CloudStack Plugin - Dns Notifier Example ... SUCCESS [5.893s]
[INFO] Apache CloudStack Plugin - Storage Image S3 ....... SUCCESS [7.420s]
[INFO] Apache CloudStack Plugin - Storage Image Swift provider  SUCCESS [6.693s]
[INFO] Apache CloudStack Plugin - Storage Image default provider  SUCCESS [5.596s]
[INFO] Apache CloudStack Plugin - Storage Image sample provider  SUCCESS [4.028s]
[INFO] Apache CloudStack Plugin - Storage Volume Nexenta Provider  SUCCESS [12.802s]
[INFO] Apache CloudStack Plugin - Storage Volume CloudByte Provider  SUCCESS [9.934s]
[INFO] Apache CloudStack Plugin - Storage Volume sample provider  SUCCESS [7.160s]
[INFO] Apache CloudStack Plugin - SNMP Alerts ............ SUCCESS [13.962s]
[INFO] Apache CloudStack Plugin - Syslog Alerts .......... SUCCESS [11.815s]
[INFO] Apache CloudStack Plugin - Network VXLAN .......... SUCCESS [14.616s]
[INFO] Apache CloudStack Plugin - GloboDNS ............... SUCCESS [19.039s]
[INFO] Apache CloudStack Framework - Spring Module ....... SUCCESS [8.318s]
[INFO] Apache CloudStack Secondary Storage Controller .... SUCCESS [8.518s]
[INFO] Apache CloudStack Console Proxy - RDP Client ...... SUCCESS [12.641s]
[INFO] Apache CloudStack Console Proxy ................... SUCCESS [3.415s]
[INFO] Apache CloudStack Console Proxy - Server .......... SUCCESS [6.842s]
[INFO] Apache CloudStack System VM ....................... SUCCESS [2.082s]
[INFO] Apache CloudStack Client UI ....................... SKIPPED
[INFO] Apache CloudStack Framework - QuickCloud .......... SUCCESS [1.478s]
[INFO] Apache CloudStack AWS API Bridge .................. SKIPPED
[INFO] ------------------------------------------------------------------------
[INFO] BUILD FAILURE
[INFO] ------------------------------------------------------------------------
[INFO] Total time: 3:44.598s (Wall Clock)
[INFO] Finished at: Thu Dec 11 13:33:21 CET 2014
[INFO] Final Memory: 79M/457M
[INFO] ------------------------------------------------------------------------
[ERROR] Failed to execute goal on project cloud-plugin-network-contrail: Could not resolve
dependencies for project org.apache.cloudstack:cloud-plugin-network-contrail:jar:4.5.0-SNAPSHOT:
Failure to find net.juniper.contrail:juniper-contrail-api:jar:1.0-SNAPSHOT in http://juniper.github.io/contrail-maven/snapshots
was cached in the local repository, resolution will not be reattempted until the update interval
of juniper-contrail has elapsed or updates are forced -> [Help 1]
[ERROR] 
[ERROR] To see the full stack trace of the errors, re-run Maven with the -e switch.
[ERROR] Re-run Maven using the -X switch to enable full debug logging.
[ERROR] 
[ERROR] For more information about the errors and possible solutions, please read the following
articles:
[ERROR] [Help 1] http://cwiki.apache.org/confluence/display/MAVEN/DependencyResolutionException
[ERROR] 
[ERROR] After correcting the problems, you can resume the build with the command
[ERROR]   mvn <goals> -rf :cloud-plugin-network-contrail
Build step 'Invoke top-level Maven targets' marked build as failure
Recording test results

Mime
View raw message